{"text_format":"1","workbook":"xlsx","n_sheets":23,"sheets":["Instructions (START HERE)","Lunch Recipe Calculator","CostPerServing","Fruit & Veg Bar","Lunch Menu","Lunch Menu 2","Lunch Menu 3","Lunch Menu 4","Breakfast Recipe Calculator","Breakfast Menu","Breakfast Menu 2","Breakfast Menu 3","Breakfast Menu 4","Breakfast Menu 5","Breakfast Menu 6","A La Carte","Compliance","Supporting Invoices","Sales Reports","Revenue Reports Deposits","Ala Cart Price Instructions","Ala Cart Pricing","Data"],"not_rendered":{"charts":0,"images":38,"macros":1,"external_links":1,"defined_names":52,"comments":2,"pivot_tables":0},"unopened":[],"bounds":{"document_bytes":16777216,"sheet_cells":100000,"rows_first":2000,"rows_last":500,"rows_between":2000,"halvings":0,"cell_chars":16384,"cell_head_chars":4096},"cells_cut":0,"cells_raw":0,"read":"whole","date_system":"1900"}

{"sheet":"Instructions (START HERE)","index":0,"n_rows":61,"n_cols":9,"rows_kept":61,"cut":false,"hidden":false,"merged":[[40,1,40,9],[46,2,47,6],[46,7,47,9],[42,7,45,9],[1,2,1,9],[44,1,51,1],[43,2,43,6],[0,1,0,9],[3,1,5,7],[39,1,39,9],[6,1,6,9],[16,1,16,9],[26,1,26,9],[2,1,2,9],[29,1,29,9],[37,1,37,9],[35,1,35,9],[36,1,36,9],[32,1,32,9],[30,1,31,9],[33,1,33,9],[34,1,34,9],[62,0,416,9],[48,7,51,9],[54,1,61,1],[54,7,61,9],[28,1,28,9],[48,2,49,6],[56,2,57,6],[60,2,61,6],[58,2,59,6],[54,2,55,6],[38,1,38,9],[53,1,53,9],[52,2,52,6],[44,2,45,6],[50,2,51,6],[42,2,42,6]]}
[null,"                        NPF Cost Revenue Workbook"]
[null,"Sponsor Name: "]
[false,"Background:"]
[null,"This tool focuses on nonprogram food costs as a percent of total food costs district-wide in an effort to streamline the requirements under 7 CFR. 210.14(f). This simplified approach allows us to calculate 5 consecutive operating days (or 4 consecutive days for schools that operate on a 4-day school week) for all menus and grade levels for the district. For additional background information, please see SP 20-2016. \n\nThis Excel worksheet was adapted and developed with courtsey from the Idaho State Department of Educations NPFRT Child Nutrition Division. ",null,null,null,null,null,null,"SP 20-2016"]
[]
[]
[false,"Determine How Many Menus Need to be Completed:"]
[]
[false,"K-5 Lunch Menu",null,null,"K-5 Breakfast Menu",null,"You will need to complete",{"$f":"COUNTIF(A9:A12,TRUE)","v":0}," lunch menu(s)."]
[false,"K-8 Lunch Menu",null,null,"K-8 Breakfast Menu",null,"You will need to complete",{"$f":"COUNTIF(A14:A21,TRUE)","v":0}," breakfast menu(s)."]
{"$rows_left_out":52}
{"sheet":"Lunch Recipe Calculator","index":1,"n_rows":419,"n_cols":7,"rows_kept":419,"cut":false,"hidden":false,"merged":[[0,0,0,6],[8,0,23,0]]}
["Lunch Recipe Calculator"]
["Sponsor Name: ",{"$f":"IF('Instructions (START HERE)'!C2=\"\",\"\",'Instructions (START HERE)'!C2)","v":""}]
[]
["Recipe Name:",null,null,null,"Recipe Yield:"]
[]
[null,"Ingredient(s):","Purchase Unit \n(lb, box, canister)","Number of Items \nper Purchase Unit\n(e.g. 6 cans in a case)","Purchase \nUnit Cost","Number of Items Used in Recipe\n(e.g. 2 cans)","Cost per Portion"]
["Example","Cheese","lb",40,41.18,3.5,{"$f":"IFERROR(IF(F7=0,0,E7/D7*F7),0)","v":3.6032500000000001}]
[null,null,null,null,0,null,{"$f":"IFERROR(IF(F8=0,0,E8/D8*F8),0)","v":0}]
["Begin by entering the recipe name and number of servings (yeild)\nTo calculate the cost of a recipe:\n1. List ingredient(s)\n2. Enter the purchase unit \n3. Enter the number of bags, or cans that come in each purchase unit\n4. Cost of the purchase unit\n5. Enter the amount of unit items that will be used  ",null,null,null,0,null,0]
[null,null,null,null,0,null,{"$f":"IFERROR(IF(F10=0,0,E10/D10*F10),0)","v":0}]
{"$rows_left_out":410}
{"sheet":"CostPerServing","index":2,"n_rows":221,"n_cols":5,"rows_kept":221,"cut":false,"hidden":false,"merged":[[0,0,0,3]]}
["Cost per Serving Calculation"]
["Item","Purchase Unit","Purchase Price","Number of Servings per Purchase Unit","Cost per Serving "]
["Example: Hamburger Patties","Case",220.77,291,{"$f":"C3/D3","v":0.75865979381443305}]
[null,null,null,null,{"$f":"Table2[[#This Row],[Purchase Price]]/Table2[[#This Row],[Number of Servings per Purchase Unit]]","v":{"$error":"#DIV/0!"}}]
[null,null,null,null,{"$f":"Table2[[#This Row],[Purchase Price]]/Table2[[#This Row],[Number of Servings per Purchase Unit]]","v":{"$error":"#DIV/0!"}}]
[null,null,null,null,{"$f":"Table2[[#This Row],[Purchase Price]]/Table2[[#This Row],[Number of Servings per Purchase Unit]]","v":{"$error":"#DIV/0!"}}]
[null,null,null,null,{"$f":"Table2[[#This Row],[Purchase Price]]/Table2[[#This Row],[Number of Servings per Purchase Unit]]","v":{"$error":"#DIV/0!"}}]
[null,null,null,null,{"$f":"Table2[[#This Row],[Purchase Price]]/Table2[[#This Row],[Number of Servings per Purchase Unit]]","v":{"$error":"#DIV/0!"}}]
[null,null,null,null,{"$f":"Table2[[#This Row],[Purchase Price]]/Table2[[#This Row],[Number of Servings per Purchase Unit]]","v":{"$error":"#DIV/0!"}}]
[null,null,null,null,{"$f":"Table2[[#This Row],[Purchase Price]]/Table2[[#This Row],[Number of Servings per Purchase Unit]]","v":{"$error":"#DIV/0!"}}]
{"$rows_left_out":212}
{"sheet":"Fruit & Veg Bar","index":3,"n_rows":71,"n_cols":7,"rows_kept":71,"cut":false,"hidden":false,"merged":[[54,0,65,0],[31,0,42,0],[0,0,0,6],[3,3,3,4],[26,3,26,4],[49,3,49,4],[9,0,19,0]]}
["Fruit and Vegetable Bar"]
["Sponsor Name: ",{"$f":"IF('Instructions (START HERE)'!C2=\"\",\"\",'Instructions (START HERE)'!C2)","v":""}]
[]
["Salad Bar K-5","Days of the Week ",{"$f":"G25","v":{"$error":"#DIV/0!"}},"Planned Number of Servings: "]
[null,"Ingredient(s):","Purchase Unit \n(lb, box, canister)","Number of Items \nper Purchase Unit\n(e.g. 6 cans in a case)","Purchase \nUnit Cost","Number of Items Used in Recipe\n(e.g. 2 cans)","Cost per Portion"]
["Example","Chopped Romaine","lb",6,15.31,8,{"$f":"IFERROR(IF(F6=0,0,E6/D6*F6),0)","v":20.413333333333334}]
[null,null,null,null,null,null,{"$f":"IFERROR(IF(F7=0,0,E7/D7*F7),0)","v":0}]
[null,null,null,null,null,null,0]
[null,null,null,null,null,null,0]
["Use two days of salad bar offerings for each grade group. The total planned number of servings reflect  both days. Indicate dates in the green box next to the grade group. \n**include extras such as salad dressing or croutons even if they are not included as a part of the reimbursable meal.",null,null,null,null,null,0]
{"$rows_left_out":62}
{"sheet":"Lunch Menu","index":4,"n_rows":284,"n_cols":9,"rows_kept":284,"cut":false,"hidden":false,"merged":[[228,0,228,8],[230,1,230,5],[241,1,241,5],[128,1,128,5],[139,1,139,5],[177,0,177,8],[179,1,179,5],[190,1,190,5],[0,0,0,8],[24,0,24,8],[14,0,14,1],[13,0,13,6],[5,0,5,1],[1,1,1,8],[3,3,3,5],[126,0,126,8],[26,1,26,5],[37,1,37,5],[77,1,77,5],[75,0,75,8],[88,1,88,5]]}
["Lunch Menu Costing Worksheet"]
["Select Grade Level: "]
["Sponsor Name: ",{"$f":"IF('Instructions (START HERE)'!C2=\"\",\"\",'Instructions (START HERE)'!C2)","v":""}]
["Week Selected for Review: ",null,"Site: "]
[]
["Average Cost of Milk Calculator"]
["Types of Milk Served:","Cost per Unit:",null,null,null,"Cost","Revenue","# Served"]
["Non-fat Milk ",0,null,null,"Adult",{"$f":"SUM(H22:H23)","v":0},{"$f":"SUM(I22:I23)","v":0}]
["Non-fat Flavored Milk ",0,null,null,"Student",{"$f":"SUM(H16:H21)","v":0},{"$f":"SUM(I16:I21)","v":0}]
["1% Milk ",0,null,null,"Reim. Meals",{"$f":"SUM(H16,H19,H20,H21)","v":0},{"$f":"SUM(I16,I19:I21)","v":0},{"$f":"SUM(C16:G16,C19:G21)","v":0}]
{"$rows_left_out":275}
{"sheet":"Lunch Menu 2","index":5,"n_rows":280,"n_cols":9,"rows_kept":280,"cut":false,"hidden":true,"merged":[[226,1,226,5],[237,1,237,5],[126,1,126,5],[137,1,137,5],[174,0,174,8],[176,1,176,5],[187,1,187,5],[224,0,224,8],[124,0,124,8],[0,0,0,8],[1,1,1,8],[5,0,5,1],[13,0,13,6],[14,0,14,1],[24,0,24,8],[26,1,26,5],[37,1,37,5],[74,0,74,8],[76,1,76,5],[87,1,87,5],[3,3,3,5]]}
["Lunch Menu Costing Worksheet"]
["Select Grade Level: "]
["Sponsor Name: ",{"$f":"IF('Instructions (START HERE)'!C2=\"\",\"\",'Instructions (START HERE)'!C2)","v":""}]
["Week Selected for Review: ",{"$f":"'Lunch Menu'!B4","v":0},"Site: "]
[]
["Average Cost of Milk Calculator"]
["Types of Milk Served:","Cost per Unit:",null,null,null,"Cost","Revenue","No. Served"]
["Non-fat Milk ",{"$f":"Non_fat_Milk","v":0},null,null,"Adult",{"$f":"SUM(H22:H23)","v":0},{"$f":"SUM(I22:I23)","v":0}]
["Non-fat Flavored Milk ",{"$f":"NonFatFlavor","v":0},null,null,"Student",{"$f":"SUM(H16:H21)","v":0},{"$f":"SUM(I16:I21)","v":0}]
["1% Milk ",{"$f":"Milk1","v":0},null,null,"Reim. Meals",{"$f":"SUM(H16,H19,H20,H21)","v":0},{"$f":"SUM(I16,I19:I21)","v":0},{"$f":"SUM(C16:G16,C19:G21)","v":0}]
{"$rows_left_out":271}
{"sheet":"Lunch Menu 3","index":6,"n_rows":280,"n_cols":9,"rows_kept":280,"cut":false,"hidden":true,"merged":[[226,1,226,5],[237,1,237,5],[126,1,126,5],[137,1,137,5],[174,0,174,8],[176,1,176,5],[187,1,187,5],[224,0,224,8],[124,0,124,8],[0,0,0,8],[1,1,1,8],[5,0,5,1],[13,0,13,6],[14,0,14,1],[24,0,24,8],[26,1,26,5],[37,1,37,5],[74,0,74,8],[76,1,76,5],[87,1,87,5],[3,3,3,5]]}
["Lunch Menu Costing Worksheet"]
["Select Grade Level: "]
["Sponsor Name: ",{"$f":"IF('Instructions (START HERE)'!C2=\"\",\"\",'Instructions (START HERE)'!C2)","v":""}]
["Week Selected for Review: ",{"$f":"'Lunch Menu'!B4","v":0},"Site: "]
[]
["Average Cost of Milk Calculator"]
["Types of Milk Served:","Cost per Unit:",null,null,null,"Cost","Revenue","No. Served"]
["Non-fat Milk ",{"$f":"Non_fat_Milk","v":0},null,null,"Adult",{"$f":"SUM(H22:H23)","v":0},{"$f":"SUM(I22:I23)","v":0}]
["Non-fat Flavored Milk ",{"$f":"NonFatFlavor","v":0},null,null,"Student",{"$f":"SUM(H16:H21)","v":0},{"$f":"SUM(I16:I21)","v":0}]
["1% Milk ",{"$f":"Milk1","v":0},null,null,"Reim. Meals",{"$f":"SUM(H16,H19,H20,H21)","v":0},{"$f":"SUM(I16,I19:I21)","v":0},{"$f":"SUM(C16:G16,C19:G21)","v":0}]
{"$rows_left_out":271}
{"sheet":"Lunch Menu 4","index":7,"n_rows":279,"n_cols":9,"rows_kept":279,"cut":false,"hidden":true,"merged":[[226,1,226,5],[237,1,237,5],[126,1,126,5],[137,1,137,5],[174,0,174,8],[176,1,176,5],[187,1,187,5],[224,0,224,8],[124,0,124,8],[0,0,0,8],[1,1,1,8],[5,0,5,1],[13,0,13,6],[14,0,14,1],[24,0,24,8],[26,1,26,5],[37,1,37,5],[74,0,74,8],[76,1,76,5],[87,1,87,5],[3,3,3,5]]}
["Lunch Menu Costing Worksheet"]
["Select Grade Level: "]
["Sponsor Name: ",{"$f":"IF('Instructions (START HERE)'!C2=\"\",\"\",'Instructions (START HERE)'!C2)","v":""}]
["Week Selected for Review: ",{"$f":"'Lunch Menu'!B4","v":0},"Site: "]
[]
["Average Cost of Milk Calculator"]
["Types of Milk Served:","Cost per Unit:",null,null,null,"Cost","Revenue","No. Served"]
["Non-fat Milk ",{"$f":"Non_fat_Milk","v":0},null,null,"Adult",{"$f":"SUM(H22:H23)","v":0},{"$f":"SUM(I22:I23)","v":0}]
["Non-fat Flavored Milk ",{"$f":"NonFatFlavor","v":0},null,null,"Student",{"$f":"SUM(H16:H21)","v":0},{"$f":"SUM(I16:I21)","v":0}]
["1% Milk ",{"$f":"Milk1","v":0},null,null,"Reim. Meals",{"$f":"SUM(H16,H19,H20,H21)","v":0},{"$f":"SUM(I16,I19:I21)","v":0},{"$f":"SUM(C16:G16,C19:G21)","v":0}]
{"$rows_left_out":270}
{"sheet":"Breakfast Recipe Calculator","index":8,"n_rows":424,"n_cols":7,"rows_kept":424,"cut":false,"hidden":false,"merged":[[0,0,0,6],[406,0,406,8],[402,1,403,4]]}
["Breakfast Recipe Calculator "]
["Sponsor Name: ",{"$f":"IF('Instructions (START HERE)'!C2=\"\",\"\",'Instructions (START HERE)'!C2)","v":""}]
[]
["Recipe Name:",null,null,null,"Recipe Yield:"]
[]
[null,"Ingredient(s):","Purchase Unit \n(lb, box, canister)","Number of Items \nper Purchase Unit\n(e.g. 6 cans in a case)","Purchase \nUnit Cost","Number of Items Used in Recipe\n(e.g. 2 cans)","Cost per Portion"]
["Example","Cheese","lb",40,41.18,3.5,{"$f":"IFERROR(IF(F7=0,0,E7/D7*F7),0)","v":3.6032500000000001}]
[null,null,null,null,null,null,{"$f":"IFERROR(IF(F8=0,0,E8/D8*F8),0)","v":0}]
[null,null,null,null,null,null,0]
[null,null,null,null,null,null,{"$f":"IFERROR(IF(F10=0,0,E10/D10*F10),0)","v":0}]
{"$rows_left_out":415}
{"sheet":"Breakfast Menu","index":9,"n_rows":223,"n_cols":9,"rows_kept":223,"cut":false,"hidden":false,"merged":[[182,1,182,5],[193,1,193,5],[104,1,104,5],[115,1,115,5],[141,0,141,8],[143,1,143,5],[154,1,154,5],[180,0,180,8],[102,0,102,8],[0,0,0,8],[1,1,1,8],[5,0,5,1],[13,0,13,6],[14,0,14,1],[24,0,24,8],[26,1,26,5],[37,1,37,5],[63,0,63,8],[65,1,65,5],[76,1,76,5],[3,3,3,5]]}
["Breakfast Menu Costing Worksheet"]
["Select Grade Level: "]
["Sponsor Name: ",{"$f":"IF('Instructions (START HERE)'!C2=\"\",\"\",'Instructions (START HERE)'!C2)","v":""}]
["Week Selected for Review: ",{"$f":"'Lunch Menu'!B4","v":0},"Site: "]
[]
["Average Cost of Milk Calculator"]
["Types of Milk Served:","Cost per Unit:",null,null,null,"Cost","Revenue","No. Served"]
["Non-fat Milk ",{"$f":"Non_fat_Milk","v":0},null,null,"Adult",{"$f":"SUM(H22:H23)","v":0},{"$f":"SUM(I22:I23)","v":0}]
["Non-fat Flavored Milk ",{"$f":"NonFatFlavor","v":0},null,null,"Student",{"$f":"SUM(H16:H21)","v":0},{"$f":"SUM(I16:I21)","v":0}]
["1% Milk ",{"$f":"Milk1","v":0},null,null,"Reim. Meals",{"$f":"SUM(H16,H19,H20,H21)","v":0},{"$f":"SUM(I16,I19:I21)","v":0},{"$f":"SUM(C16:G16,C19:G21)","v":0}]
{"$rows_left_out":214}
{"sheet":"Breakfast Menu 2","index":10,"n_rows":223,"n_cols":9,"rows_kept":223,"cut":false,"hidden":true,"merged":[[182,1,182,5],[193,1,193,5],[104,1,104,5],[115,1,115,5],[141,0,141,8],[143,1,143,5],[154,1,154,5],[180,0,180,8],[102,0,102,8],[0,0,0,8],[1,1,1,8],[5,0,5,1],[13,0,13,6],[14,0,14,1],[24,0,24,8],[26,1,26,5],[37,1,37,5],[63,0,63,8],[65,1,65,5],[76,1,76,5],[3,3,3,5]]}
["Breakfast Menu Costing Worksheet"]
["Select Grade Level: "]
["Sponsor Name: ",{"$f":"IF('Instructions (START HERE)'!C2=\"\",\"\",'Instructions (START HERE)'!C2)","v":""}]
["Week Selected for Review: ",{"$f":"'Lunch Menu'!B4","v":0},"Site: "]
[]
["Average Cost of Milk Calculator"]
["Types of Milk Served:","Cost per Unit:",null,null,null,"Cost","Revenue","No. Served"]
["Non-fat Milk ",{"$f":"Non_fat_Milk","v":0},null,null,"Adult",{"$f":"SUM(H22:H23)","v":0},{"$f":"SUM(I22:I23)","v":0}]
["Non-fat Flavored Milk ",{"$f":"NonFatFlavor","v":0},null,null,"Student",{"$f":"SUM(H16:H21)","v":0},{"$f":"SUM(I16:I21)","v":0}]
["1% Milk ",{"$f":"Milk1","v":0},null,null,"Reim. Meals",{"$f":"SUM(H16,H19,H20,H21)","v":0},{"$f":"SUM(I16,I19:I21)","v":0},{"$f":"SUM(C16:G16,C19:G21)","v":0}]
{"$rows_left_out":214}
{"sheet":"Breakfast Menu 3","index":11,"n_rows":223,"n_cols":9,"rows_kept":223,"cut":false,"hidden":true,"merged":[[182,1,182,5],[193,1,193,5],[104,1,104,5],[115,1,115,5],[141,0,141,8],[143,1,143,5],[154,1,154,5],[180,0,180,8],[102,0,102,8],[0,0,0,8],[1,1,1,8],[5,0,5,1],[13,0,13,6],[14,0,14,1],[24,0,24,8],[26,1,26,5],[37,1,37,5],[63,0,63,8],[65,1,65,5],[76,1,76,5],[3,3,3,5]]}
["Breakfast Menu Costing Worksheet"]
["Select Grade Level: "]
["Sponsor Name: ",{"$f":"IF('Instructions (START HERE)'!C2=\"\",\"\",'Instructions (START HERE)'!C2)","v":""}]
["Week Selected for Review: ",{"$f":"'Lunch Menu'!B4","v":0},"Site: "]
[]
["Average Cost of Milk Calculator"]
["Types of Milk Served:","Cost per Unit:",null,null,null,"Cost","Revenue","No. Served"]
["Non-fat Milk ",{"$f":"Non_fat_Milk","v":0},null,null,"Adult",{"$f":"SUM(H22:H23)","v":0},{"$f":"SUM(I22:I23)","v":0}]
["Non-fat Flavored Milk ",{"$f":"NonFatFlavor","v":0},null,null,"Student",{"$f":"SUM(H16:H21)","v":0},{"$f":"SUM(I16:I21)","v":0}]
["1% Milk ",{"$f":"Milk1","v":0},null,null,"Reim. Meals",{"$f":"SUM(H16,H19,H20,H21)","v":0},{"$f":"SUM(I16,I19:I21)","v":0},{"$f":"SUM(C16:G16,C19:G21)","v":0}]
{"$rows_left_out":214}
{"sheet":"Breakfast Menu 4","index":12,"n_rows":223,"n_cols":9,"rows_kept":223,"cut":false,"hidden":true,"merged":[[182,1,182,5],[193,1,193,5],[104,1,104,5],[115,1,115,5],[141,0,141,8],[143,1,143,5],[154,1,154,5],[180,0,180,8],[102,0,102,8],[0,0,0,8],[1,1,1,8],[5,0,5,1],[13,0,13,6],[14,0,14,1],[24,0,24,8],[26,1,26,5],[37,1,37,5],[63,0,63,8],[65,1,65,5],[76,1,76,5],[3,3,3,5]]}
["Breakfast Menu Costing Worksheet"]
["Select Grade Level: "]
["Sponsor Name: ",{"$f":"IF('Instructions (START HERE)'!C2=\"\",\"\",'Instructions (START HERE)'!C2)","v":""}]
["Week Selected for Review: ",{"$f":"'Lunch Menu'!B4","v":0},"Site: "]
[]
["Average Cost of Milk Calculator"]
["Types of Milk Served:","Cost per Unit:",null,null,null,"Cost","Revenue","No. Served"]
["Non-fat Milk ",{"$f":"Non_fat_Milk","v":0},null,null,"Adult",{"$f":"SUM(H22:H23)","v":0},{"$f":"SUM(I22:I23)","v":0}]
["Non-fat Flavored Milk ",{"$f":"NonFatFlavor","v":0},null,null,"Student",{"$f":"SUM(H16:H21)","v":0},{"$f":"SUM(I16:I21)","v":0}]
["1% Milk ",{"$f":"Milk1","v":0},null,null,"Reim. Meals",{"$f":"SUM(H16,H19,H20,H21)","v":0},{"$f":"SUM(I16,I19:I21)","v":0},{"$f":"SUM(C16:G16,C19:G21)","v":0}]
{"$rows_left_out":214}
{"sheet":"Breakfast Menu 5","index":13,"n_rows":223,"n_cols":9,"rows_kept":223,"cut":false,"hidden":true,"merged":[[182,1,182,5],[193,1,193,5],[104,1,104,5],[115,1,115,5],[141,0,141,8],[143,1,143,5],[154,1,154,5],[180,0,180,8],[102,0,102,8],[0,0,0,8],[1,1,1,8],[5,0,5,1],[13,0,13,6],[14,0,14,1],[24,0,24,8],[26,1,26,5],[37,1,37,5],[63,0,63,8],[65,1,65,5],[76,1,76,5],[3,3,3,5]]}
["Breakfast Menu Costing Worksheet"]
["Select Grade Level: "]
["Sponsor Name: ",{"$f":"IF('Instructions (START HERE)'!C2=\"\",\"\",'Instructions (START HERE)'!C2)","v":""}]
["Week Selected for Review: ",{"$f":"'Lunch Menu'!B4","v":0},"Site: "]
[]
["Average Cost of Milk Calculator"]
["Types of Milk Served:","Cost per Unit:",null,null,null,"Cost","Revenue","No. Served"]
["Non-fat Milk ",{"$f":"Non_fat_Milk","v":0},null,null,"Adult",{"$f":"SUM(H22:H23)","v":0},{"$f":"SUM(I22:I23)","v":0}]
["Non-fat Flavored Milk ",{"$f":"NonFatFlavor","v":0},null,null,"Student",{"$f":"SUM(H16:H21)","v":0},{"$f":"SUM(I16:I21)","v":0}]
["1% Milk ",{"$f":"Milk1","v":0},null,null,"Reim. Meals",{"$f":"SUM(H16,H19,H20,H21)","v":0},{"$f":"SUM(I16,I19:I21)","v":0},{"$f":"SUM(C16:G16,C19:G21)","v":0}]
{"$rows_left_out":214}
{"sheet":"Breakfast Menu 6","index":14,"n_rows":222,"n_cols":9,"rows_kept":222,"cut":false,"hidden":true,"merged":[[182,1,182,5],[193,1,193,5],[104,1,104,5],[115,1,115,5],[141,0,141,8],[143,1,143,5],[154,1,154,5],[180,0,180,8],[102,0,102,8],[0,0,0,8],[1,1,1,8],[5,0,5,1],[13,0,13,6],[14,0,14,1],[24,0,24,8],[26,1,26,5],[37,1,37,5],[63,0,63,8],[65,1,65,5],[76,1,76,5],[3,3,3,5]]}
["Breakfast Menu Costing Worksheet"]
["Select Grade Level: "]
["Sponsor Name: ",{"$f":"IF('Instructions (START HERE)'!C2=\"\",\"\",'Instructions (START HERE)'!C2)","v":""}]
["Week Selected for Review: ",{"$f":"'Lunch Menu'!B4","v":0},"Site: "]
[]
["Average Cost of Milk Calculator"]
["Types of Milk Served:","Cost per Unit:",null,null,null,"Cost","Revenue","No. Served"]
["Non-fat Milk ",{"$f":"Non_fat_Milk","v":0},null,null,"Adult",{"$f":"SUM(H22:H23)","v":0},{"$f":"SUM(I22:I23)","v":0}]
["Non-fat Flavored Milk ",{"$f":"NonFatFlavor","v":0},null,null,"Student",{"$f":"SUM(H16:H21)","v":0},{"$f":"SUM(I16:I21)","v":0}]
["1% Milk ",{"$f":"Milk1","v":0},null,null,"Reim. Meals",{"$f":"SUM(H16,H19,H20,H21)","v":0},{"$f":"SUM(I16,I19:I21)","v":0},{"$f":"SUM(C16:G16,C19:G21)","v":0}]
{"$rows_left_out":213}
{"sheet":"A La Carte","index":15,"n_rows":50,"n_cols":8,"rows_kept":50,"cut":false,"hidden":false,"merged":[[44,0,44,3],[0,0,0,8],[4,0,4,5]]}
["Weekly A La Carte Sales"]
["Sponsor Name: ",{"$f":"IF('Instructions (START HERE)'!C2=\"\",\"\",'Instructions (START HERE)'!C2)","v":""}]
["Week Selected for Review: ",{"$f":"'Lunch Menu'!B4","v":0}]
[]
["Food cost percentages above the industry standard of 40% are in jeopardy of non-compliance\nwith the requirements in USDA Memo SP20-2016",null,null,null,null,null,"Memo\nSP20-2016"]
[null,"Item","Cost per Portion","No. of Portions Sold \nA La Carte","A La Carte Price Charged Per Portion","Food \nCost %","Total Nonprogram Food Cost","Total Revenue per Item"]
["A La Carte Items",null,0,null,0,{"$f":"IFERROR(C7/E7,\"\")","v":""},{"$f":"IFERROR(C7*D7,0)","v":0},{"$f":"IF(G7>0.01,E7*D7,0)","v":0}]
[null,null,0,null,0,{"$f":"IFERROR(C8/E8,\"\")","v":""},{"$f":"C8*D8","v":0},0]
[null,null,0,null,0,"",0,0]
[null,null,0,null,0,"",0,0]
{"$rows_left_out":41}
{"sheet":"Compliance","index":16,"n_rows":44,"n_cols":7,"rows_kept":44,"cut":false,"hidden":false,"merged":[[0,0,0,8],[1,0,1,8],[15,0,15,4],[31,0,31,4],[5,0,5,8],[12,0,13,6],[5,9,5,10],[6,0,6,8],[8,0,8,6],[9,0,9,1],[9,3,11,3],[9,4,9,5],[10,2,11,2],[10,6,11,6]]}
["Nonprogram Food Revenue Compliance"]
[{"$f":"IF('Instructions (START HERE)'!C2=0,\"\",'Instructions (START HERE)'!C2)","v":""}]
[]
["Week Selected for Review: ",{"$f":"IF('Lunch Menu'!B4=0,\"\",'Lunch Menu'!B4)","v":""}]
[]
["Is the Sponsor Compliant with the Nonprogram Revenue Requirement?"]
[{"$f":"IF(C11>=G11,\"Yes! Non-Program Food Priced Appropriately\",\"No: Increase Nonprogram Food Prices\")","v":"Yes! Non-Program Food Priced Appropriately"}]
[]
["Assessing Compliance with Nonprogram Revenue Requirement: "]
["Revenue Ratio: ",null,"Percent of Revenue from Nonprogram Foods",null,"Food Cost Ratio: ",null,"Percent of Food Cost from Nonprogram Foods"]
{"$rows_left_out":35}
{"sheet":"Supporting Invoices","index":17,"n_rows":2,"n_cols":1,"rows_kept":2,"cut":false,"hidden":false,"merged":[[0,0,0,8],[1,0,2,8]]}
["Supporting Cost Documentation"]
["Copy & paste PDF's or Screen Shots of the invoices used during the reference week.  \nOR list the invoices by vendor name and invoice number;  \nsave an electronic copy in the same location as this workbook.  "]

{"sheet":"Sales Reports","index":18,"n_rows":2,"n_cols":1,"rows_kept":2,"cut":false,"hidden":false,"merged":[[0,0,0,8],[1,0,2,8]]}
["Sales Reports"]
["Copy & paste PDF's or Screen Shots of the Sales Reports "]

{"sheet":"Revenue Reports Deposits","index":19,"n_rows":4,"n_cols":1,"rows_kept":4,"cut":false,"hidden":false,"merged":[[0,0,0,8],[1,0,2,8],[3,0,4,8]]}
["Revenue Reports"]
["Revenue from Apportionment is calculated on the Compliance Tab."]
[]
["Copy & paste PDF's or Screen Shots of the Revenue Reports from all sales"]

{"sheet":"Ala Cart Price Instructions","index":20,"n_rows":46,"n_cols":7,"rows_kept":46,"cut":false,"hidden":false,"merged":[[0,0,0,8]]}
["OSPI School Meal Programs"]
[null,"A La Carte Pricing Worksheet Instructions"]
[]
["A.","Enter data in blue fields only"]
["B.","Enter name of school district and sites selling a la carte items"]
["C.","Complete the Non-Program Pricing tab by filling in the following information:"]
[1,"A La Carte Items","Short name/description of the item being sold"]
[2,"Total Unit Cost","SFA cost to purchase the item"]
[3,"Actual Selling Price","Price charged to customers"]
[]
{"$rows_left_out":37}
{"sheet":"Ala Cart Pricing","index":21,"n_rows":44,"n_cols":7,"rows_kept":44,"cut":false,"hidden":false,"merged":[[0,1,0,5],[40,1,40,7]]}
[null,"OSPI School Meal Programs"]
[null,"A La Carte Pricing Worksheet "]
[null,"School District Name"]
[null,"Schools Using These Prices"]
[null,"Desired Food Cost Percentage:",0.4,"Food cost percentages above the industry standard of 40% are in jeopardy of non-compliance with the requirements in USDA Memo SP20-2016."]
[null,null,"Total  ","Recommended","Actual","Food"]
[null,"A La Carte Items","Unit Cost","Selling Price","Selling Price","Cost %"]
[null,"Milk (8 oz) example",0.23,{"$f":"C8/$C$5","v":0.57499999999999996},0.55000000000000004,{"$f":"C8/E8","v":0.41818181818181815}]
[null,null,null,0,null,{"$f":"C9/E9","v":{"$error":"#DIV/0!"}}]
[null,null,null,0,null,{"$error":"#DIV/0!"}]
{"$rows_left_out":35}
{"sheet":"Data","index":22,"n_rows":34,"n_cols":1,"rows_kept":34,"cut":false,"hidden":true,"merged":[[35,10,35,11]]}
["K-5 Lunch Menu"]
["K-8 Lunch Menu"]
["6-8 Lunch Menu"]
["9-12 Lunch Menu"]
[]
["K-5 Breakfast Menu"]
["K-8 Breakfast Menu"]
["K-12 Breakfast Menu"]
["6-8 Breakfast Menu"]
["6-12 Breakfast Menu"]
{"$rows_left_out":24}