{"text_format":"1","workbook":"xlsx","n_sheets":8,"sheets":["District","2022-23 Final","2021-22 Final","Enrollment 22-23","Rural and Low Income 22-23","other funds ftr 2022","Assumptions","CCDDD"],"not_rendered":{"charts":0,"images":0,"macros":1,"external_links":8,"defined_names":126,"comments":1,"pivot_tables":0},"unopened":[],"bounds":{"document_bytes":16777216,"sheet_cells":100000,"rows_first":2000,"rows_last":500,"rows_between":2000,"halvings":0,"cell_chars":16384,"cell_head_chars":4096},"cells_cut":0,"cells_raw":0,"read":"whole","date_system":"1900"}

{"sheet":"District","index":0,"n_rows":83,"n_cols":31,"rows_kept":83,"cut":false,"hidden":false,"merged":[[27,13,28,14],[30,13,30,14],[30,15,30,16],[32,5,34,5],[1,6,1,8],[16,2,19,2],[16,5,17,5],[18,5,19,5],[20,2,23,2],[20,5,21,5],[22,5,23,5],[2,19,2,20],[6,5,7,5],[8,5,9,5],[10,5,11,5],[12,2,15,2],[12,5,13,5],[14,5,15,5],[2,7,2,8],[2,9,2,10],[2,11,2,12],[2,13,2,14],[2,15,2,16],[2,17,2,18]]}
[null,null,null,null,null,null,null,null,null,null,null,null,null,null,null,null,null,null,null,null,null,null,null,"Do Not",null,null,null,null,null,null,"Aberdeen"]
[null,null,null,null,null,"District Name","ABERDEEN",null,null,"<- Please select distrtict from this drop-down",null,null,null,null,null,null,null,null,null,null,null,null,null,"Change",null,null,null,null,null,null,"Brewster"]
[null,null,null,null,null,"CCDDD",{"$f":"VLOOKUP(G2,CCDDD!B:C,2,0)","v":"14005"},"2022-23",null,"2021-22",null,"2020-21",null,"2011-12",null,"2010-11",null,"2009-10",null,"2008-09",null,"2007-08",null,null,null,null,null,null,null,null,"Bridgeport"]
[null,null,null,null,null,null,null,null,null,null,null,null,null,null,null,null,null,null,null,null,"%%",null,null,null,null,null,null,null,null,null,"Burlington"]
[null,null,null,null,null,null,null,"Final 22-23","% of PY","Final 2021-22","% of PY","Final 2020-21",null,"Prelim 2011-12","% of PY","Final 2010-11","% of PY","Final 2009-10","% of PY",{"$f":"[2]Assumptions!AC4","v":"Final 2008-09"},"of Prior Year","2007-08",null,null,null,null,null,null,null,null,"Cascade"]
[null,null,null,null,null,"Regular Allocation",null,null,null,null,null,null,null,null,null,null,null,null,null,null,null,null,null,null,null,null,null,null,null,null,"Cashmere"]
[null,2,null,null,null,"K-12 Migrant Students","Average Number",{"$f":"IFERROR(VLOOKUP($G$3,'2022-23 Final'!$B:$Z,4,0),0)","v":130},{"$f":"IFERROR(H7/J7-1,0)","v":0},{"$f":"IFERROR(VLOOKUP($G$3,'[2]2021-22 Final'!$B:$R,3,0),0)","v":130},0,{"$f":"IFERROR(VLOOKUP($G$3,'[2]2020-21 Final'!$B:$R,3,0),0)","v":130},null,{"$f":"VLOOKUP($G$2,#REF!,$B7,FALSE)","v":{"$error":"#REF!"}},{"$f":"IF(P7=0,0,N7/P7)","v":{"$error":"#REF!"}},{"$f":"VLOOKUP($G$2,#REF!,$B7,FALSE)","v":{"$error":"#REF!"}},{"$f":"IF(R7>0,P7/R7,\"-\")","v":{"$error":"#REF!"}},{"$f":"VLOOKUP($G$2,#REF!,$B7,FALSE)","v":{"$error":"#REF!"}},{"$f":"IF(T7>0,R7/T7,\"-\")","v":{"$error":"#REF!"}},{"$f":"VLOOKUP($G$2,#REF!,$B7,FALSE)","v":{"$error":"#REF!"}},{"$f":"IF(V7>0,T7/V7,\"-\")","v":{"$error":"#REF!"}},{"$f":"VLOOKUP($G$2,#REF!,$B7,FALSE)","v":{"$error":"#REF!"}},null,1,3,null,null,null,null,null,"Centralia"]
[null,3,null,null,null,null,"Regular Dollars",{"$f":"IFERROR(VLOOKUP($G$3,'2022-23 Final'!$B:$Z,5,0),0)","v":56026},-8.4078536513593538E-2,{"$f":"IFERROR(VLOOKUP($G$3,'[2]2021-22 Final'!$B:$R,4,0),0)","v":61169},0.17485835013924911,{"$f":"IFERROR(VLOOKUP($G$3,'[2]2020-21 Final'!$B:$R,4,0),0)","v":52065},null,{"$f":"VLOOKUP($G$2,#REF!,$B8,FALSE)","v":{"$error":"#REF!"}},{"$error":"#REF!"},{"$f":"VLOOKUP($G$2,#REF!,$B8,FALSE)","v":{"$error":"#REF!"}},{"$f":"IF(R8>0,P8/R8,\"-\")","v":{"$error":"#REF!"}},{"$f":"VLOOKUP($G$2,#REF!,$B8,FALSE)","v":{"$error":"#REF!"}},{"$f":"IF(T8>0,R8/T8,\"-\")","v":{"$error":"#REF!"}},{"$f":"VLOOKUP($G$2,#REF!,$B8,FALSE)","v":{"$error":"#REF!"}},{"$error":"#REF!"},{"$f":"VLOOKUP($G$2,#REF!,$B8,FALSE)","v":{"$error":"#REF!"}},null,2,3,null,null,null,null,null,"College Place"]
[null,4,null,null,null,"Needs Support","Average Number",{"$f":"IFERROR(VLOOKUP($G$3,'2022-23 Final'!$B:$Z,6,0),0)","v":30},0,{"$f":"IFERROR(VLOOKUP($G$3,'[2]2021-22 Final'!$B:$R,5,0),0)","v":30},0,{"$f":"IFERROR(VLOOKUP($G$3,'[2]2020-21 Final'!$B:$R,5,0),0)","v":30},null,{"$f":"VLOOKUP($G$2,#REF!,$B9,FALSE)","v":{"$error":"#REF!"}},{"$f":"IF(P9=0,0,N9/P9)","v":{"$error":"#REF!"}},{"$f":"VLOOKUP($G$2,#REF!,$B9,FALSE)","v":{"$error":"#REF!"}},{"$error":"#REF!"},{"$f":"VLOOKUP($G$2,#REF!,$B9,FALSE)","v":{"$error":"#REF!"}},{"$error":"#REF!"},{"$f":"VLOOKUP($G$2,#REF!,$B9,FALSE)","v":{"$error":"#REF!"}},{"$error":"#REF!"},{"$f":"VLOOKUP($G$2,#REF!,$B9,FALSE)","v":{"$error":"#REF!"}},null,1,4,null,null,null,null,null,"Columbia"]
[null,5,null,null,null,null,"Regular Dollars",{"$f":"IFERROR(VLOOKUP($G$3,'2022-23 Final'!$B:$Z,7,0),0)","v":3232},-8.4159818645508588E-2,{"$f":"IFERROR(VLOOKUP($G$3,'[2]2021-22 Final'!$B:$R,6,0),0)","v":3529},0.17476697736351521,{"$f":"IFERROR(VLOOKUP($G$3,'[2]2020-21 Final'!$B:$R,6,0),0)","v":3004},null,{"$f":"VLOOKUP($G$2,#REF!,$B10,FALSE)","v":{"$error":"#REF!"}},{"$f":"IF(P10=0,0,N10/P10)","v":{"$error":"#REF!"}},{"$f":"VLOOKUP($G$2,#REF!,$B10,FALSE)","v":{"$error":"#REF!"}},{"$error":"#REF!"},{"$f":"VLOOKUP($G$2,#REF!,$B10,FALSE)","v":{"$error":"#REF!"}},{"$error":"#REF!"},{"$f":"VLOOKUP($G$2,#REF!,$B10,FALSE)","v":{"$error":"#REF!"}},{"$error":"#REF!"},{"$f":"VLOOKUP($G$2,#REF!,$B10,FALSE)","v":{"$error":"#REF!"}},null,2,4,null,null,null,null,null,"Conway"]
{"$rows_left_out":74}
{"sheet":"2022-23 Final","index":1,"n_rows":157,"n_cols":26,"rows_kept":157,"cut":false,"hidden":true,"merged":[[1,3,1,6],[13,4,13,7],[14,4,14,5],[14,6,14,7],[14,8,14,9]]}
[null,null,null,null,null,null,null,null,null,"From Assumptions Page:"]
[null,null,null,"Constant Dollar Multipliers - Do Not Change Here",null,null,null,null,null,"Target Amounts",null,null,null,null,{"$f":"Assumptions!C24","v":20768148}]
[null,null,null,{"$f":"[2]Assumptions!$AO$4","v":0},null,2.0369691980863958E+66,430.96546751960977,"Use CTRL K",null,"Actual Amounts",null,null,null,null,{"$f":"O18","v":20768148}]
[null,null,null,null,null,null,null,null,null,"Difference",null,null,null,null,{"$f":"O3-O2","v":0}]
[]
[null,null,null,null,null,null,null,null,null,{"$f":"O18","v":20768148}]
[null,null,null,null,null,null,null,"Put total here",null,{"$f":"Assumptions!C24","v":20768148}]
[]
[]
[null,null,null,null,null,null,null,null,null,"Go to H9 & Control K to set dollar amount"]
{"$rows_left_out":148}
{"sheet":"2021-22 Final","index":2,"n_rows":156,"n_cols":24,"rows_kept":156,"cut":false,"hidden":true,"merged":[[1,2,1,5],[13,3,13,6],[14,3,14,4],[14,5,14,6],[14,7,14,8]]}
[null,null,null,null,null,null,null,null,"From Assumptions Page:"]
[null,null,"Constant Dollar Multipliers - Do Not Change Here",null,null,null,null,null,"Target Amounts",null,null,null,null,{"$f":"[2]Assumptions!E24","v":20508825}]
[null,null,{"$f":"[2]Assumptions!$AO$4","v":0},null,null,470.53045701747953,"Use CTRL K",null,"Actual Amounts",null,null,null,null,{"$f":"N18","v":20508825}]
[null,null,null,null,null,null,null,null,"Difference",null,null,null,null,{"$f":"N3-N2","v":0}]
[]
[null,null,null,null,null,null,null,null,{"$f":"N18","v":20508825}]
[null,null,null,null,null,null,"Put total here",null,{"$f":"[2]Assumptions!D24","v":20508825}]
[]
[]
[null,null,null,null,null,null,null,null,"Go to H9 & Control K to set dollar amount"]
{"$rows_left_out":147}
{"sheet":"Enrollment 22-23","index":3,"n_rows":139,"n_cols":6,"rows_kept":139,"cut":false,"hidden":true,"merged":[]}
["CO_DIST_NUM","DIST_TITLE","Avg Students","Priority","Needs"]
[14005,"ABERDEEN",130,42,30,{"$f":"TEXT(A2,\"00000\")","v":"14005"}]
[29103,"ANACORTES",13,6,2,{"$f":"TEXT(A3,\"00000\")","v":"29103"}]
[31016,"ARLINGTON",48,31,13,"31016"]
[17408,"AUBURN",39,4,9,"17408"]
["06119","BATTLE GROUND",21,1,5,"06119"]
[17405,"BELLEVUE",10,2,3,"17405"]
[37501,"BELLINGHAM",163,63,46,"37501"]
[27403,"BETHEL",11,8,3,"27403"]
[18100,"BREMERTON",84,17,21,"18100"]
{"$rows_left_out":130}
{"sheet":"Rural and Low Income 22-23","index":4,"n_rows":135,"n_cols":4,"rows_kept":135,"cut":false,"hidden":true,"merged":[]}
["CoDis","District",null,"Ask Tony May for the list of current year REAP amd RLIS districts"]
[14005,"Aberdeen School District"]
[22017,"Almira School District"]
[1122,"Benge School District"]
[20203,"Bickleton School District"]
[21234,"Boistfort School District"]
[24111,"Brewster School District"]
[16046,"Brinnon School District"]
[5401,"Cape Flattery School District"]
[27019,"Carbonado School District"]
{"$rows_left_out":126}
{"sheet":"other funds ftr 2022","index":5,"n_rows":139,"n_cols":9,"rows_kept":139,"cut":false,"hidden":true,"merged":[]}
["CCDDD","Migrant Districts","Title III 21-22","Title I A 21-22","LAP 21-22","TBIP 21-22","Title I C 21-22","Title I C as % of Revs","\"Other Funds\" Factor"]
[14005,"ABERDEEN",{"$f":"IFERROR(VLOOKUP(TRIM(A2),[3]iGRANTS!$B:$E,3,FALSE),0) + IFERROR(VLOOKUP(TRIM(A2),[3]iGRANTS!$G:$I,3,FALSE),0)","v":59966},{"$f":"IFERROR(VLOOKUP(TRIM(A2),'[4]2021-22 Rev Final'!$A:$CL,81,FALSE),0)","v":1558636},{"$f":"IFERROR(VLOOKUP(TRIM(A2),[5]Sheet1!$A:$E,5,FALSE),0)","v":2272017.16},{"$f":"IFERROR(VLOOKUP(TRIM(A2),[5]Sheet1!$A:$E,4,FALSE),0)","v":644755.75},{"$f":"IFERROR(VLOOKUP(TRIM(A2),'[6]2021-22 Final'!$B:$X,18,FALSE),0)","v":75126},{"$f":"IFERROR(G2/SUM(C2:G2),0)","v":1.6294541844044445E-2},{"$f":"IF(AND(H2>=[2]Assumptions!$E$56,H2<[2]Assumptions!$E$57),[2]Assumptions!$B$61,IF(AND(H2>=[2]Assumptions!$E$57,H2<[2]Assumptions!$E$58),[2]Assumptions!$B$60,IF(AND(H2>=[2]Assumptions!$E$58,H2<[2]Assumptions!$E$59),[2]Assumptions!$B$59,IF(AND(H2>=[2]Assumptions!$E$59,H2<[2]Assumptions!$E$60),[2]Assumptions!$B$58,IF(AND(H2>=[2]Assumptions!$E$60,H2<=[2]Assumptions!$E$61),[2]Assumptions!$B$57,0)))))","v":0.95}]
[29103,"ANACORTES",{"$f":"IFERROR(VLOOKUP(TRIM(A3),[3]iGRANTS!$B:$E,3,FALSE),0) + IFERROR(VLOOKUP(TRIM(A3),[3]iGRANTS!$G:$I,3,FALSE),0)","v":0},{"$f":"IFERROR(VLOOKUP(TRIM(A3),'[4]2021-22 Rev Final'!$A:$CL,81,FALSE),0)","v":451693},{"$f":"IFERROR(VLOOKUP(TRIM(A3),[5]Sheet1!$A:$E,5,FALSE),0)","v":473494.53},{"$f":"IFERROR(VLOOKUP(TRIM(A3),[5]Sheet1!$A:$E,4,FALSE),0)","v":89453.119999999995},{"$f":"IFERROR(VLOOKUP(TRIM(A3),'[6]2021-22 Final'!$B:$X,18,FALSE),0)","v":0},0,{"$f":"IF(AND(H3>=[2]Assumptions!$E$56,H3<[2]Assumptions!$E$57),[2]Assumptions!$B$61,IF(AND(H3>=[2]Assumptions!$E$57,H3<[2]Assumptions!$E$58),[2]Assumptions!$B$60,IF(AND(H3>=[2]Assumptions!$E$58,H3<[2]Assumptions!$E$59),[2]Assumptions!$B$59,IF(AND(H3>=[2]Assumptions!$E$59,H3<[2]Assumptions!$E$60),[2]Assumptions!$B$58,IF(AND(H3>=[2]Assumptions!$E$60,H3<=[2]Assumptions!$E$61),[2]Assumptions!$B$57,0)))))","v":0}]
[31016,"ARLINGTON",{"$f":"IFERROR(VLOOKUP(TRIM(A4),[3]iGRANTS!$B:$E,3,FALSE),0) + IFERROR(VLOOKUP(TRIM(A4),[3]iGRANTS!$G:$I,3,FALSE),0)","v":37980},{"$f":"IFERROR(VLOOKUP(TRIM(A4),'[4]2021-22 Rev Final'!$A:$CL,81,FALSE),0)","v":560273},{"$f":"IFERROR(VLOOKUP(TRIM(A4),[5]Sheet1!$A:$E,5,FALSE),0)","v":1299384.44},{"$f":"IFERROR(VLOOKUP(TRIM(A4),[5]Sheet1!$A:$E,4,FALSE),0)","v":506103.66},{"$f":"IFERROR(VLOOKUP(TRIM(A4),'[6]2021-22 Final'!$B:$X,18,FALSE),0)","v":0},0,{"$f":"IF(AND(H4>=[2]Assumptions!$E$56,H4<[2]Assumptions!$E$57),[2]Assumptions!$B$61,IF(AND(H4>=[2]Assumptions!$E$57,H4<[2]Assumptions!$E$58),[2]Assumptions!$B$60,IF(AND(H4>=[2]Assumptions!$E$58,H4<[2]Assumptions!$E$59),[2]Assumptions!$B$59,IF(AND(H4>=[2]Assumptions!$E$59,H4<[2]Assumptions!$E$60),[2]Assumptions!$B$58,IF(AND(H4>=[2]Assumptions!$E$60,H4<=[2]Assumptions!$E$61),[2]Assumptions!$B$57,0)))))","v":0}]
[17408,"AUBURN",{"$f":"IFERROR(VLOOKUP(TRIM(A5),[3]iGRANTS!$B:$E,3,FALSE),0) + IFERROR(VLOOKUP(TRIM(A5),[3]iGRANTS!$G:$I,3,FALSE),0)","v":513944},{"$f":"IFERROR(VLOOKUP(TRIM(A5),'[4]2021-22 Rev Final'!$A:$CL,81,FALSE),0)","v":4113446},{"$f":"IFERROR(VLOOKUP(TRIM(A5),[5]Sheet1!$A:$E,5,FALSE),0)","v":10007514.33},{"$f":"IFERROR(VLOOKUP(TRIM(A5),[5]Sheet1!$A:$E,4,FALSE),0)","v":6939660.1200000001},{"$f":"IFERROR(VLOOKUP(TRIM(A5),'[6]2021-22 Final'!$B:$X,18,FALSE),0)","v":0},0,{"$f":"IF(AND(H5>=[2]Assumptions!$E$56,H5<[2]Assumptions!$E$57),[2]Assumptions!$B$61,IF(AND(H5>=[2]Assumptions!$E$57,H5<[2]Assumptions!$E$58),[2]Assumptions!$B$60,IF(AND(H5>=[2]Assumptions!$E$58,H5<[2]Assumptions!$E$59),[2]Assumptions!$B$59,IF(AND(H5>=[2]Assumptions!$E$59,H5<[2]Assumptions!$E$60),[2]Assumptions!$B$58,IF(AND(H5>=[2]Assumptions!$E$60,H5<=[2]Assumptions!$E$61),[2]Assumptions!$B$57,0)))))","v":0}]
["06119","BATTLE GROUND",{"$f":"IFERROR(VLOOKUP(TRIM(A6),[3]iGRANTS!$B:$E,3,FALSE),0) + IFERROR(VLOOKUP(TRIM(A6),[3]iGRANTS!$G:$I,3,FALSE),0)","v":110326},{"$f":"IFERROR(VLOOKUP(TRIM(A6),'[4]2021-22 Rev Final'!$A:$CL,81,FALSE),0)","v":1798707},{"$f":"IFERROR(VLOOKUP(TRIM(A6),[5]Sheet1!$A:$E,5,FALSE),0)","v":2458260.09},{"$f":"IFERROR(VLOOKUP(TRIM(A6),[5]Sheet1!$A:$E,4,FALSE),0)","v":1297720.1399999999},{"$f":"IFERROR(VLOOKUP(TRIM(A6),'[6]2021-22 Final'!$B:$X,18,FALSE),0)","v":0},0,{"$f":"IF(AND(H6>=[2]Assumptions!$E$56,H6<[2]Assumptions!$E$57),[2]Assumptions!$B$61,IF(AND(H6>=[2]Assumptions!$E$57,H6<[2]Assumptions!$E$58),[2]Assumptions!$B$60,IF(AND(H6>=[2]Assumptions!$E$58,H6<[2]Assumptions!$E$59),[2]Assumptions!$B$59,IF(AND(H6>=[2]Assumptions!$E$59,H6<[2]Assumptions!$E$60),[2]Assumptions!$B$58,IF(AND(H6>=[2]Assumptions!$E$60,H6<=[2]Assumptions!$E$61),[2]Assumptions!$B$57,0)))))","v":0}]
[17405,"BELLEVUE",{"$f":"IFERROR(VLOOKUP(TRIM(A7),[3]iGRANTS!$B:$E,3,FALSE),0) + IFERROR(VLOOKUP(TRIM(A7),[3]iGRANTS!$G:$I,3,FALSE),0)","v":424255},{"$f":"IFERROR(VLOOKUP(TRIM(A7),'[4]2021-22 Rev Final'!$A:$CL,81,FALSE),0)","v":1852875},{"$f":"IFERROR(VLOOKUP(TRIM(A7),[5]Sheet1!$A:$E,5,FALSE),0)","v":2404488},{"$f":"IFERROR(VLOOKUP(TRIM(A7),[5]Sheet1!$A:$E,4,FALSE),0)","v":5612529.96},{"$f":"IFERROR(VLOOKUP(TRIM(A7),'[6]2021-22 Final'!$B:$X,18,FALSE),0)","v":0},0,{"$f":"IF(AND(H7>=[2]Assumptions!$E$56,H7<[2]Assumptions!$E$57),[2]Assumptions!$B$61,IF(AND(H7>=[2]Assumptions!$E$57,H7<[2]Assumptions!$E$58),[2]Assumptions!$B$60,IF(AND(H7>=[2]Assumptions!$E$58,H7<[2]Assumptions!$E$59),[2]Assumptions!$B$59,IF(AND(H7>=[2]Assumptions!$E$59,H7<[2]Assumptions!$E$60),[2]Assumptions!$B$58,IF(AND(H7>=[2]Assumptions!$E$60,H7<=[2]Assumptions!$E$61),[2]Assumptions!$B$57,0)))))","v":0}]
[37501,"BELLINGHAM",{"$f":"IFERROR(VLOOKUP(TRIM(A8),[3]iGRANTS!$B:$E,3,FALSE),0) + IFERROR(VLOOKUP(TRIM(A8),[3]iGRANTS!$G:$I,3,FALSE),0)","v":118517},{"$f":"IFERROR(VLOOKUP(TRIM(A8),'[4]2021-22 Rev Final'!$A:$CL,81,FALSE),0)","v":2135829},{"$f":"IFERROR(VLOOKUP(TRIM(A8),[5]Sheet1!$A:$E,5,FALSE),0)","v":3455680.57},{"$f":"IFERROR(VLOOKUP(TRIM(A8),[5]Sheet1!$A:$E,4,FALSE),0)","v":1320356.3500000001},{"$f":"IFERROR(VLOOKUP(TRIM(A8),'[6]2021-22 Final'!$B:$X,18,FALSE),0)","v":0},0,{"$f":"IF(AND(H8>=[2]Assumptions!$E$56,H8<[2]Assumptions!$E$57),[2]Assumptions!$B$61,IF(AND(H8>=[2]Assumptions!$E$57,H8<[2]Assumptions!$E$58),[2]Assumptions!$B$60,IF(AND(H8>=[2]Assumptions!$E$58,H8<[2]Assumptions!$E$59),[2]Assumptions!$B$59,IF(AND(H8>=[2]Assumptions!$E$59,H8<[2]Assumptions!$E$60),[2]Assumptions!$B$58,IF(AND(H8>=[2]Assumptions!$E$60,H8<=[2]Assumptions!$E$61),[2]Assumptions!$B$57,0)))))","v":0}]
[27403,"BETHEL",{"$f":"IFERROR(VLOOKUP(TRIM(A9),[3]iGRANTS!$B:$E,3,FALSE),0) + IFERROR(VLOOKUP(TRIM(A9),[3]iGRANTS!$G:$I,3,FALSE),0)","v":149952},{"$f":"IFERROR(VLOOKUP(TRIM(A9),'[4]2021-22 Rev Final'!$A:$CL,81,FALSE),0)","v":4111949},{"$f":"IFERROR(VLOOKUP(TRIM(A9),[5]Sheet1!$A:$E,5,FALSE),0)","v":8918618.8300000001},{"$f":"IFERROR(VLOOKUP(TRIM(A9),[5]Sheet1!$A:$E,4,FALSE),0)","v":1963963.1},{"$f":"IFERROR(VLOOKUP(TRIM(A9),'[6]2021-22 Final'!$B:$X,18,FALSE),0)","v":0},0,{"$f":"IF(AND(H9>=[2]Assumptions!$E$56,H9<[2]Assumptions!$E$57),[2]Assumptions!$B$61,IF(AND(H9>=[2]Assumptions!$E$57,H9<[2]Assumptions!$E$58),[2]Assumptions!$B$60,IF(AND(H9>=[2]Assumptions!$E$58,H9<[2]Assumptions!$E$59),[2]Assumptions!$B$59,IF(AND(H9>=[2]Assumptions!$E$59,H9<[2]Assumptions!$E$60),[2]Assumptions!$B$58,IF(AND(H9>=[2]Assumptions!$E$60,H9<=[2]Assumptions!$E$61),[2]Assumptions!$B$57,0)))))","v":0}]
[18100,"BREMERTON",{"$f":"IFERROR(VLOOKUP(TRIM(A10),[3]iGRANTS!$B:$E,3,FALSE),0) + IFERROR(VLOOKUP(TRIM(A10),[3]iGRANTS!$G:$I,3,FALSE),0)","v":62827},{"$f":"IFERROR(VLOOKUP(TRIM(A10),'[4]2021-22 Rev Final'!$A:$CL,81,FALSE),0)","v":1359921},{"$f":"IFERROR(VLOOKUP(TRIM(A10),[5]Sheet1!$A:$E,5,FALSE),0)","v":3392005.12},{"$f":"IFERROR(VLOOKUP(TRIM(A10),[5]Sheet1!$A:$E,4,FALSE),0)","v":779926.18},{"$f":"IFERROR(VLOOKUP(TRIM(A10),'[6]2021-22 Final'!$B:$X,18,FALSE),0)","v":0},0,{"$f":"IF(AND(H10>=[2]Assumptions!$E$56,H10<[2]Assumptions!$E$57),[2]Assumptions!$B$61,IF(AND(H10>=[2]Assumptions!$E$57,H10<[2]Assumptions!$E$58),[2]Assumptions!$B$60,IF(AND(H10>=[2]Assumptions!$E$58,H10<[2]Assumptions!$E$59),[2]Assumptions!$B$59,IF(AND(H10>=[2]Assumptions!$E$59,H10<[2]Assumptions!$E$60),[2]Assumptions!$B$58,IF(AND(H10>=[2]Assumptions!$E$60,H10<=[2]Assumptions!$E$61),[2]Assumptions!$B$57,0)))))","v":0}]
{"$rows_left_out":130}
{"sheet":"Assumptions","index":6,"n_rows":61,"n_cols":34,"rows_kept":61,"cut":false,"hidden":true,"merged":[[6,31,21,31]]}
["Assumptions and Factors — Title I Part C Migrant - Final"]
[null,"Caution: Yellow Cells below drive are inputs into the calculations in this model"]
[null,null,null,null,null,null,null,null,null,null,null,null,null,null,null,null,null,null,null,null,null,null,null,null,null,null,null,null,null,null,null,null,null,"Row Headings on Allocation Table"]
["Funding",null,"Final 2022-23","Preliminary 2022-23","Final 2021-22","Preliminary 2021-22","Final 2020-21","Preliminary 2020-21","Final 2019-20","Preliminary 2019-20","Final 2018-19","Preliminary 2018-19","Final 2017-18","Preliminary 2017-18","2nd Rev Final 2016-17","Rev Final 2016-17","Final 2016-17","Final 2015-16","Preliminary 2015-16","Final 2014-15","Preliminary 2014-15","Revised Final 2013-14","Final 2013-14","Final 2012-13","Preliminary 2012-13","Final 2011-12","Preliminary \n2011-12","Final\n2010-11","Final 2009-10","Final 2008-09","Source: "]
[null,"Total State Allocation",38126160,"38,168,234",36172055,36170767,33650164,32545772,29253692,28509499,27865765,26740196,24667573,24540413,14921087,14921087,14921087,14921087,14875015,14875015,14875015,14839257,14839257,15628872,15628872,15659257,15659257,15691456,14450894,15015291]
[null,"State Allocation under $14B rule",{"$f":"'[7]Final T-I State Admin 1004(b)'!$C$60","v":29491607},{"$f":"'[8]Prel. T-I State Admin 1004(b)'!$C$60","v":29524149},29680217,29680217,28007581,32545800,23817704,23834846,21267203,21267203,13112612,13104377,13566765,13616032,13566765,14077428,14055099,14085411,14041918,14645076,14645076,14620622,14620622,14680941,14680941,14980942]
["General Admin","State Admin",{"$f":"ROUND(C6*0.01,0)","v":294916},295241,296802,296802,280076,325458,{"$f":"ROUND(I6*0.01,0)","v":238177},238348,212672,212672,131126,131044,135668,136160,135668,140774,140551,140854,140419,146451,{"$f":"ROUND(W6*0.01,0)","v":146451},{"$f":"ROUND(X6*0.01,0)","v":146206},{"$f":"ROUND(Y6*0.01,0)","v":146206},{"$f":"ROUND(Z6*0.01,0)","v":146809},{"$f":"ROUND(14680941*0.01,0)","v":146809},{"$f":"ROUND(14680942*0.01,0)","v":146809},{"$f":"ROUND(13563693*0.01,0)","v":135637},{"$f":"ROUND(14649429*0.01,0)","v":146494},0.01]
[null,"State Level Activities (Unallocated Balance)",{"$f":"C5-C7-C18-C24","v":14955548},{"$f":"D5-D7-D18-D24","v":14972053},{"$f":"E5-E7-E18-E24","v":13087588},{"$f":"F5-F7-F18-F24","v":13086382},{"$f":"G5-G7-G18-G24","v":13179990},{"$f":"H5-H7-H18-H24","v":12692851},10935689,11551691,11233633,10783406,9920983,12702535,3078585,3078093,4570694,2999662,2953813,3913523,2273028,14692806,14692806,15482666,15482666,15512448,15512448,15544647,14315257,536592]
[]
["Other Admin","Director salary"]
{"$rows_left_out":52}
{"sheet":"CCDDD","index":7,"n_rows":163,"n_cols":3,"rows_kept":163,"cut":false,"hidden":true,"merged":[]}
["14005","ABERDEEN",{"$f":"A1","v":"14005"}]
["29103","ANACORTES",{"$f":"A2","v":"29103"}]
["31016","ARLINGTON","31016"]
["17408","AUBURN","17408"]
["06119","BATTLE GROUND","06119"]
["17405","BELLEVUE","17405"]
["37501","BELLINGHAM","37501"]
["27403","BETHEL","27403"]
["37503","BLAINE","37503"]
["18100","BREMERTON","18100"]
{"$rows_left_out":153}