{"text_format":"1","workbook":"xlsx","n_sheets":8,"sheets":["District","2023-24 Final","Assumptions","Enrollment","Rural and Low Income 23-24","other funds ftr 2023","CCDDD","22-23 Final"],"not_rendered":{"charts":0,"images":0,"macros":1,"external_links":9,"defined_names":107,"comments":1,"pivot_tables":0},"unopened":[],"bounds":{"document_bytes":16777216,"sheet_cells":100000,"rows_first":2000,"rows_last":500,"rows_between":2000,"halvings":0,"cell_chars":16384,"cell_head_chars":4096},"cells_cut":0,"cells_raw":0,"read":"whole","date_system":"1900"}

{"sheet":"District","index":0,"n_rows":83,"n_cols":32,"rows_kept":83,"cut":false,"hidden":false,"merged":[[27,14,28,15],[30,14,30,15],[30,16,30,17],[32,5,34,5],[1,6,1,9],[2,7,2,8],[16,2,19,2],[16,5,17,5],[18,5,19,5],[20,2,23,2],[20,5,21,5],[22,5,23,5],[2,20,2,21],[6,5,7,5],[8,5,9,5],[10,5,11,5],[12,2,15,2],[12,5,13,5],[14,5,15,5],[2,10,2,11],[2,12,2,13],[2,14,2,15],[2,16,2,17],[2,18,2,19]]}
[null,null,null,null,null,null,null,null,null,null,null,null,null,null,null,null,null,null,null,null,null,null,null,null,"Do Not",null,null,null,null,null,null,"Aberdeen"]
[null,null,null,null,null,"District Name","BURLINGTON",null,null,null,"<- Please select distrtict from this drop-down",null,null,null,null,null,null,null,null,null,null,null,null," <<- Please Select District From Drop Down","Change",null,null,null,null,null,null,"Brewster"]
[null,null,null,null,null,"CCDDD",{"$f":"VLOOKUP(G2,CCDDD!B:C,2,0)","v":"29100"},"2023-24",null,"2022-23","2021-22",null,"2020-21",null,"2011-12",null,"2010-11",null,"2009-10",null,"2008-09",null,"2007-08",null,null,null,null,null,null,null,null,"Bridgeport"]
[null,null,null,null,null,null,null,null,null,null,null,null,null,null,null,null,null,null,null,null,null,"%%",null,null,null,null,null,null,null,null,null,"Burlington"]
[null,null,null,null,null,null,null,"FINAL 23-24","% of PY","Final 22-23","Final 2021-22","% of PY","Final 2020-21",null,"Prelim 2011-12","% of PY","Final 2010-11","% of PY","Final 2009-10","% of PY",{"$f":"[2]Assumptions!AC4","v":"Final 2008-09"},"of Prior Year","2007-08",null,null,null,null,null,null,null,null,"Cascade"]
[null,null,null,null,null,"Regular Allocation",null,null,null,null,null,null,null,null,null,null,null,null,null,null,null,null,null,null,null,null,null,null,null,null,null,"Cashmere"]
[null,2,null,null,null,"K-12 Migrant Students","Average Number",{"$f":"IFERROR(VLOOKUP($G$3,'2023-24 Final'!$B$19:$Z$156,4,0),0)","v":491},{"$f":"H7/J7","v":1.2654639175257731},{"$f":"IFERROR(VLOOKUP($G$3,'22-23 Final'!$B$19:$Z$156,4,0),0)","v":388},{"$f":"IFERROR(VLOOKUP($G$3,'[2]2021-22 Final'!$B:$R,3,0),0)","v":338},{"$f":"IFERROR(K7/M7-1,0)","v":0.13043478260869557},{"$f":"IFERROR(VLOOKUP($G$3,'[2]2020-21 Final'!$B:$R,3,0),0)","v":299},null,{"$f":"VLOOKUP($G$2,#REF!,$B7,FALSE)","v":{"$error":"#REF!"}},{"$f":"IF(Q7=0,0,O7/Q7)","v":{"$error":"#REF!"}},{"$f":"VLOOKUP($G$2,#REF!,$B7,FALSE)","v":{"$error":"#REF!"}},{"$f":"IF(S7>0,Q7/S7,\"-\")","v":{"$error":"#REF!"}},{"$f":"VLOOKUP($G$2,#REF!,$B7,FALSE)","v":{"$error":"#REF!"}},{"$f":"IF(U7>0,S7/U7,\"-\")","v":{"$error":"#REF!"}},{"$f":"VLOOKUP($G$2,#REF!,$B7,FALSE)","v":{"$error":"#REF!"}},{"$f":"IF(W7>0,U7/W7,\"-\")","v":{"$error":"#REF!"}},{"$f":"VLOOKUP($G$2,#REF!,$B7,FALSE)","v":{"$error":"#REF!"}},null,1,3,null,null,null,null,null,"Centralia"]
[null,3,null,null,null,null,"Regular Dollars",{"$f":"IFERROR(VLOOKUP($G$3,'2023-24 Final'!$B$19:$Z$156,5,0),0)","v":212105},{"$f":"H8/J8","v":1.2684567772030022},{"$f":"IFERROR(VLOOKUP($G$3,'22-23 Final'!$B$19:$Z$156,5,0),0)","v":167215},{"$f":"IFERROR(VLOOKUP($G$3,'[2]2021-22 Final'!$B:$R,4,0),0)","v":159039},0.3281029486676299,{"$f":"IFERROR(VLOOKUP($G$3,'[2]2020-21 Final'!$B:$R,4,0),0)","v":119749},null,{"$f":"VLOOKUP($G$2,#REF!,$B8,FALSE)","v":{"$error":"#REF!"}},{"$error":"#REF!"},{"$f":"VLOOKUP($G$2,#REF!,$B8,FALSE)","v":{"$error":"#REF!"}},{"$f":"IF(S8>0,Q8/S8,\"-\")","v":{"$error":"#REF!"}},{"$f":"VLOOKUP($G$2,#REF!,$B8,FALSE)","v":{"$error":"#REF!"}},{"$f":"IF(U8>0,S8/U8,\"-\")","v":{"$error":"#REF!"}},{"$f":"VLOOKUP($G$2,#REF!,$B8,FALSE)","v":{"$error":"#REF!"}},{"$error":"#REF!"},{"$f":"VLOOKUP($G$2,#REF!,$B8,FALSE)","v":{"$error":"#REF!"}},null,2,3,null,null,null,null,null,"College Place"]
[null,4,null,null,null,"Needs Support","Average Number",{"$f":"IFERROR(VLOOKUP($G$3,'2023-24 Final'!$B$19:$Z$156,6,0),0)","v":124},1.0081300813008129,{"$f":"IFERROR(VLOOKUP($G$3,'22-23 Final'!$B$19:$Z$156,6,0),0)","v":123},{"$f":"IFERROR(VLOOKUP($G$3,'[2]2021-22 Final'!$B:$R,5,0),0)","v":59},-1.6666666666666718E-2,{"$f":"IFERROR(VLOOKUP($G$3,'[2]2020-21 Final'!$B:$R,5,0),0)","v":60},null,{"$f":"VLOOKUP($G$2,#REF!,$B9,FALSE)","v":{"$error":"#REF!"}},{"$f":"IF(Q9=0,0,O9/Q9)","v":{"$error":"#REF!"}},{"$f":"VLOOKUP($G$2,#REF!,$B9,FALSE)","v":{"$error":"#REF!"}},{"$error":"#REF!"},{"$f":"VLOOKUP($G$2,#REF!,$B9,FALSE)","v":{"$error":"#REF!"}},{"$error":"#REF!"},{"$f":"VLOOKUP($G$2,#REF!,$B9,FALSE)","v":{"$error":"#REF!"}},{"$error":"#REF!"},{"$f":"VLOOKUP($G$2,#REF!,$B9,FALSE)","v":{"$error":"#REF!"}},null,1,4,null,null,null,null,null,"Columbia"]
[null,5,null,null,null,null,"Regular Dollars",{"$f":"IFERROR(VLOOKUP($G$3,'2023-24 Final'!$B$19:$Z$156,7,0),0)","v":13392},1.0105644431029279,{"$f":"IFERROR(VLOOKUP($G$3,'22-23 Final'!$B$19:$Z$156,7,0),0)","v":13252},{"$f":"IFERROR(VLOOKUP($G$3,'[2]2021-22 Final'!$B:$R,6,0),0)","v":6940},0.15531879473947052,{"$f":"IFERROR(VLOOKUP($G$3,'[2]2020-21 Final'!$B:$R,6,0),0)","v":6007},null,{"$f":"VLOOKUP($G$2,#REF!,$B10,FALSE)","v":{"$error":"#REF!"}},{"$f":"IF(Q10=0,0,O10/Q10)","v":{"$error":"#REF!"}},{"$f":"VLOOKUP($G$2,#REF!,$B10,FALSE)","v":{"$error":"#REF!"}},{"$error":"#REF!"},{"$f":"VLOOKUP($G$2,#REF!,$B10,FALSE)","v":{"$error":"#REF!"}},{"$error":"#REF!"},{"$f":"VLOOKUP($G$2,#REF!,$B10,FALSE)","v":{"$error":"#REF!"}},{"$error":"#REF!"},{"$f":"VLOOKUP($G$2,#REF!,$B10,FALSE)","v":{"$error":"#REF!"}},null,2,4,null,null,null,null,null,"Conway"]
{"$rows_left_out":74}
{"sheet":"2023-24 Final","index":1,"n_rows":164,"n_cols":26,"rows_kept":164,"cut":false,"hidden":true,"merged":[[1,3,1,6],[13,4,13,7],[14,4,14,5],[14,6,14,7],[14,8,14,9]]}
[null,null,null,null,null,null,null,null,null,"From Assumptions Page:"]
[null,null,null,"Constant Dollar Multipliers - Do Not Change Here",null,null,null,null,null,"Target Amounts",null,null,null,null,{"$f":"Assumptions!C24","v":21091065}]
[null,null,null,{"$f":"[2]Assumptions!$AO$4","v":0},null,2.0369691980863958E+66,431.9855955208256,"Use CTRL K",null,"Actual Amounts",null,null,null,null,{"$f":"O18","v":21091065}]
[null,null,null,null,null,null,null,null,null,"Difference",null,null,null,null,{"$f":"O3-O2","v":0}]
[]
[null,null,null,null,null,null,null,null,null,{"$f":"O18","v":21091065}]
[null,null,null,null,null,null,null,"Put total here",null,{"$f":"Assumptions!C24","v":21091065}]
[]
[]
[null,null,null,null,null,null,null,null,null,"Go to H9 & Control K to set dollar amount"]
{"$rows_left_out":155}
{"sheet":"Assumptions","index":2,"n_rows":61,"n_cols":36,"rows_kept":61,"cut":false,"hidden":true,"merged":[[6,33,21,33]]}
["Assumptions and Factors — Title I Part C Migrant - Final"]
[null,"Caution: Yellow Cells below drive are inputs into the calculations in this model"]
[null,null,null,null,null,null,null,null,null,null,null,null,null,null,null,null,null,null,null,null,null,null,null,null,null,null,null,null,null,null,null,null,null,null,null,"Row Headings on Allocation Table"]
["Funding",null,"FINAL 2023-24","Preliminary 2023-24","Final 2022-23","Preliminary 2022-23","Final 2021-22","Preliminary 2021-22","Final 2020-21","Preliminary 2020-21","Final 2019-20","Preliminary 2019-20","Final 2018-19","Preliminary 2018-19","Final 2017-18","Preliminary 2017-18","2nd Rev Final 2016-17","Rev Final 2016-17","Final 2016-17","Final 2015-16","Preliminary 2015-16","Final 2014-15","Preliminary 2014-15","Revised Final 2013-14","Final 2013-14","Final 2012-13","Preliminary 2012-13","Final 2011-12","Preliminary \n2011-12","Final\n2010-11","Final 2009-10","Final 2008-09","Source: "]
[null,"Total State Allocation",38616843,38616843,38126160,"38,168,234",36172055,36170767,33650164,32545772,29253692,28509499,27865765,26740196,24667573,24540413,14921087,14921087,14921087,14921087,14875015,14875015,14875015,14839257,14839257,15628872,15628872,15659257,15659257,15691456,14450894,15015291]
[null,"State Allocation under $14B rule",28466965,28448427,{"$f":"'[5]Final T-I State Admin 1004(b)'!$C$60","v":29491607},{"$f":"'[6]Prel. T-I State Admin 1004(b)'!$C$60","v":29524149},29680217,29680217,28007581,32545800,23817704,23834846,21267203,21267203,13112612,13104377,13566765,13616032,13566765,14077428,14055099,14085411,14041918,14645076,14645076,14620622,14620622,14680941,14680941,14980942]
["General Admin","State Admin",{"$f":"ROUND(C6*0.01,0)","v":284670},284484,294916,295241,296802,296802,280076,325458,{"$f":"ROUND(K6*0.01,0)","v":238177},238348,212672,212672,131126,131044,135668,136160,135668,140774,140551,140854,140419,146451,{"$f":"ROUND(Y6*0.01,0)","v":146451},{"$f":"ROUND(Z6*0.01,0)","v":146206},{"$f":"ROUND(AA6*0.01,0)","v":146206},{"$f":"ROUND(AB6*0.01,0)","v":146809},{"$f":"ROUND(14680941*0.01,0)","v":146809},{"$f":"ROUND(14680942*0.01,0)","v":146809},{"$f":"ROUND(13563693*0.01,0)","v":135637},{"$f":"ROUND(14649429*0.01,0)","v":146494},0.01]
[null,"State Level Activities (Unallocated Balance)",{"$f":"C5-C7-C18-C24","v":15061378},15162254,14955548,14972053,13087588,13086382,13179990,{"$f":"J5-J7-J18-J24","v":12692851},10935689,11551691,11233633,10783406,9920983,12702535,3078585,3078093,4570694,2999662,2953813,3913523,2273028,14692806,14692806,15482666,15482666,15512448,15512448,15544647,14315257,536592]
[]
["Other Admin","Director salary"]
{"$rows_left_out":52}
{"sheet":"Enrollment","index":3,"n_rows":147,"n_cols":6,"rows_kept":147,"cut":false,"hidden":true,"merged":[]}
["CO_DIST_NUM","DIST_TITLE","ESD","AVG STUDENTS","PRIORITY","NEEDY"]
["14005","ABERDEEN",189,114,58,38]
["29103","ANACORTES",189,11,10,0]
["31016","ARLINGTON",189,41,26,12]
["17408","AUBURN",189,37,28,6]
["06119","BATTLE GROUND",189,23,21,0]
["37501","BELLINGHAM",189,128,70,43]
["27403","BETHEL",189,16,13,2]
["18100","BREMERTON",189,61,38,13]
["24111","BREWSTER",171,237,156,43]
{"$rows_left_out":138}
{"sheet":"Rural and Low Income 23-24","index":4,"n_rows":136,"n_cols":4,"rows_kept":136,"cut":false,"hidden":true,"merged":[]}
["CoDis","Local Education Agency (LEA)",null,"Ask Tony May for the list of current year REAP amd RLIS districts"]
["14005","Aberdeen School District"]
["22017","Almira School District"]
["01122","Benge School District"]
["20203","Bickleton School District"]
["21234","Boistfort School District"]
["24111","Brewster School District"]
["09075","Bridgeport School District"]
["16046","Brinnon School District"]
["05401","Cape Flattery School District"]
{"$rows_left_out":127}
{"sheet":"other funds ftr 2023","index":5,"n_rows":139,"n_cols":9,"rows_kept":139,"cut":false,"hidden":true,"merged":[]}
["CCDDD","Migrant Districts","Title III 22-23","Title I A 22-23","LAP 22-23","TBIP 22-23","Title I C 22-23","Title I C as % of Revs","\"Other Funds\" Factor"]
["14005","ABERDEEN",{"$f":"IFERROR(VLOOKUP(A2,'[7]Allocation 2022-23'!$B$9:$AC$326,20,FALSE),0)","v":63316},{"$f":"IFERROR(VLOOKUP(A2,'[8]22-23 Revised Final'!$A$13:$CI$328,81,FALSE),0)","v":1490904},{"$f":"IFERROR(VLOOKUP(A2,[9]Sheet1!$A$3:$D$379,3,FALSE),0)","v":2389675.21},{"$f":"IFERROR(VLOOKUP(A2,[9]Sheet1!$A$3:$D$379,4,FALSE),0)","v":699060.11},{"$f":"IFERROR(VLOOKUP(A2,'[3]2022-23 Final'!$B$19:$S$156,18,FALSE),0)","v":80840},{"$f":"IFERROR(G2/SUM(C2:G2),0)","v":1.7113357908995937E-2},{"$f":"_xlfn.IFS('other funds ftr 2023'!H2<=Assumptions!$D$57,Assumptions!$B$57,'other funds ftr 2023'!H2<=Assumptions!$D$58,Assumptions!$B$58,'other funds ftr 2023'!H2<=Assumptions!$D$59,Assumptions!$B$59,'other funds ftr 2023'!H2<=Assumptions!$D$60,Assumptions!$B$60,'other funds ftr 2023'!H2<=Assumptions!$D$61,Assumptions!$B$61)","v":1.1499999999999999}]
["29103","ANACORTES",{"$f":"IFERROR(VLOOKUP(A3,'[7]Allocation 2022-23'!$B$9:$AC$326,20,FALSE),0)","v":0},{"$f":"IFERROR(VLOOKUP(A3,'[8]22-23 Revised Final'!$A$13:$CI$328,81,FALSE),0)","v":434805},{"$f":"IFERROR(VLOOKUP(A3,[9]Sheet1!$A$3:$D$379,3,FALSE),0)","v":553826.38},{"$f":"IFERROR(VLOOKUP(A3,[9]Sheet1!$A$3:$D$379,4,FALSE),0)","v":107381.29},{"$f":"IFERROR(VLOOKUP(A3,'[3]2022-23 Final'!$B$19:$S$156,18,FALSE),0)","v":0},0,{"$f":"_xlfn.IFS('other funds ftr 2023'!H3<=Assumptions!$D$57,Assumptions!$B$57,'other funds ftr 2023'!H3<=Assumptions!$D$58,Assumptions!$B$58,'other funds ftr 2023'!H3<=Assumptions!$D$59,Assumptions!$B$59,'other funds ftr 2023'!H3<=Assumptions!$D$60,Assumptions!$B$60,'other funds ftr 2023'!H3<=Assumptions!$D$61,Assumptions!$B$61)","v":1.1499999999999999}]
["31016","ARLINGTON",{"$f":"IFERROR(VLOOKUP(A4,'[7]Allocation 2022-23'!$B$9:$AC$326,20,FALSE),0)","v":39022},{"$f":"IFERROR(VLOOKUP(A4,'[8]22-23 Revised Final'!$A$13:$CI$328,81,FALSE),0)","v":636952},{"$f":"IFERROR(VLOOKUP(A4,[9]Sheet1!$A$3:$D$379,3,FALSE),0)","v":1292476.79},{"$f":"IFERROR(VLOOKUP(A4,[9]Sheet1!$A$3:$D$379,4,FALSE),0)","v":599452.31000000006},{"$f":"IFERROR(VLOOKUP(A4,'[3]2022-23 Final'!$B$19:$S$156,18,FALSE),0)","v":0},0,{"$f":"_xlfn.IFS('other funds ftr 2023'!H4<=Assumptions!$D$57,Assumptions!$B$57,'other funds ftr 2023'!H4<=Assumptions!$D$58,Assumptions!$B$58,'other funds ftr 2023'!H4<=Assumptions!$D$59,Assumptions!$B$59,'other funds ftr 2023'!H4<=Assumptions!$D$60,Assumptions!$B$60,'other funds ftr 2023'!H4<=Assumptions!$D$61,Assumptions!$B$61)","v":1.1499999999999999}]
["17408","AUBURN",{"$f":"IFERROR(VLOOKUP(A5,'[7]Allocation 2022-23'!$B$9:$AC$326,20,FALSE),0)","v":569027},{"$f":"IFERROR(VLOOKUP(A5,'[8]22-23 Revised Final'!$A$13:$CI$328,81,FALSE),0)","v":4079279},{"$f":"IFERROR(VLOOKUP(A5,[9]Sheet1!$A$3:$D$379,3,FALSE),0)","v":10931433.630000001},{"$f":"IFERROR(VLOOKUP(A5,[9]Sheet1!$A$3:$D$379,4,FALSE),0)","v":8543746.25},{"$f":"IFERROR(VLOOKUP(A5,'[3]2022-23 Final'!$B$19:$S$156,18,FALSE),0)","v":0},0,{"$f":"_xlfn.IFS('other funds ftr 2023'!H5<=Assumptions!$D$57,Assumptions!$B$57,'other funds ftr 2023'!H5<=Assumptions!$D$58,Assumptions!$B$58,'other funds ftr 2023'!H5<=Assumptions!$D$59,Assumptions!$B$59,'other funds ftr 2023'!H5<=Assumptions!$D$60,Assumptions!$B$60,'other funds ftr 2023'!H5<=Assumptions!$D$61,Assumptions!$B$61)","v":1.1499999999999999}]
["06119","BATTLE GROUND",{"$f":"IFERROR(VLOOKUP(A6,'[7]Allocation 2022-23'!$B$9:$AC$326,20,FALSE),0)","v":113227},{"$f":"IFERROR(VLOOKUP(A6,'[8]22-23 Revised Final'!$A$13:$CI$328,81,FALSE),0)","v":1783766},{"$f":"IFERROR(VLOOKUP(A6,[9]Sheet1!$A$3:$D$379,3,FALSE),0)","v":2792916.01},{"$f":"IFERROR(VLOOKUP(A6,[9]Sheet1!$A$3:$D$379,4,FALSE),0)","v":1872851.59},{"$f":"IFERROR(VLOOKUP(A6,'[3]2022-23 Final'!$B$19:$S$156,18,FALSE),0)","v":0},0,{"$f":"_xlfn.IFS('other funds ftr 2023'!H6<=Assumptions!$D$57,Assumptions!$B$57,'other funds ftr 2023'!H6<=Assumptions!$D$58,Assumptions!$B$58,'other funds ftr 2023'!H6<=Assumptions!$D$59,Assumptions!$B$59,'other funds ftr 2023'!H6<=Assumptions!$D$60,Assumptions!$B$60,'other funds ftr 2023'!H6<=Assumptions!$D$61,Assumptions!$B$61)","v":1.1499999999999999}]
["17405","BELLEVUE",{"$f":"IFERROR(VLOOKUP(A7,'[7]Allocation 2022-23'!$B$9:$AC$326,20,FALSE),0)","v":421685},{"$f":"IFERROR(VLOOKUP(A7,'[8]22-23 Revised Final'!$A$13:$CI$328,81,FALSE),0)","v":1936298},{"$f":"IFERROR(VLOOKUP(A7,[9]Sheet1!$A$3:$D$379,3,FALSE),0)","v":2619874.4500000002},{"$f":"IFERROR(VLOOKUP(A7,[9]Sheet1!$A$3:$D$379,4,FALSE),0)","v":6382409.3700000001},{"$f":"IFERROR(VLOOKUP(A7,'[3]2022-23 Final'!$B$19:$S$156,18,FALSE),0)","v":0},0,{"$f":"_xlfn.IFS('other funds ftr 2023'!H7<=Assumptions!$D$57,Assumptions!$B$57,'other funds ftr 2023'!H7<=Assumptions!$D$58,Assumptions!$B$58,'other funds ftr 2023'!H7<=Assumptions!$D$59,Assumptions!$B$59,'other funds ftr 2023'!H7<=Assumptions!$D$60,Assumptions!$B$60,'other funds ftr 2023'!H7<=Assumptions!$D$61,Assumptions!$B$61)","v":1.1499999999999999}]
["37501","BELLINGHAM",{"$f":"IFERROR(VLOOKUP(A8,'[7]Allocation 2022-23'!$B$9:$AC$326,20,FALSE),0)","v":113462},{"$f":"IFERROR(VLOOKUP(A8,'[8]22-23 Revised Final'!$A$13:$CI$328,81,FALSE),0)","v":2293509},{"$f":"IFERROR(VLOOKUP(A8,[9]Sheet1!$A$3:$D$379,3,FALSE),0)","v":3611543.52},{"$f":"IFERROR(VLOOKUP(A8,[9]Sheet1!$A$3:$D$379,4,FALSE),0)","v":1607253.37},{"$f":"IFERROR(VLOOKUP(A8,'[3]2022-23 Final'!$B$19:$S$156,18,FALSE),0)","v":0},0,{"$f":"_xlfn.IFS('other funds ftr 2023'!H8<=Assumptions!$D$57,Assumptions!$B$57,'other funds ftr 2023'!H8<=Assumptions!$D$58,Assumptions!$B$58,'other funds ftr 2023'!H8<=Assumptions!$D$59,Assumptions!$B$59,'other funds ftr 2023'!H8<=Assumptions!$D$60,Assumptions!$B$60,'other funds ftr 2023'!H8<=Assumptions!$D$61,Assumptions!$B$61)","v":1.1499999999999999}]
["27403","BETHEL",{"$f":"IFERROR(VLOOKUP(A9,'[7]Allocation 2022-23'!$B$9:$AC$326,20,FALSE),0)","v":176706},{"$f":"IFERROR(VLOOKUP(A9,'[8]22-23 Revised Final'!$A$13:$CI$328,81,FALSE),0)","v":3955849},{"$f":"IFERROR(VLOOKUP(A9,[9]Sheet1!$A$3:$D$379,3,FALSE),0)","v":8879764.1099999994},{"$f":"IFERROR(VLOOKUP(A9,[9]Sheet1!$A$3:$D$379,4,FALSE),0)","v":2329625.17},{"$f":"IFERROR(VLOOKUP(A9,'[3]2022-23 Final'!$B$19:$S$156,18,FALSE),0)","v":0},0,{"$f":"_xlfn.IFS('other funds ftr 2023'!H9<=Assumptions!$D$57,Assumptions!$B$57,'other funds ftr 2023'!H9<=Assumptions!$D$58,Assumptions!$B$58,'other funds ftr 2023'!H9<=Assumptions!$D$59,Assumptions!$B$59,'other funds ftr 2023'!H9<=Assumptions!$D$60,Assumptions!$B$60,'other funds ftr 2023'!H9<=Assumptions!$D$61,Assumptions!$B$61)","v":1.1499999999999999}]
["18100","BREMERTON",{"$f":"IFERROR(VLOOKUP(A10,'[7]Allocation 2022-23'!$B$9:$AC$326,20,FALSE),0)","v":66365},{"$f":"IFERROR(VLOOKUP(A10,'[8]22-23 Revised Final'!$A$13:$CI$328,81,FALSE),0)","v":1585413},{"$f":"IFERROR(VLOOKUP(A10,[9]Sheet1!$A$3:$D$379,3,FALSE),0)","v":3596920.98},{"$f":"IFERROR(VLOOKUP(A10,[9]Sheet1!$A$3:$D$379,4,FALSE),0)","v":905894.92},{"$f":"IFERROR(VLOOKUP(A10,'[3]2022-23 Final'!$B$19:$S$156,18,FALSE),0)","v":45790},7.3850265948855196E-3,{"$f":"_xlfn.IFS('other funds ftr 2023'!H10<=Assumptions!$D$57,Assumptions!$B$57,'other funds ftr 2023'!H10<=Assumptions!$D$58,Assumptions!$B$58,'other funds ftr 2023'!H10<=Assumptions!$D$59,Assumptions!$B$59,'other funds ftr 2023'!H10<=Assumptions!$D$60,Assumptions!$B$60,'other funds ftr 2023'!H10<=Assumptions!$D$61,Assumptions!$B$61)","v":1.1499999999999999}]
{"$rows_left_out":130}
{"sheet":"CCDDD","index":6,"n_rows":163,"n_cols":3,"rows_kept":163,"cut":false,"hidden":true,"merged":[]}
["14005","ABERDEEN",{"$f":"A1","v":"14005"}]
["29103","ANACORTES",{"$f":"A2","v":"29103"}]
["31016","ARLINGTON","31016"]
["17408","AUBURN","17408"]
["06119","BATTLE GROUND","06119"]
["17405","BELLEVUE","17405"]
["37501","BELLINGHAM","37501"]
["27403","BETHEL","27403"]
["37503","BLAINE","37503"]
["18100","BREMERTON","18100"]
{"$rows_left_out":154}
{"sheet":"22-23 Final","index":7,"n_rows":157,"n_cols":26,"rows_kept":157,"cut":false,"hidden":true,"merged":[[1,3,1,6],[13,4,13,7],[14,4,14,5],[14,6,14,7],[14,8,14,9]]}
[null,null,null,null,null,null,null,null,null,"From Assumptions Page:"]
[null,null,null,"Constant Dollar Multipliers - Do Not Change Here",null,null,null,null,null,"Target Amounts",null,null,null,null,{"$f":"[3]Assumptions!C24","v":20768148}]
[null,null,null,{"$f":"[2]Assumptions!$AO$4","v":0},null,2.0369691980863958E+66,430.96546751960977,"Use CTRL K",null,"Actual Amounts",null,null,null,null,{"$f":"O18","v":20768148}]
[null,null,null,null,null,null,null,null,null,"Difference",null,null,null,null,{"$f":"O3-O2","v":0}]
[]
[null,null,null,null,null,null,null,null,null,{"$f":"O18","v":20768148}]
[null,null,null,null,null,null,null,"Put total here",null,{"$f":"[3]Assumptions!C24","v":20768148}]
[]
[]
[null,null,null,null,null,null,null,null,null,"Go to H9 & Control K to set dollar amount"]
{"$rows_left_out":147}