{"text_format":"1","workbook":"xlsx","n_sheets":7,"sheets":["District","Allocation 2024-25 Prelim","24-25 Adjusted Formula counts","Assumptions","Allocation 2023-24 Final","23-24 Adjusted Formula counts","CCDDD"],"not_rendered":{"charts":0,"images":0,"macros":1,"external_links":2,"defined_names":14,"comments":0,"pivot_tables":0},"unopened":[],"bounds":{"document_bytes":16777216,"sheet_cells":100000,"rows_first":2000,"rows_last":500,"rows_between":2000,"halvings":0,"cell_chars":16384,"cell_head_chars":4096},"cells_cut":0,"cells_raw":0,"read":"whole","date_system":"1900"}

{"sheet":"District","index":0,"n_rows":24,"n_cols":17,"rows_kept":24,"cut":false,"hidden":false,"merged":[[3,3,3,10],[4,3,4,6]]}
[]
[null,null,null,"2024-2025","2023-2024","2022-23","2021-22","2021-22","2020-21","2020-21","2019-20","2019-20","2018-19","2017-18","2016-17","2015-16","2014-15"]
[null,null,null,"Preliminary","Final","Preliminary","Final","Preliminary","Final","Preliminary","Final","Preliminary","Final","2nd Revised","Revised"]
[null,null,"Select District Name","ARLINGTON"]
[null,null,"District Code (CCDDD)",{"$f":"VLOOKUP(D4,CCDDD!D:F,3,FALSE)","v":"31016"}]
[]
[null,null,"Eisenhower 2001-02 Allocations",{"$f":"VLOOKUP($D$5,'Allocation 2024-25 Prelim'!$A$7:$S$323,4,FALSE)","v":0},{"$f":"VLOOKUP($D$5,'Allocation 2023-24 Final'!$A$7:$L$322,4,FALSE)","v":0},{"$f":"VLOOKUP($D$5,'[1]Allocation 2022-23 P'!$A$7:$M$321,3,FALSE)","v":0},{"$f":"VLOOKUP($D$5,'[2]Allocation 2021-22 Final'!$A$7:$U$321,3,FALSE)","v":0},{"$f":"VLOOKUP($D$5,'[1]Allocation 2021-22 Preliminary'!$A$7:$M$321,3,FALSE)","v":0},{"$f":"IFERROR(VLOOKUP($D$5,'[1]Allocation 2020-21 Final'!$A$7:$M$317,3,FALSE),0)","v":0},{"$f":"IFERROR(VLOOKUP($D$5,'[1]Allocation 2020-21 Preliminary'!$A$7:$M$318,3,FALSE),0)","v":0},{"$f":"IFERROR(VLOOKUP($D$5,'[1]Allocation 2019-20 Final'!$A$7:$M$314,3,FALSE),0)","v":0},{"$f":"IFERROR(VLOOKUP($D$5,'[1]Allocation 2019-20 Preliminary'!$A$7:$M$316,3,FALSE),0)","v":0},{"$f":"IFERROR(VLOOKUP($D$5,'[1]Allocation 2018-19 Final'!$A$7:$M$316,3,FALSE),0)","v":0},{"$f":"VLOOKUP($D$5,'[1]Allocation 2017-18 2ndRev_Final'!$A$7:$M$315,3,FALSE)","v":0},{"$f":"VLOOKUP($D$5,'[1]Allocation 2016-17 rev_Final'!$A$7:$M$314,3,FALSE)","v":17804},{"$f":"VLOOKUP($D$5,'[1]Allocation 2015-16 Final'!$A$7:$M$313,3,FALSE)","v":17804},{"$f":"VLOOKUP($D$5,'[1]Allocation 2014-15 Final'!$A$7:$M$304,3,FALSE)","v":17804}]
[null,null,"Class Size Reduction allocations 2001-02",{"$f":"VLOOKUP($D$5,'Allocation 2024-25 Prelim'!$A$7:$S$323,5,FALSE)","v":0},{"$f":"VLOOKUP($D$5,'Allocation 2023-24 Final'!$A$7:$L$322,5,FALSE)","v":0},{"$f":"VLOOKUP($D$5,'[1]Allocation 2022-23 P'!$A$7:$M$321,4,FALSE)","v":0},{"$f":"VLOOKUP($D$5,'[2]Allocation 2021-22 Final'!$A$7:$U$321,4,FALSE)","v":0},{"$f":"VLOOKUP($D$5,'[1]Allocation 2021-22 Preliminary'!$A$7:$M$321,4,FALSE)","v":0},{"$f":"IFERROR(VLOOKUP($D$5,'[1]Allocation 2020-21 Final'!$A$7:$M$317,4,FALSE),0)","v":0},{"$f":"IFERROR(VLOOKUP($D$5,'[1]Allocation 2020-21 Preliminary'!$A$7:$M$318,4,FALSE),0)","v":0},{"$f":"IFERROR(VLOOKUP($D$5,'[1]Allocation 2019-20 Final'!$A$7:$M$314,4,FALSE),0)","v":0},{"$f":"IFERROR(VLOOKUP($D$5,'[1]Allocation 2019-20 Preliminary'!$A$7:$M$316,4,FALSE),0)","v":0},{"$f":"IFERROR(VLOOKUP($D$5,'[1]Allocation 2018-19 Final'!$A$7:$M$316,4,FALSE),0)","v":0},{"$f":"VLOOKUP($D$5,'[1]Allocation 2017-18 2ndRev_Final'!$A$7:$M$315,4,FALSE)","v":0},{"$f":"VLOOKUP($D$5,'[1]Allocation 2016-17 rev_Final'!$A$7:$M$314,4,FALSE)","v":75126},{"$f":"VLOOKUP($D$5,'[1]Allocation 2015-16 Final'!$A$7:$M$313,4,FALSE)","v":75126},{"$f":"VLOOKUP($D$5,'[1]Allocation 2014-15 Final'!$A$7:$M$304,4,FALSE)","v":75126}]
[]
[null,null,"Census Population Ages 5-17",{"$f":"VLOOKUP($D$5,'Allocation 2024-25 Prelim'!$A$7:$S$323,6,FALSE)","v":5915},{"$f":"VLOOKUP($D$5,'Allocation 2023-24 Final'!$A$7:$L$322,6,FALSE)","v":5998},{"$f":"VLOOKUP($D$5,'[1]Allocation 2022-23 P'!$A$7:$M$321,5,FALSE)","v":6040},{"$f":"VLOOKUP($D$5,'[2]Allocation 2021-22 Final'!$A$7:$U$321,5,FALSE)","v":5966},{"$f":"VLOOKUP($D$5,'[1]Allocation 2021-22 Preliminary'!$A$7:$M$321,5,FALSE)","v":5966},{"$f":"IFERROR(VLOOKUP($D$5,'[1]Allocation 2020-21 Final'!$A$7:$M$317,5,FALSE),0)","v":5983},{"$f":"IFERROR(VLOOKUP($D$5,'[1]Allocation 2020-21 Preliminary'!$A$7:$M$318,5,FALSE),0)","v":5983},{"$f":"IFERROR(VLOOKUP($D$5,'[1]Allocation 2019-20 Final'!$A$7:$M$314,5,FALSE),0)","v":5918},{"$f":"IFERROR(VLOOKUP($D$5,'[1]Allocation 2019-20 Preliminary'!$A$7:$M$316,5,FALSE),0)","v":5918},{"$f":"IFERROR(VLOOKUP($D$5,'[1]Allocation 2018-19 Final'!$A$7:$M$315,5,FALSE),0)","v":5859},{"$f":"VLOOKUP($D$5,'[1]Allocation 2017-18 2ndRev_Final'!$A$7:$M$315,5,FALSE)","v":5850},{"$f":"VLOOKUP($D$5,'[1]Allocation 2016-17 rev_Final'!$A$7:$M$314,5,FALSE)","v":5816},{"$f":"VLOOKUP($D$5,'[1]Allocation 2015-16 Final'!$A$7:$M$313,5,FALSE)","v":5755},{"$f":"VLOOKUP($D$5,'[1]Allocation 2014-15 Final'!$A$7:$M$304,5,FALSE)","v":5684}]
[null,null,"20%  based on Total Pop",{"$f":"VLOOKUP($D$5,'Allocation 2024-25 Prelim'!$A$7:$S$323,7,FALSE)","v":31801},{"$f":"VLOOKUP($D$5,'Allocation 2023-24 Final'!$A$7:$L$322,7,FALSE)","v":32187},{"$f":"VLOOKUP($D$5,'[1]Allocation 2022-23 P'!$A$7:$M$321,6,FALSE)","v":32073},{"$f":"VLOOKUP($D$5,'[2]Allocation 2021-22 Final'!$A$7:$U$321,6,FALSE)","v":32486},{"$f":"VLOOKUP($D$5,'[1]Allocation 2021-22 Preliminary'!$A$7:$M$321,6,FALSE)","v":32465},{"$f":"IFERROR(VLOOKUP($D$5,'[1]Allocation 2020-21 Final'!$A$7:$M$317,6,FALSE),0)","v":32151},{"$f":"IFERROR(VLOOKUP($D$5,'[1]Allocation 2020-21 Preliminary'!$A$7:$M$318,6,FALSE),0)","v":32114},{"$f":"IFERROR(VLOOKUP($D$5,'[1]Allocation 2019-20 Final'!$A$7:$M$314,6,FALSE),0)","v":32322},{"$f":"IFERROR(VLOOKUP($D$5,'[1]Allocation 2019-20 Preliminary'!$A$7:$M$316,6,FALSE),0)","v":32243},{"$f":"IFERROR(VLOOKUP($D$5,'[1]Allocation 2018-19 Final'!$A$7:$M$315,6,FALSE),0)","v":31602},{"$f":"VLOOKUP($D$5,'[1]Allocation 2017-18 Rev_Final'!$A$7:$M$315,6,FALSE)","v":31867},{"$f":"VLOOKUP($D$5,'[1]Allocation 2016-17 rev_Final'!$A$7:$M$314,6,FALSE)","v":2488},{"$f":"VLOOKUP($D$5,'[1]Allocation 2015-16 Final'!$A$7:$M$313,6,FALSE)","v":3326},{"$f":"VLOOKUP($D$5,'[1]Allocation 2014-15 Final'!$A$7:$M$304,6,FALSE)","v":3292}]
[null,null,"Census Poverty Ages 5-17",{"$f":"VLOOKUP($D$5,'Allocation 2024-25 Prelim'!$A$7:$S$323,8,FALSE)","v":554},{"$f":"VLOOKUP($D$5,'Allocation 2023-24 Final'!$A$7:$L$322,8,FALSE)","v":465},{"$f":"VLOOKUP($D$5,'[1]Allocation 2022-23 P'!$A$7:$M$321,7,FALSE)","v":369},{"$f":"VLOOKUP($D$5,'[2]Allocation 2021-22 Final'!$A$7:$U$321,7,FALSE)","v":369},{"$f":"VLOOKUP($D$5,'[1]Allocation 2021-22 Preliminary'!$A$7:$M$321,7,FALSE)","v":369},{"$f":"IFERROR(VLOOKUP($D$5,'[1]Allocation 2020-21 Final'!$A$7:$M$317,7,FALSE),0)","v":345},{"$f":"IFERROR(VLOOKUP($D$5,'[1]Allocation 2020-21 Preliminary'!$A$7:$M$318,7,FALSE),0)","v":345},{"$f":"IFERROR(VLOOKUP($D$5,'[1]Allocation 2019-20 Final'!$A$7:$M$314,7,FALSE),0)","v":388},{"$f":"IFERROR(VLOOKUP($D$5,'[1]Allocation 2019-20 Preliminary'!$A$7:$M$316,7,FALSE),0)","v":388},{"$f":"IFERROR(VLOOKUP($D$5,'[1]Allocation 2018-19 Final'!$A$7:$M$316,7,FALSE),0)","v":411},{"$f":"VLOOKUP($D$5,'[1]Allocation 2017-18 2ndRev_Final'!$A$7:$M$315,7,FALSE)","v":582},{"$f":"VLOOKUP($D$5,'[1]Allocation 2016-17 rev_Final'!$A$7:$M$314,7,FALSE)","v":684},{"$f":"VLOOKUP($D$5,'[1]Allocation 2015-16 Final'!$A$7:$M$313,7,FALSE)","v":647},{"$f":"VLOOKUP($D$5,'[1]Allocation 2014-15 Final'!$A$7:$M$304,7,FALSE)","v":534}]
[null,null,"80% based on Low Inc Pop",{"$f":"VLOOKUP($D$5,'Allocation 2024-25 Prelim'!$A$7:$S$323,9,FALSE)","v":109761},{"$f":"VLOOKUP($D$5,'Allocation 2023-24 Final'!$A$7:$L$322,9,FALSE)","v":90599},{"$f":"VLOOKUP($D$5,'[1]Allocation 2022-23 P'!$A$7:$M$321,8,FALSE)","v":82428},{"$f":"VLOOKUP($D$5,'[2]Allocation 2021-22 Final'!$A$7:$U$321,8,FALSE)","v":73299},{"$f":"VLOOKUP($D$5,'[1]Allocation 2021-22 Preliminary'!$A$7:$M$321,8,FALSE)","v":73202},{"$f":"IFERROR(VLOOKUP($D$5,'[1]Allocation 2020-21 Final'!$A$7:$M$317,8,FALSE),0)","v":64468},{"$f":"IFERROR(VLOOKUP($D$5,'[1]Allocation 2020-21 Preliminary'!$A$7:$M$318,8,FALSE),0)","v":64393},{"$f":"IFERROR(VLOOKUP($D$5,'[1]Allocation 2019-20 Final'!$A$7:$M$314,8,FALSE),0)","v":64626},{"$f":"IFERROR(VLOOKUP($D$5,'[1]Allocation 2019-20 Preliminary'!$A$7:$M$316,8,FALSE),0)","v":64467},{"$f":"IFERROR(VLOOKUP($D$5,'[1]Allocation 2018-19 Final'!$A$7:$M$316,8,FALSE),0)","v":70738},{"$f":"VLOOKUP($D$5,'[1]Allocation 2017-18 2ndRev_Final'!$A$7:$M$315,8,FALSE)","v":89590},{"$f":"VLOOKUP($D$5,'[1]Allocation 2016-17 rev_Final'!$A$7:$M$314,8,FALSE)","v":7412},{"$f":"VLOOKUP($D$5,'[1]Allocation 2015-16 Final'!$A$7:$M$313,8,FALSE)","v":8836},{"$f":"VLOOKUP($D$5,'[1]Allocation 2014-15 Final'!$A$7:$M$304,8,FALSE)","v":7314}]
[]
[null,null,"Total Allocation",{"$f":"VLOOKUP($D$5,'Allocation 2024-25 Prelim'!$A$7:$S$323,11,FALSE)","v":141562},{"$f":"VLOOKUP($D$5,'Allocation 2023-24 Final'!$A$7:$S$322,11,FALSE)","v":122786},{"$f":"VLOOKUP($D$5,'[1]Allocation 2022-23 P'!$A$7:$R$321,18,FALSE)","v":114501},{"$f":"VLOOKUP($D$5,'[2]Allocation 2021-22 Final'!$A$7:$U$321,10,FALSE)","v":105785},{"$f":"VLOOKUP($D$5,'[1]Allocation 2021-22 Preliminary'!$A$7:$R$321,18,FALSE)","v":105667},{"$f":"IFERROR(VLOOKUP($D$5,'[1]Allocation 2020-21 Final'!$A$7:$R$317,18,FALSE),0)","v":96619},{"$f":"IFERROR(VLOOKUP($D$5,'[1]Allocation 2020-21 Preliminary'!$A$7:$R$318,18,FALSE),0)","v":96507},{"$f":"IFERROR(VLOOKUP($D$5,'[1]Allocation 2019-20 Final'!$A$7:$R$314,18,FALSE),0)","v":96948},{"$f":"IFERROR(VLOOKUP($D$5,'[1]Allocation 2019-20 Preliminary'!$A$7:$R$316,18,FALSE),0)","v":96710},{"$f":"IFERROR(VLOOKUP($D$5,'[1]Allocation 2018-19 Final'!$A$7:$R$316,18,FALSE),0)","v":102340},{"$f":"VLOOKUP($D$5,'[1]Allocation 2017-18 2ndRev_Final'!$A$7:$R$315,18,FALSE)","v":121642},{"$f":"VLOOKUP($D$5,'[1]Allocation 2016-17 rev_Final'!$A$7:$R$314,18,FALSE)-IF(D4=\"Seattle\",11,0)","v":102819},{"$f":"VLOOKUP($D$5,'[1]Allocation 2015-16 Final'!$A$7:$R$313,18,FALSE)-IF(D4=\"Seattle\",6,0)","v":105066},{"$f":"VLOOKUP($D$5,'[1]Allocation 2014-15 Final'!$A$7:$R$304,18,FALSE)","v":103510}]
[null,null,"Poverty Percentage",{"$f":"IF(D10=0,0,D12/D10)","v":9.3660185967878271E-2},{"$f":"IF(E10=0,0,E12/E10)","v":7.7525841947315766E-2},6.1092715231788081E-2,6.1850486087831044E-2,6.1850486087831044E-2,5.7663379575463816E-2,5.7663379575463816E-2,6.5562690098006082E-2,6.5562690098006082E-2,7.0148489503328207E-2,9.9487179487179486E-2,0.11760660247592847,0.11242397914856646,9.3947923997185087E-2]
[]
[null,null,"MOE Reduction Percentage",{"$f":"VLOOKUP($D$5,'Allocation 2024-25 Prelim'!$A$7:$S$323,17,FALSE)","v":0},{"$f":"VLOOKUP($D$5,'Allocation 2023-24 Final'!$A$7:$S$322,17,FALSE)","v":0},0,{"$f":"VLOOKUP($D$5,'[2]Allocation 2021-22 Final'!$A$7:$U$321,19,FALSE)","v":0},{"$f":"IF(VLOOKUP($D$5,'[1]Allocation 2021-22 Preliminary'!$A$7:$T$321,19,FALSE)=0,0,VLOOKUP($D$5,'[1]Allocation 2021-22 Preliminary'!$A$7:$T$321,19,FALSE)-0.9)","v":0},{"$f":"IFERROR(IF(VLOOKUP($D$5,'[1]Allocation 2020-21 Final'!$A$7:$T$317,19,FALSE)=0,0,VLOOKUP($D$5,'[1]Allocation 2020-21 Final'!$A$7:$T$317,19,FALSE)-0.9),0)","v":0},{"$f":"IFERROR(IF(VLOOKUP($D$5,'[1]Allocation 2020-21 Preliminary'!$A$7:$T$318,19,FALSE)=0,0,VLOOKUP($D$5,'[1]Allocation 2020-21 Preliminary'!$A$7:$T$318,19,FALSE)-0.9),0)","v":0},{"$f":"IFERROR(IF(VLOOKUP($D$5,'[1]Allocation 2019-20 Final'!$A$7:$T$314,19,FALSE)=0,0,VLOOKUP($J$5,'[1]Allocation 2019-20 Final'!$A$7:$T$314,19,FALSE)-0.9),0)","v":0},{"$f":"IFERROR(IF(VLOOKUP($D$5,'[1]Allocation 2019-20 Preliminary'!$A$7:$T$316,19,FALSE)=0,0,VLOOKUP($D$5,'[1]Allocation 2019-20 Preliminary'!$A$7:$T$316,19,FALSE)-0.9),0)","v":0},{"$f":"IFERROR(IF(VLOOKUP($D$5,'[1]Allocation 2018-19 Final'!$A$7:$T$316,19,FALSE)=0,0,VLOOKUP($D$5,'[1]Allocation 2018-19 Final'!$A$7:$T$316,19,FALSE)-0.9),0)","v":0},{"$f":"IF(VLOOKUP($D$5,'[1]Allocation 2017-18 2ndRev_Final'!$A$7:$T$315,19,FALSE)=0,0,VLOOKUP($D$5,'[1]Allocation 2017-18 2ndRev_Final'!$A$7:$T$315,19,FALSE)-0.9)","v":0},{"$f":"IF(VLOOKUP($D$5,'[1]Allocation 2016-17 rev_Final'!$A$7:$T$314,19,FALSE)=0,0,VLOOKUP($D$5,'[1]Allocation 2016-17 rev_Final'!$A$7:$T$314,19,FALSE)-0.9)","v":0},{"$f":"IF(VLOOKUP($D$5,'[1]Allocation 2015-16 Final'!$A$7:$T$313,19,FALSE)=0,0,VLOOKUP($D$5,'[1]Allocation 2015-16 Final'!$A$7:$T$313,19,FALSE)-0.9)","v":0},{"$f":"IF(VLOOKUP($D$5,'[1]Allocation 2014-15 Final'!$A$7:$T$304,19,FALSE)=0,0,VLOOKUP($D$5,'[1]Allocation 2014-15 Final'!$A$7:$T$304,19,FALSE)-0.9)","v":0}]
[null,null,"MOE Reduction Amount",{"$f":"VLOOKUP($D$5,'Allocation 2024-25 Prelim'!$A$7:$S$323,18,FALSE)","v":0},{"$f":"VLOOKUP($D$5,'Allocation 2023-24 Final'!$A$7:$S$322,18,FALSE)","v":0},{"$f":"VLOOKUP($D$5,'[1]Allocation 2022-23 P'!$A$7:$T$321,20,FALSE)","v":0},{"$f":"VLOOKUP($D$5,'[2]Allocation 2021-22 Final'!$A$7:$U$321,20,FALSE)","v":0},{"$f":"VLOOKUP($D$5,'[1]Allocation 2021-22 Preliminary'!$A$7:$T$321,20,FALSE)","v":0},{"$f":"IFERROR(VLOOKUP($D$5,'[1]Allocation 2020-21 Final'!$A$7:$T$317,20,FALSE),0)","v":0},{"$f":"IFERROR(VLOOKUP($D$5,'[1]Allocation 2020-21 Preliminary'!$A$7:$T$318,20,FALSE),0)","v":0},{"$f":"IFERROR(VLOOKUP($D$5,'[1]Allocation 2019-20 Final'!$A$7:$T$314,20,FALSE),0)","v":0},{"$f":"IFERROR(VLOOKUP($D$5,'[1]Allocation 2019-20 Preliminary'!$A$7:$T$316,20,FALSE),0)","v":0},{"$f":"IFERROR(VLOOKUP($D$5,'[1]Allocation 2018-19 Preliminary'!$A$7:$T$316,20,FALSE),0)","v":0},{"$f":"VLOOKUP($D$5,'[1]Allocation 2017-18 2ndRev_Final'!$A$7:$T$315,20,FALSE)","v":0},{"$f":"VLOOKUP($D$5,'[1]Allocation 2016-17 rev_Final'!$A$7:$T$314,20,FALSE)","v":0},{"$f":"VLOOKUP($D$5,'[1]Allocation 2015-16 Final'!$A$7:$T$313,20,FALSE)","v":0},{"$f":"VLOOKUP($D$5,'[1]Allocation 2014-15 Final'!$A$7:$T$304,20,FALSE)","v":0}]
[null,null," Prior Year Adjustment (reallocation)",{"$f":"VLOOKUP($D$5,'Allocation 2024-25 Prelim'!$A$7:$S$323,15,FALSE)","v":0},{"$f":"VLOOKUP($D$5,'Allocation 2023-24 Final'!$A$7:$S$322,15,FALSE)","v":0},null,{"$f":"VLOOKUP($D$5,'[2]Allocation 2021-22 Final'!$A$7:$U$321,17,FALSE)","v":0}]
[null,null,"Final Allocation",{"$f":"+D15+D19+D20","v":141562},{"$f":"+E15+E19+E20","v":122786},{"$f":"+F15+F19+F20","v":114501},{"$f":"VLOOKUP($D$5,'[2]Allocation 2021-22 Final'!$A$7:$U$321,21,FALSE)","v":105785},{"$f":"+H15+H19+H20","v":105667},96619,96507,96948,96710,102340,121642,{"$f":"+O15+O19","v":102819},{"$f":"+P15+P19","v":105066},{"$f":"+Q15+Q19","v":103510}]
[]
[null,null,"Increase (Decrease) from Prior Year",{"$f":"D21-E21","v":18776},null,{"$f":"F21-G15","v":8716},{"$f":"G21-I15","v":9166},{"$f":"H21-I15","v":9048},{"$f":"I21-K15","v":-329},{"$f":"J21-K15","v":-441},{"$f":"K21-L15","v":238},{"$f":"L21-M15","v":-5630},{"$f":"IFERROR(M21-N15,0)","v":-19302},{"$f":"N21-O15","v":18823},{"$f":"O15-P15","v":-2247},{"$f":"P15-Q15","v":1556}]
[null,null,"% Change from Prior Year",{"$f":"IFERROR(D23/E21,\"\")","v":0.15291645627351652},null,{"$f":"IFERROR(F23/G15,\"\")","v":8.2393534054922724E-2},{"$f":"IFERROR(G23/I15,\"\")","v":9.4867469131330276E-2},{"$f":"IFERROR(H23/I15,\"\")","v":9.3646177252921264E-2},{"$f":"IFERROR(I23/K15,\"\")","v":-3.3935718116928663E-3},{"$f":"IFERROR(J23/K15,\"\")","v":-4.5488303007797997E-3},{"$f":"IFERROR(K23/L15,\"\")","v":2.4609657739633958E-3},{"$f":"IFERROR(L23/M15,\"\")","v":-5.5012702755520816E-2},{"$f":"IFERROR(M23/N15,\"\")","v":-0.15867874582792127},{"$f":"N23/O15","v":0.18306927707913906},{"$f":"O23/P15","v":-2.1386557021300896E-2},{"$f":"P23/Q15","v":1.503236402279973E-2}]

{"sheet":"Allocation 2024-25 Prelim","index":1,"n_rows":322,"n_cols":29,"rows_kept":322,"cut":false,"hidden":true,"merged":[[0,1,0,2],[1,10,1,11],[3,27,3,28]]}
[null,"2024-25",null,null,null,null,null,null,null,null,{"$f":"IF(K5=Assumptions!$C$22+J5,\"Rounding OK\",\"Rounding Error = \"&FIXED(K5-Assumptions!$C$22-J5,TRUE))","v":"Rounding OK"},null,null,null,null,null,null,{"$f":"R5","v":0},{"$f":"IF(S5=Assumptions!$C22+R5,\"Rounding OK\",\"Rounding Error = \"&FIXED(S5-(Assumptions!$C22+R5),TRUE))","v":"Rounding OK"}]
[null,"ESEA -- Title 2 Distributions ",null,null,null,null,null,null,null,null,"Allocation including private participation",null,null,null,null,null,null,null,"\\"]
[1,2,3,4,5,6,7,8,9,10,null,12,13,14,15,16,17,18,19,null,18]
["CCDDD","LEAID","District Name","Eisenhower 2001-02 Allocations","Class Size Reduction Allocations 2001-02","Census Population Ages 5-17","20%  based on Total Pop","Census Poverty Ages 5-17","80% based on Low Inc Pop","MOE","Total Final Allocation",null,"Alloc to non-Census LEA","Realloc Pool","Realloc","Final Alloc Before MOE","MOE","MOE Reduction","Final Alloc",null,"Prior Year Allocation",null,null,null,"Rank Order",null,null,"do not delete Y & Z"]
[null,null,"State Totals",{"$f":"SUM(D7:D308)","v":0},{"$f":"SUM(E7:E308)","v":0},{"$f":"SUM(F7:F322)","v":1220024.0000000002},{"$f":"SUM(G7:G322)","v":6559349},{"$f":"SUM(H7:H322)","v":132429.00000000003},{"$f":"SUM(I7:I322)","v":26237405},null,{"$f":"SUM(K7:K322)","v":32796764},null,{"$f":"SUM(M7:M322)","v":0},{"$f":"SUM(N7:N322)","v":32796764},{"$f":"SUM(O7:O322)","v":0},{"$f":"SUM(P7:P322)","v":32796764},null,{"$f":"SUM(R7:R322)","v":0},{"$f":"SUM(S7:S322)","v":32796764},null,{"$f":"SUM(U7:U322)","v":33292231.489999998},null,{"$f":"SUM(W7:W320)","v":-499571.49},{"$f":"MIN(X7:X316)","v":-0.66962524654832345},{"$f":"\"Lose =  \"& PROPER(VLOOKUP(X5,$X$7:$AC$316,6,FALSE))","v":"Lose =  Steptoe"},null,null,{"$f":"+B5","v":0},{"$f":"+C5","v":"State Totals"}]
[null,null,null,null,null,null,null,null,null,null,null,null,null,null,null,null,null,null,null,null,null,null,null,{"$f":"MAX(X7:X309)","v":1.8801886792452831},{"$f":"\"Win =  \"&PROPER(VLOOKUP(X6,$X$7:$AC$309,6,FALSE))","v":"Win =  Starbuck"}]
[{"$f":"VLOOKUP(B7,CCDDD!$A$3:$B$319,2,FALSE)","v":"14005"},"5300030","ABERDEEN",0,0,{"$f":"VLOOKUP(B7,'24-25 Adjusted Formula counts'!$A$3:$L$320,8,FALSE)","v":3494},{"$f":"ROUND((F7/$F$5*Assumptions!$C$22*Assumptions!$C$30),0)","v":18785},{"$f":"VLOOKUP(B7,'24-25 Adjusted Formula counts'!$A$3:$L$320,9,FALSE)","v":804},{"$f":"ROUND((H7/$H$5*Assumptions!$C$22*Assumptions!$C$31),0)","v":159292},null,{"$f":"ROUNDDOWN(+I7+G7+E7+D7+J7,0)","v":178077},null,null,{"$f":"K7","v":178077},{"$f":"-ROUND(N7/$N$5*$M$5,0)","v":0},{"$f":"+K7+O7+M7","v":178077},null,{"$f":"-1*(P7*Q7)","v":0},{"$f":"+P7+R7","v":178077},null,{"$f":"IFERROR(VLOOKUP($A7, 'Allocation 2023-24 Final'!$A$7:$S$323,19,FALSE),0)","v":160843},null,{"$f":"+S7-U7","v":17234},{"$f":"IF(U7>0,W7/U7,0)","v":0.10714796416381192},{"$f":"RANK(W7,$W$7:$W$322,0)","v":24},{"$f":"(SUM(D7:E7)/S7)","v":0},null,{"$f":"+B7","v":"5300030"},"ABERDEEN"]
[{"$f":"VLOOKUP(B8,CCDDD!$A$3:$B$319,2,FALSE)","v":"21226"},"5300060","ADNA",0,0,{"$f":"VLOOKUP(B8,'24-25 Adjusted Formula counts'!$A$3:$L$320,8,FALSE)","v":737},{"$f":"ROUND((F8/$F$5*Assumptions!$C$22*Assumptions!$C$30),0)","v":3962},{"$f":"VLOOKUP(B8,'24-25 Adjusted Formula counts'!$A$3:$L$320,9,FALSE)","v":38},{"$f":"ROUND((H8/$H$5*Assumptions!$C$22*Assumptions!$C$31),0)","v":7529},null,11491,null,null,11491,0,{"$f":"+K8+O8+M9","v":11491},null,0,11491,null,{"$f":"IFERROR(VLOOKUP($A8, 'Allocation 2023-24 Final'!$A$7:$S$323,19,FALSE),0)","v":12328},null,-837,-6.7894224529526287E-2,{"$f":"RANK(W8,$W$7:$W$322,0)","v":167},0,null,"5300060","ADNA"]
[{"$f":"VLOOKUP(B9,CCDDD!$A$3:$B$319,2,FALSE)","v":"22017"},"5300090","ALMIRA",0,0,{"$f":"VLOOKUP(B9,'24-25 Adjusted Formula counts'!$A$3:$L$320,8,FALSE)","v":98},{"$f":"ROUND((F9/$F$5*Assumptions!$C$22*Assumptions!$C$30),0)","v":527},{"$f":"VLOOKUP(B9,'24-25 Adjusted Formula counts'!$A$3:$L$320,9,FALSE)","v":6},{"$f":"ROUND((H9/$H$5*Assumptions!$C$22*Assumptions!$C$31),0)","v":1189},null,1716,null,null,1716,0,{"$f":"+K9+O9+M10","v":1716},null,0,1716,null,{"$f":"IFERROR(VLOOKUP($A9, 'Allocation 2023-24 Final'!$A$7:$S$323,19,FALSE),0)","v":2069},null,-353,-0.17061382310294829,149,0,null,"5300090","ALMIRA"]
[{"$f":"VLOOKUP(B10,CCDDD!$A$3:$B$319,2,FALSE)","v":"29103"},"5300150","ANACORTES",0,0,{"$f":"VLOOKUP(B10,'24-25 Adjusted Formula counts'!$A$3:$L$320,8,FALSE)","v":2828},{"$f":"ROUND((F10/$F$5*Assumptions!$C$22*Assumptions!$C$30),0)","v":15204},{"$f":"VLOOKUP(B10,'24-25 Adjusted Formula counts'!$A$3:$L$320,9,FALSE)","v":255},{"$f":"ROUND((H10/$H$5*Assumptions!$C$22*Assumptions!$C$31),0)","v":50522},null,65726,null,null,65726,0,{"$f":"+K10+O10+M11","v":65726},null,0,65726,null,{"$f":"IFERROR(VLOOKUP($A10, 'Allocation 2023-24 Final'!$A$7:$S$323,19,FALSE),0)","v":70129},null,-4403,-6.2784297508876499E-2,230,0,null,"5300150","ANACORTES"]
[{"$f":"VLOOKUP(B11,CCDDD!$A$3:$B$319,2,FALSE)","v":"31016"},"5300240","ARLINGTON",0,0,{"$f":"VLOOKUP(B11,'24-25 Adjusted Formula counts'!$A$3:$L$320,8,FALSE)","v":5915},{"$f":"ROUND((F11/$F$5*Assumptions!$C$22*Assumptions!$C$30),0)","v":31801},{"$f":"VLOOKUP(B11,'24-25 Adjusted Formula counts'!$A$3:$L$320,9,FALSE)","v":554},{"$f":"ROUND((H11/$H$5*Assumptions!$C$22*Assumptions!$C$31),0)","v":109761},null,141562,null,null,141562,0,141562,null,0,141562,null,{"$f":"IFERROR(VLOOKUP($A11, 'Allocation 2023-24 Final'!$A$7:$S$323,19,FALSE),0)","v":122786},null,18776,0.15291645627351652,20,0,null,"5300240","ARLINGTON"]
[{"$f":"VLOOKUP(B12,CCDDD!$A$3:$B$319,2,FALSE)","v":"02420"},"5300280","ASOTIN-ANATONE",0,0,{"$f":"VLOOKUP(B12,'24-25 Adjusted Formula counts'!$A$3:$L$320,8,FALSE)","v":493},{"$f":"ROUND((F12/$F$5*Assumptions!$C$22*Assumptions!$C$30),0)","v":2651},{"$f":"VLOOKUP(B12,'24-25 Adjusted Formula counts'!$A$3:$L$320,9,FALSE)","v":48},{"$f":"ROUND((H12/$H$5*Assumptions!$C$22*Assumptions!$C$31),0)","v":9510},null,12161,null,null,12161,0,12161,null,0,12161,null,{"$f":"IFERROR(VLOOKUP($A12, 'Allocation 2023-24 Final'!$A$7:$S$323,19,FALSE),0)","v":15196},null,-3035,-0.19972361147670439,210,0,null,"5300280","ASOTIN-ANATONE"]
[{"$f":"VLOOKUP(B13,CCDDD!$A$3:$B$319,2,FALSE)","v":"17408"},"5300300","AUBURN",0,0,{"$f":"VLOOKUP(B13,'24-25 Adjusted Formula counts'!$A$3:$L$320,8,FALSE)","v":18293},{"$f":"ROUND((F13/$F$5*Assumptions!$C$22*Assumptions!$C$30),0)","v":98351},{"$f":"VLOOKUP(B13,'24-25 Adjusted Formula counts'!$A$3:$L$320,9,FALSE)","v":2918},{"$f":"ROUND((H13/$H$5*Assumptions!$C$22*Assumptions!$C$31),0)","v":578127},null,676478,null,null,676478,0,676478,null,0,676478,null,{"$f":"IFERROR(VLOOKUP($A13, 'Allocation 2023-24 Final'!$A$7:$S$323,19,FALSE),0)","v":643224},null,33254,5.1698941581781774E-2,11,0,null,"5300300","AUBURN"]
[{"$f":"VLOOKUP(B14,CCDDD!$A$3:$B$319,2,FALSE)","v":"18303"},"5300330","BAINBRIDGE ISLAND",0,0,{"$f":"VLOOKUP(B14,'24-25 Adjusted Formula counts'!$A$3:$L$320,8,FALSE)","v":3975},{"$f":"ROUND((F14/$F$5*Assumptions!$C$22*Assumptions!$C$30),0)","v":21371},{"$f":"VLOOKUP(B14,'24-25 Adjusted Formula counts'!$A$3:$L$320,9,FALSE)","v":141},{"$f":"ROUND((H14/$H$5*Assumptions!$C$22*Assumptions!$C$31),0)","v":27936},null,49307,null,null,49307,0,49307,null,0,49307,null,{"$f":"IFERROR(VLOOKUP($A14, 'Allocation 2023-24 Final'!$A$7:$S$323,19,FALSE),0)","v":52648},null,-3341,-6.3459200729372431E-2,216,0,null,"5300330","BAINBRIDGE ISLAND"]
[{"$f":"VLOOKUP(B15,CCDDD!$A$3:$B$319,2,FALSE)","v":"06119"},"5300380","BATTLE GROUND",0,0,{"$f":"VLOOKUP(B15,'24-25 Adjusted Formula counts'!$A$3:$L$320,8,FALSE)","v":15822},{"$f":"ROUND((F15/$F$5*Assumptions!$C$22*Assumptions!$C$30),0)","v":85066},{"$f":"VLOOKUP(B15,'24-25 Adjusted Formula counts'!$A$3:$L$320,9,FALSE)","v":788},{"$f":"ROUND((H15/$H$5*Assumptions!$C$22*Assumptions!$C$31),0)","v":156122},null,241188,null,null,241188,0,241188,null,0,241188,null,{"$f":"IFERROR(VLOOKUP($A15, 'Allocation 2023-24 Final'!$A$7:$S$323,19,FALSE),0)","v":300725},null,-59537,-0.19797821930335024,309,0,null,"5300380","BATTLE GROUND"]
[{"$f":"VLOOKUP(B16,CCDDD!$A$3:$B$319,2,FALSE)","v":"17405"},"5300390","BELLEVUE",0,0,{"$f":"VLOOKUP(B16,'24-25 Adjusted Formula counts'!$A$3:$L$320,8,FALSE)","v":22393},{"$f":"ROUND((F16/$F$5*Assumptions!$C$22*Assumptions!$C$30),0)","v":120394},{"$f":"VLOOKUP(B16,'24-25 Adjusted Formula counts'!$A$3:$L$320,9,FALSE)","v":1339},{"$f":"ROUND((H16/$H$5*Assumptions!$C$22*Assumptions!$C$31),0)","v":265289},null,385683,null,null,385683,0,385683,null,0,385683,null,{"$f":"IFERROR(VLOOKUP($A16, 'Allocation 2023-24 Final'!$A$7:$S$323,19,FALSE),0)","v":434128},null,-48445,-0.11159151218073932,308,0,null,"5300390","BELLEVUE"]
[{"$f":"VLOOKUP(B17,CCDDD!$A$3:$B$319,2,FALSE)","v":"37501"},"5300420","BELLINGHAM",0,0,{"$f":"VLOOKUP(B17,'24-25 Adjusted Formula counts'!$A$3:$L$320,8,FALSE)","v":12465.098684210523},{"$f":"ROUND((F17/$F$5*Assumptions!$C$22*Assumptions!$C$30),0)","v":67018},{"$f":"VLOOKUP(B17,'24-25 Adjusted Formula counts'!$A$3:$L$320,9,FALSE)","v":1329.0142430507692},{"$f":"ROUND((H17/$H$5*Assumptions!$C$22*Assumptions!$C$31),0)","v":263310},null,330328,null,null,330328,0,330328,null,0,330328,null,{"$f":"IFERROR(VLOOKUP($A17, 'Allocation 2023-24 Final'!$A$7:$S$323,19,FALSE),0)","v":409562},null,-79234,-0.19346033079240749,315,0,null,"5300420","BELLINGHAM"]
[{"$f":"VLOOKUP(B18,CCDDD!$A$3:$B$319,2,FALSE)","v":"01122"},"5300450","BENGE",0,0,{"$f":"VLOOKUP(B18,'24-25 Adjusted Formula counts'!$A$3:$L$320,8,FALSE)","v":16},{"$f":"ROUND((F18/$F$5*Assumptions!$C$22*Assumptions!$C$30),0)","v":86},{"$f":"VLOOKUP(B18,'24-25 Adjusted Formula counts'!$A$3:$L$320,9,FALSE)","v":1},{"$f":"ROUND((H18/$H$5*Assumptions!$C$22*Assumptions!$C$31),0)","v":198},null,284,null,null,284,0,284,null,0,284,null,{"$f":"IFERROR(VLOOKUP($A18, 'Allocation 2023-24 Final'!$A$7:$S$323,19,FALSE),0)","v":281},null,3,1.0676156583629894E-2,137,0,null,"5300450","BENGE"]
[{"$f":"VLOOKUP(B19,CCDDD!$A$3:$B$319,2,FALSE)","v":"27403"},"5300480","BETHEL",0,0,{"$f":"VLOOKUP(B19,'24-25 Adjusted Formula counts'!$A$3:$L$320,8,FALSE)","v":24134},{"$f":"ROUND((F19/$F$5*Assumptions!$C$22*Assumptions!$C$30),0)","v":129754},{"$f":"VLOOKUP(B19,'24-25 Adjusted Formula counts'!$A$3:$L$320,9,FALSE)","v":2228},{"$f":"ROUND((H19/$H$5*Assumptions!$C$22*Assumptions!$C$31),0)","v":441421},null,571175,null,null,571175,0,571175,null,0,571175,null,{"$f":"IFERROR(VLOOKUP($A19, 'Allocation 2023-24 Final'!$A$7:$S$323,19,FALSE),0)","v":570239},null,936,1.6414170198811376E-3,102,0,null,"5300480","BETHEL"]
[{"$f":"VLOOKUP(B20,CCDDD!$A$3:$B$319,2,FALSE)","v":"20203"},"5300510","BICKLETON",0,0,{"$f":"VLOOKUP(B20,'24-25 Adjusted Formula counts'!$A$3:$L$320,8,FALSE)","v":78},{"$f":"ROUND((F20/$F$5*Assumptions!$C$22*Assumptions!$C$30),0)","v":419},{"$f":"VLOOKUP(B20,'24-25 Adjusted Formula counts'!$A$3:$L$320,9,FALSE)","v":12},{"$f":"ROUND((H20/$H$5*Assumptions!$C$22*Assumptions!$C$31),0)","v":2377},null,2796,null,null,2796,0,2796,null,0,2796,null,{"$f":"IFERROR(VLOOKUP($A20, 'Allocation 2023-24 Final'!$A$7:$S$323,19,FALSE),0)","v":3347},null,-551,-0.16462503734687781,156,0,null,"5300510","BICKLETON"]
[{"$f":"VLOOKUP(B21,CCDDD!$A$3:$B$319,2,FALSE)","v":"37503"},"5300570","BLAINE",0,0,{"$f":"VLOOKUP(B21,'24-25 Adjusted Formula counts'!$A$3:$L$320,8,FALSE)","v":2473},{"$f":"ROUND((F21/$F$5*Assumptions!$C$22*Assumptions!$C$30),0)","v":13296},{"$f":"VLOOKUP(B21,'24-25 Adjusted Formula counts'!$A$3:$L$320,9,FALSE)","v":265},{"$f":"ROUND((H21/$H$5*Assumptions!$C$22*Assumptions!$C$31),0)","v":52503},null,65799,null,null,65799,0,65799,null,0,65799,null,{"$f":"IFERROR(VLOOKUP($A21, 'Allocation 2023-24 Final'!$A$7:$S$323,19,FALSE),0)","v":88535},null,-22736,-0.25680239453323545,294,0,null,"5300570","BLAINE"]
[{"$f":"VLOOKUP(B22,CCDDD!$A$3:$B$319,2,FALSE)","v":"21234"},"5300630","BOISTFORT",0,0,{"$f":"VLOOKUP(B22,'24-25 Adjusted Formula counts'!$A$3:$L$320,8,FALSE)","v":215},{"$f":"ROUND((F22/$F$5*Assumptions!$C$22*Assumptions!$C$30),0)","v":1156},{"$f":"VLOOKUP(B22,'24-25 Adjusted Formula counts'!$A$3:$L$320,9,FALSE)","v":28},{"$f":"ROUND((H22/$H$5*Assumptions!$C$22*Assumptions!$C$31),0)","v":5547},null,6703,null,null,6703,0,6703,null,0,6703,null,{"$f":"IFERROR(VLOOKUP($A22, 'Allocation 2023-24 Final'!$A$7:$S$323,19,FALSE),0)","v":6415},null,288,4.4894777864380356E-2,119,0,null,"5300630","BOISTFORT"]
[{"$f":"VLOOKUP(B23,CCDDD!$A$3:$B$319,2,FALSE)","v":"18100"},"5300660","BREMERTON",0,0,{"$f":"VLOOKUP(B23,'24-25 Adjusted Formula counts'!$A$3:$L$320,8,FALSE)","v":4867.243829018661},{"$f":"ROUND((F23/$F$5*Assumptions!$C$22*Assumptions!$C$30),0)","v":26168},{"$f":"VLOOKUP(B23,'24-25 Adjusted Formula counts'!$A$3:$L$320,9,FALSE)","v":923.91679104477635},{"$f":"ROUND((H23/$H$5*Assumptions!$C$22*Assumptions!$C$31),0)","v":183050},null,209218,null,null,209218,0,209218,null,0,209218,null,{"$f":"IFERROR(VLOOKUP($A23, 'Allocation 2023-24 Final'!$A$7:$S$323,19,FALSE),0)","v":184723},null,24495,0.13260395294576202,14,0,null,"5300660","BREMERTON"]
[{"$f":"VLOOKUP(B24,CCDDD!$A$3:$B$319,2,FALSE)","v":"24111"},"5300690","BREWSTER",0,0,{"$f":"VLOOKUP(B24,'24-25 Adjusted Formula counts'!$A$3:$L$320,8,FALSE)","v":968},{"$f":"ROUND((F24/$F$5*Assumptions!$C$22*Assumptions!$C$30),0)","v":5204},{"$f":"VLOOKUP(B24,'24-25 Adjusted Formula counts'!$A$3:$L$320,9,FALSE)","v":178},{"$f":"ROUND((H24/$H$5*Assumptions!$C$22*Assumptions!$C$31),0)","v":35266},null,40470,null,null,40470,0,40470,null,0,40470,null,{"$f":"IFERROR(VLOOKUP($A24, 'Allocation 2023-24 Final'!$A$7:$S$323,19,FALSE),0)","v":41277},null,-807,-1.9550839450541462E-2,166,0,null,"5300690","BREWSTER"]
[{"$f":"VLOOKUP(B25,CCDDD!$A$3:$B$319,2,FALSE)","v":"09075"},"5300720","BRIDGEPORT",0,0,{"$f":"VLOOKUP(B25,'24-25 Adjusted Formula counts'!$A$3:$L$320,8,FALSE)","v":677},{"$f":"ROUND((F25/$F$5*Assumptions!$C$22*Assumptions!$C$30),0)","v":3640},{"$f":"VLOOKUP(B25,'24-25 Adjusted Formula counts'!$A$3:$L$320,9,FALSE)","v":163},{"$f":"ROUND((H25/$H$5*Assumptions!$C$22*Assumptions!$C$31),0)","v":32294},null,35934,null,null,35934,0,35934,null,0,35934,null,{"$f":"IFERROR(VLOOKUP($A25, 'Allocation 2023-24 Final'!$A$7:$S$323,19,FALSE),0)","v":43503},null,-7569,-0.17398800082752913,253,0,null,"5300720","BRIDGEPORT"]
[{"$f":"VLOOKUP(B26,CCDDD!$A$3:$B$319,2,FALSE)","v":"16046"},"5300750","BRINNON",0,0,{"$f":"VLOOKUP(B26,'24-25 Adjusted Formula counts'!$A$3:$L$320,8,FALSE)","v":116},{"$f":"ROUND((F26/$F$5*Assumptions!$C$22*Assumptions!$C$30),0)","v":624},{"$f":"VLOOKUP(B26,'24-25 Adjusted Formula counts'!$A$3:$L$320,9,FALSE)","v":27},{"$f":"ROUND((H26/$H$5*Assumptions!$C$22*Assumptions!$C$31),0)","v":5349},null,5973,null,null,5973,0,5973,null,0,5973,null,{"$f":"IFERROR(VLOOKUP($A26, 'Allocation 2023-24 Final'!$A$7:$S$323,19,FALSE),0)","v":6868},null,-895,-0.13031450203843914,169,0,null,"5300750","BRINNON"]
[{"$f":"VLOOKUP(B27,CCDDD!$A$3:$B$319,2,FALSE)","v":"29100"},"5300780","BURLINGTON-EDISON",0,0,{"$f":"VLOOKUP(B27,'24-25 Adjusted Formula counts'!$A$3:$L$320,8,FALSE)","v":3721},{"$f":"ROUND((F27/$F$5*Assumptions!$C$22*Assumptions!$C$30),0)","v":20006},{"$f":"VLOOKUP(B27,'24-25 Adjusted Formula counts'!$A$3:$L$320,9,FALSE)","v":390},{"$f":"ROUND((H27/$H$5*Assumptions!$C$22*Assumptions!$C$31),0)","v":77269},null,97275,null,null,97275,0,97275,null,0,97275,null,{"$f":"IFERROR(VLOOKUP($A27, 'Allocation 2023-24 Final'!$A$7:$S$323,19,FALSE),0)","v":116875},null,-19600,-0.16770053475935828,291,0,null,"5300780","BURLINGTON-EDISON"]
[{"$f":"VLOOKUP(B28,CCDDD!$A$3:$B$319,2,FALSE)","v":"06117"},"5300810","CAMAS",0,0,{"$f":"VLOOKUP(B28,'24-25 Adjusted Formula counts'!$A$3:$L$320,8,FALSE)","v":7408},{"$f":"ROUND((F28/$F$5*Assumptions!$C$22*Assumptions!$C$30),0)","v":39828},{"$f":"VLOOKUP(B28,'24-25 Adjusted Formula counts'!$A$3:$L$320,9,FALSE)","v":246},{"$f":"ROUND((H28/$H$5*Assumptions!$C$22*Assumptions!$C$31),0)","v":48739},null,88567,null,null,88567,0,88567,null,0,88567,null,{"$f":"IFERROR(VLOOKUP($A28, 'Allocation 2023-24 Final'!$A$7:$S$323,19,FALSE),0)","v":103377},null,-14810,-0.14326204087949931,279,0,null,"5300810","CAMAS"]
[{"$f":"VLOOKUP(B29,CCDDD!$A$3:$B$319,2,FALSE)","v":"05401"},"5300840","CAPE FLATTERY",0,0,{"$f":"VLOOKUP(B29,'24-25 Adjusted Formula counts'!$A$3:$L$320,8,FALSE)","v":550},{"$f":"ROUND((F29/$F$5*Assumptions!$C$22*Assumptions!$C$30),0)","v":2957},{"$f":"VLOOKUP(B29,'24-25 Adjusted Formula counts'!$A$3:$L$320,9,FALSE)","v":112},{"$f":"ROUND((H29/$H$5*Assumptions!$C$22*Assumptions!$C$31),0)","v":22190},null,25147,null,null,25147,0,25147,null,0,25147,null,{"$f":"IFERROR(VLOOKUP($A29, 'Allocation 2023-24 Final'!$A$7:$S$323,19,FALSE),0)","v":28187},null,-3040,-0.10785113704899421,211,0,null,"5300840","CAPE FLATTERY"]
[{"$f":"VLOOKUP(B30,CCDDD!$A$3:$B$319,2,FALSE)","v":"27019"},"5300870","CARBONADO",0,0,{"$f":"VLOOKUP(B30,'24-25 Adjusted Formula counts'!$A$3:$L$320,8,FALSE)","v":208},{"$f":"ROUND((F30/$F$5*Assumptions!$C$22*Assumptions!$C$30),0)","v":1118},{"$f":"VLOOKUP(B30,'24-25 Adjusted Formula counts'!$A$3:$L$320,9,FALSE)","v":7},{"$f":"ROUND((H30/$H$5*Assumptions!$C$22*Assumptions!$C$31),0)","v":1387},null,2505,null,null,2505,0,2505,null,0,2505,null,{"$f":"IFERROR(VLOOKUP($A30, 'Allocation 2023-24 Final'!$A$7:$S$323,19,FALSE),0)","v":4840},null,-2335,-0.4824380165289256,201,0,null,"5300870","CARBONADO"]
[{"$f":"VLOOKUP(B31,CCDDD!$A$3:$B$319,2,FALSE)","v":"04228"},"5300950","CASCADE",0,0,{"$f":"VLOOKUP(B31,'24-25 Adjusted Formula counts'!$A$3:$L$320,8,FALSE)","v":1554},{"$f":"ROUND((F31/$F$5*Assumptions!$C$22*Assumptions!$C$30),0)","v":8355},{"$f":"VLOOKUP(B31,'24-25 Adjusted Formula counts'!$A$3:$L$320,9,FALSE)","v":176},{"$f":"ROUND((H31/$H$5*Assumptions!$C$22*Assumptions!$C$31),0)","v":34870},null,43225,null,null,43225,0,43225,null,0,43225,null,{"$f":"IFERROR(VLOOKUP($A31, 'Allocation 2023-24 Final'!$A$7:$S$323,19,FALSE),0)","v":42628},null,597,1.4004879421976165E-2,111,0,null,"5300950","CASCADE"]
[{"$f":"VLOOKUP(B32,CCDDD!$A$3:$B$319,2,FALSE)","v":"04222"},"5300960","CASHMERE",0,0,{"$f":"VLOOKUP(B32,'24-25 Adjusted Formula counts'!$A$3:$L$320,8,FALSE)","v":1496},{"$f":"ROUND((F32/$F$5*Assumptions!$C$22*Assumptions!$C$30),0)","v":8043},{"$f":"VLOOKUP(B32,'24-25 Adjusted Formula counts'!$A$3:$L$320,9,FALSE)","v":161},{"$f":"ROUND((H32/$H$5*Assumptions!$C$22*Assumptions!$C$31),0)","v":31898},null,39941,null,null,39941,0,39941,null,0,39941,null,{"$f":"IFERROR(VLOOKUP($A32, 'Allocation 2023-24 Final'!$A$7:$S$323,19,FALSE),0)","v":45814},null,-5873,-0.12819225564238007,241,0,null,"5300960","CASHMERE"]
[{"$f":"VLOOKUP(B33,CCDDD!$A$3:$B$319,2,FALSE)","v":"08401"},"5300990","CASTLE ROCK",0,0,{"$f":"VLOOKUP(B33,'24-25 Adjusted Formula counts'!$A$3:$L$320,8,FALSE)","v":1636},{"$f":"ROUND((F33/$F$5*Assumptions!$C$22*Assumptions!$C$30),0)","v":8796},{"$f":"VLOOKUP(B33,'24-25 Adjusted Formula counts'!$A$3:$L$320,9,FALSE)","v":181},{"$f":"ROUND((H33/$H$5*Assumptions!$C$22*Assumptions!$C$31),0)","v":35861},null,44657,null,null,44657,0,44657,null,0,44657,null,{"$f":"IFERROR(VLOOKUP($A33, 'Allocation 2023-24 Final'!$A$7:$S$323,19,FALSE),0)","v":46810},null,-2153,-4.5994445631275367E-2,196,0,null,"5300990","CASTLE ROCK"]
[{"$f":"VLOOKUP(B34,CCDDD!$A$3:$B$319,2,FALSE)","v":"18901"},"5301000","CATALYST BREMERTON CHARTER",0,0,{"$f":"VLOOKUP(B34,'24-25 Adjusted Formula counts'!$A$3:$L$320,8,FALSE)","v":610.77824603652425},{"$f":"ROUND((F34/$F$5*Assumptions!$C$22*Assumptions!$C$30),0)","v":3284},{"$f":"VLOOKUP(B34,'24-25 Adjusted Formula counts'!$A$3:$L$320,9,FALSE)","v":85.072388059701495},{"$f":"ROUND((H34/$H$5*Assumptions!$C$22*Assumptions!$C$31),0)","v":16855},null,20139,null,null,20139,0,20139,null,0,20139,null,{"$f":"IFERROR(VLOOKUP($A34, 'Allocation 2023-24 Final'!$A$7:$S$323,19,FALSE),0)","v":15463},null,4676,0.30239927569035763,47,0,null,"5301000","CATALYST BREMERTON CHARTER"]
[{"$f":"VLOOKUP(B35,CCDDD!$A$3:$B$319,2,FALSE)","v":"20215"},"5301050","CENTERVILLE",0,0,{"$f":"VLOOKUP(B35,'24-25 Adjusted Formula counts'!$A$3:$L$320,8,FALSE)","v":93},{"$f":"ROUND((F35/$F$5*Assumptions!$C$22*Assumptions!$C$30),0)","v":500},{"$f":"VLOOKUP(B35,'24-25 Adjusted Formula counts'!$A$3:$L$320,9,FALSE)","v":27},{"$f":"ROUND((H35/$H$5*Assumptions!$C$22*Assumptions!$C$31),0)","v":5349},null,5849,null,null,5849,0,5849,null,0,5849,null,{"$f":"IFERROR(VLOOKUP($A35, 'Allocation 2023-24 Final'!$A$7:$S$323,19,FALSE),0)","v":3043},null,2806,0.92211633256654613,66,0,null,"5301050","CENTERVILLE"]
[{"$f":"VLOOKUP(B36,CCDDD!$A$3:$B$319,2,FALSE)","v":"18401"},"5301080","CENTRAL KITSAP",0,0,{"$f":"VLOOKUP(B36,'24-25 Adjusted Formula counts'!$A$3:$L$320,8,FALSE)","v":11148},{"$f":"ROUND((F36/$F$5*Assumptions!$C$22*Assumptions!$C$30),0)","v":59936},{"$f":"VLOOKUP(B36,'24-25 Adjusted Formula counts'!$A$3:$L$320,9,FALSE)","v":853},{"$f":"ROUND((H36/$H$5*Assumptions!$C$22*Assumptions!$C$31),0)","v":169000},null,228936,null,null,228936,0,228936,null,0,228936,null,{"$f":"IFERROR(VLOOKUP($A36, 'Allocation 2023-24 Final'!$A$7:$S$323,19,FALSE),0)","v":238653},null,-9717,-4.0716018654699503E-2,264,0,null,"5301080","CENTRAL KITSAP"]
[{"$f":"VLOOKUP(B37,CCDDD!$A$3:$B$319,2,FALSE)","v":"32356"},"5301110","CENTRAL VALLEY",0,0,{"$f":"VLOOKUP(B37,'24-25 Adjusted Formula counts'!$A$3:$L$320,8,FALSE)","v":17019},{"$f":"ROUND((F37/$F$5*Assumptions!$C$22*Assumptions!$C$30),0)","v":91501},{"$f":"VLOOKUP(B37,'24-25 Adjusted Formula counts'!$A$3:$L$320,9,FALSE)","v":1806},{"$f":"ROUND((H37/$H$5*Assumptions!$C$22*Assumptions!$C$31),0)","v":357813},null,449314,null,null,449314,0,449314,null,0,449314,null,{"$f":"IFERROR(VLOOKUP($A37, 'Allocation 2023-24 Final'!$A$7:$S$323,19,FALSE),0)","v":398834},null,50480,0.1265689484848333,7,0,null,"5301110","CENTRAL VALLEY"]
[{"$f":"VLOOKUP(B38,CCDDD!$A$3:$B$319,2,FALSE)","v":"21401"},"5301140","CENTRALIA",0,0,{"$f":"VLOOKUP(B38,'24-25 Adjusted Formula counts'!$A$3:$L$320,8,FALSE)","v":4274},{"$f":"ROUND((F38/$F$5*Assumptions!$C$22*Assumptions!$C$30),0)","v":22979},{"$f":"VLOOKUP(B38,'24-25 Adjusted Formula counts'!$A$3:$L$320,9,FALSE)","v":748},{"$f":"ROUND((H38/$H$5*Assumptions!$C$22*Assumptions!$C$31),0)","v":148197},null,171176,null,null,171176,0,171176,null,0,171176,null,{"$f":"IFERROR(VLOOKUP($A38, 'Allocation 2023-24 Final'!$A$7:$S$323,19,FALSE),0)","v":181133},null,-9957,-5.49706569206053E-2,268,0,null,"5301140","CENTRALIA"]
[{"$f":"VLOOKUP(B39,CCDDD!$A$3:$B$319,2,FALSE)","v":"21302"},"5301170","CHEHALIS",0,0,{"$f":"VLOOKUP(B39,'24-25 Adjusted Formula counts'!$A$3:$L$320,8,FALSE)","v":2864},{"$f":"ROUND((F39/$F$5*Assumptions!$C$22*Assumptions!$C$30),0)","v":15398},{"$f":"VLOOKUP(B39,'24-25 Adjusted Formula counts'!$A$3:$L$320,9,FALSE)","v":249},{"$f":"ROUND((H39/$H$5*Assumptions!$C$22*Assumptions!$C$31),0)","v":49333},null,64731,null,null,64731,0,64731,null,0,64731,null,{"$f":"IFERROR(VLOOKUP($A39, 'Allocation 2023-24 Final'!$A$7:$S$323,19,FALSE),0)","v":82572},null,-17841,-0.21606597878215375,288,0,null,"5301170","CHEHALIS"]
[{"$f":"VLOOKUP(B40,CCDDD!$A$3:$B$319,2,FALSE)","v":"32360"},"5301230","CHENEY",0,0,{"$f":"VLOOKUP(B40,'24-25 Adjusted Formula counts'!$A$3:$L$320,8,FALSE)","v":6241},{"$f":"ROUND((F40/$F$5*Assumptions!$C$22*Assumptions!$C$30),0)","v":33554},{"$f":"VLOOKUP(B40,'24-25 Adjusted Formula counts'!$A$3:$L$320,9,FALSE)","v":860},{"$f":"ROUND((H40/$H$5*Assumptions!$C$22*Assumptions!$C$31),0)","v":170387},null,203941,null,null,203941,0,203941,null,0,203941,null,{"$f":"IFERROR(VLOOKUP($A40, 'Allocation 2023-24 Final'!$A$7:$S$323,19,FALSE),0)","v":186563},null,17378,9.3148159066910374E-2,22,0,null,"5301230","CHENEY"]
[{"$f":"VLOOKUP(B41,CCDDD!$A$3:$B$319,2,FALSE)","v":"33036"},"5301260","CHEWELAH",0,0,{"$f":"VLOOKUP(B41,'24-25 Adjusted Formula counts'!$A$3:$L$320,8,FALSE)","v":938},{"$f":"ROUND((F41/$F$5*Assumptions!$C$22*Assumptions!$C$30),0)","v":5043},{"$f":"VLOOKUP(B41,'24-25 Adjusted Formula counts'!$A$3:$L$320,9,FALSE)","v":160},{"$f":"ROUND((H41/$H$5*Assumptions!$C$22*Assumptions!$C$31),0)","v":31700},null,36743,null,null,36743,0,36743,null,0,36743,null,{"$f":"IFERROR(VLOOKUP($A41, 'Allocation 2023-24 Final'!$A$7:$S$323,19,FALSE),0)","v":42101},null,-5358,-0.12726538562029405,237,0,null,"5301260","CHEWELAH"]
[{"$f":"VLOOKUP(B42,CCDDD!$A$3:$B$319,2,FALSE)","v":"16049"},"5301290","CHIMACUM",0,0,{"$f":"VLOOKUP(B42,'24-25 Adjusted Formula counts'!$A$3:$L$320,8,FALSE)","v":1152},{"$f":"ROUND((F42/$F$5*Assumptions!$C$22*Assumptions!$C$30),0)","v":6194},{"$f":"VLOOKUP(B42,'24-25 Adjusted Formula counts'!$A$3:$L$320,9,FALSE)","v":170},{"$f":"ROUND((H42/$H$5*Assumptions!$C$22*Assumptions!$C$31),0)","v":33681},null,39875,null,null,39875,0,39875,null,0,39875,null,{"$f":"IFERROR(VLOOKUP($A42, 'Allocation 2023-24 Final'!$A$7:$S$323,19,FALSE),0)","v":46079},null,-6204,-0.13463833850560994,243,0,null,"5301290","CHIMACUM"]
[{"$f":"VLOOKUP(B43,CCDDD!$A$3:$B$319,2,FALSE)","v":"02250"},"5301320","CLARKSTON",0,0,{"$f":"VLOOKUP(B43,'24-25 Adjusted Formula counts'!$A$3:$L$320,8,FALSE)","v":2795},{"$f":"ROUND((F43/$F$5*Assumptions!$C$22*Assumptions!$C$30),0)","v":15027},{"$f":"VLOOKUP(B43,'24-25 Adjusted Formula counts'!$A$3:$L$320,9,FALSE)","v":584},{"$f":"ROUND((H43/$H$5*Assumptions!$C$22*Assumptions!$C$31),0)","v":115705},null,130732,null,null,130732,0,130732,null,0,130732,null,{"$f":"IFERROR(VLOOKUP($A43, 'Allocation 2023-24 Final'!$A$7:$S$323,19,FALSE),0)","v":128060},null,2672,2.086521942839294E-2,68,0,null,"5301320","CLARKSTON"]
[{"$f":"VLOOKUP(B44,CCDDD!$A$3:$B$319,2,FALSE)","v":"19404"},"5301350","CLE ELUM-ROSLYN",0,0,{"$f":"VLOOKUP(B44,'24-25 Adjusted Formula counts'!$A$3:$L$320,8,FALSE)","v":1062},{"$f":"ROUND((F44/$F$5*Assumptions!$C$22*Assumptions!$C$30),0)","v":5710},{"$f":"VLOOKUP(B44,'24-25 Adjusted Formula counts'!$A$3:$L$320,9,FALSE)","v":148},{"$f":"ROUND((H44/$H$5*Assumptions!$C$22*Assumptions!$C$31),0)","v":29322},null,35032,null,null,35032,0,35032,null,0,35032,null,{"$f":"IFERROR(VLOOKUP($A44, 'Allocation 2023-24 Final'!$A$7:$S$323,19,FALSE),0)","v":30525},null,4507,0.14764946764946765,49,0,null,"5301350","CLE ELUM-ROSLYN"]
[{"$f":"VLOOKUP(B45,CCDDD!$A$3:$B$319,2,FALSE)","v":"27400"},"5301410","CLOVER PARK",0,0,{"$f":"VLOOKUP(B45,'24-25 Adjusted Formula counts'!$A$3:$L$320,8,FALSE)","v":13680},{"$f":"ROUND((F45/$F$5*Assumptions!$C$22*Assumptions!$C$30),0)","v":73549},{"$f":"VLOOKUP(B45,'24-25 Adjusted Formula counts'!$A$3:$L$320,9,FALSE)","v":1961},{"$f":"ROUND((H45/$H$5*Assumptions!$C$22*Assumptions!$C$31),0)","v":388522},null,462071,null,null,462071,0,462071,null,0,462071,null,{"$f":"IFERROR(VLOOKUP($A45, 'Allocation 2023-24 Final'!$A$7:$S$323,19,FALSE),0)","v":442496},null,19575,4.4237688024298526E-2,19,0,null,"5301410","CLOVER PARK"]
[{"$f":"VLOOKUP(B46,CCDDD!$A$3:$B$319,2,FALSE)","v":"38300"},"5301440","COLFAX",0,0,{"$f":"VLOOKUP(B46,'24-25 Adjusted Formula counts'!$A$3:$L$320,8,FALSE)","v":597},{"$f":"ROUND((F46/$F$5*Assumptions!$C$22*Assumptions!$C$30),0)","v":3210},{"$f":"VLOOKUP(B46,'24-25 Adjusted Formula counts'!$A$3:$L$320,9,FALSE)","v":45},{"$f":"ROUND((H46/$H$5*Assumptions!$C$22*Assumptions!$C$31),0)","v":8916},null,12126,null,null,12126,0,12126,null,0,12126,null,{"$f":"IFERROR(VLOOKUP($A46, 'Allocation 2023-24 Final'!$A$7:$S$323,19,FALSE),0)","v":13178},null,-1052,-7.9830019729852791E-2,178,0,null,"5301440","COLFAX"]
[{"$f":"VLOOKUP(B47,CCDDD!$A$3:$B$319,2,FALSE)","v":"36250"},"5301470","COLLEGE PLACE",0,0,{"$f":"VLOOKUP(B47,'24-25 Adjusted Formula counts'!$A$3:$L$320,8,FALSE)","v":2035},{"$f":"ROUND((F47/$F$5*Assumptions!$C$22*Assumptions!$C$30),0)","v":10941},{"$f":"VLOOKUP(B47,'24-25 Adjusted Formula counts'!$A$3:$L$320,9,FALSE)","v":208},{"$f":"ROUND((H47/$H$5*Assumptions!$C$22*Assumptions!$C$31),0)","v":41210},null,52151,null,null,52151,0,52151,null,0,52151,null,{"$f":"IFERROR(VLOOKUP($A47, 'Allocation 2023-24 Final'!$A$7:$S$323,19,FALSE),0)","v":58831},null,-6680,-0.11354557971137666,248,0,null,"5301470","COLLEGE PLACE"]
[{"$f":"VLOOKUP(B48,CCDDD!$A$3:$B$319,2,FALSE)","v":"38306"},"5301500","COLTON",0,0,{"$f":"VLOOKUP(B48,'24-25 Adjusted Formula counts'!$A$3:$L$320,8,FALSE)","v":240},{"$f":"ROUND((F48/$F$5*Assumptions!$C$22*Assumptions!$C$30),0)","v":1290},{"$f":"VLOOKUP(B48,'24-25 Adjusted Formula counts'!$A$3:$L$320,9,FALSE)","v":17},{"$f":"ROUND((H48/$H$5*Assumptions!$C$22*Assumptions!$C$31),0)","v":3368},null,4658,null,null,4658,0,4658,null,0,4658,null,{"$f":"IFERROR(VLOOKUP($A48, 'Allocation 2023-24 Final'!$A$7:$S$323,19,FALSE),0)","v":5201},null,-543,-0.10440299942318784,155,0,null,"5301500","COLTON"]
[{"$f":"VLOOKUP(B49,CCDDD!$A$3:$B$319,2,FALSE)","v":"33206"},"5301560","COLUMBIA (STEV)",0,0,{"$f":"VLOOKUP(B49,'24-25 Adjusted Formula counts'!$A$3:$L$320,8,FALSE)","v":205},{"$f":"ROUND((F49/$F$5*Assumptions!$C$22*Assumptions!$C$30),0)","v":1102},{"$f":"VLOOKUP(B49,'24-25 Adjusted Formula counts'!$A$3:$L$320,9,FALSE)","v":42},{"$f":"ROUND((H49/$H$5*Assumptions!$C$22*Assumptions!$C$31),0)","v":8321},null,9423,null,null,9423,0,9423,null,0,9423,null,{"$f":"IFERROR(VLOOKUP($A49, 'Allocation 2023-24 Final'!$A$7:$S$323,19,FALSE),0)","v":9489},null,-66,-6.9554220676572871E-3,139,0,null,"5301560","COLUMBIA (STEV)"]
[{"$f":"VLOOKUP(B50,CCDDD!$A$3:$B$319,2,FALSE)","v":"36400"},"5301590","COLUMBIA (WALLA)",0,0,{"$f":"VLOOKUP(B50,'24-25 Adjusted Formula counts'!$A$3:$L$320,8,FALSE)","v":756},{"$f":"ROUND((F50/$F$5*Assumptions!$C$22*Assumptions!$C$30),0)","v":4065},{"$f":"VLOOKUP(B50,'24-25 Adjusted Formula counts'!$A$3:$L$320,9,FALSE)","v":98},{"$f":"ROUND((H50/$H$5*Assumptions!$C$22*Assumptions!$C$31),0)","v":19416},null,23481,null,null,23481,0,23481,null,0,23481,null,{"$f":"IFERROR(VLOOKUP($A50, 'Allocation 2023-24 Final'!$A$7:$S$323,19,FALSE),0)","v":21726},null,1755,8.07787903893952E-2,83,0,null,"5301590","COLUMBIA (WALLA)"]
[{"$f":"VLOOKUP(B51,CCDDD!$A$3:$B$319,2,FALSE)","v":"33115"},"5301630","COLVILLE",0,0,{"$f":"VLOOKUP(B51,'24-25 Adjusted Formula counts'!$A$3:$L$320,8,FALSE)","v":1998},{"$f":"ROUND((F51/$F$5*Assumptions!$C$22*Assumptions!$C$30),0)","v":10742},{"$f":"VLOOKUP(B51,'24-25 Adjusted Formula counts'!$A$3:$L$320,9,FALSE)","v":318},{"$f":"ROUND((H51/$H$5*Assumptions!$C$22*Assumptions!$C$31),0)","v":63004},null,73746,null,null,73746,0,73746,null,0,73746,null,{"$f":"IFERROR(VLOOKUP($A51, 'Allocation 2023-24 Final'!$A$7:$S$323,19,FALSE),0)","v":79985},null,-6239,-7.8002125398512215E-2,244,0,null,"5301630","COLVILLE"]
[{"$f":"VLOOKUP(B52,CCDDD!$A$3:$B$319,2,FALSE)","v":"29011"},"5301660","CONCRETE",0,0,{"$f":"VLOOKUP(B52,'24-25 Adjusted Formula counts'!$A$3:$L$320,8,FALSE)","v":716},{"$f":"ROUND((F52/$F$5*Assumptions!$C$22*Assumptions!$C$30),0)","v":3850},{"$f":"VLOOKUP(B52,'24-25 Adjusted Formula counts'!$A$3:$L$320,9,FALSE)","v":140},{"$f":"ROUND((H52/$H$5*Assumptions!$C$22*Assumptions!$C$31),0)","v":27737},null,31587,null,null,31587,0,31587,null,0,31587,null,{"$f":"IFERROR(VLOOKUP($A52, 'Allocation 2023-24 Final'!$A$7:$S$323,19,FALSE),0)","v":32537},null,-950,-2.9197528967022161E-2,174,0,null,"5301660","CONCRETE"]
[{"$f":"VLOOKUP(B53,CCDDD!$A$3:$B$319,2,FALSE)","v":"29317"},"5301680","CONWAY",0,0,{"$f":"VLOOKUP(B53,'24-25 Adjusted Formula counts'!$A$3:$L$320,8,FALSE)","v":542},{"$f":"ROUND((F53/$F$5*Assumptions!$C$22*Assumptions!$C$30),0)","v":2914},{"$f":"VLOOKUP(B53,'24-25 Adjusted Formula counts'!$A$3:$L$320,9,FALSE)","v":58},{"$f":"ROUND((H53/$H$5*Assumptions!$C$22*Assumptions!$C$31),0)","v":11491},null,14405,null,null,14405,0,14405,null,0,14405,null,{"$f":"IFERROR(VLOOKUP($A53, 'Allocation 2023-24 Final'!$A$7:$S$323,19,FALSE),0)","v":12108},null,2297,0.18970928311859928,73,0,null,"5301680","CONWAY"]
[{"$f":"VLOOKUP(B54,CCDDD!$A$3:$B$319,2,FALSE)","v":"14099"},"5301710","COSMOPOLIS",0,0,{"$f":"VLOOKUP(B54,'24-25 Adjusted Formula counts'!$A$3:$L$320,8,FALSE)","v":315},{"$f":"ROUND((F54/$F$5*Assumptions!$C$22*Assumptions!$C$30),0)","v":1694},{"$f":"VLOOKUP(B54,'24-25 Adjusted Formula counts'!$A$3:$L$320,9,FALSE)","v":48},{"$f":"ROUND((H54/$H$5*Assumptions!$C$22*Assumptions!$C$31),0)","v":9510},null,11204,null,null,11204,0,11204,null,0,11204,null,{"$f":"IFERROR(VLOOKUP($A54, 'Allocation 2023-24 Final'!$A$7:$S$323,19,FALSE),0)","v":6978},null,4226,0.60561765548867874,50,0,null,"5301710","COSMOPOLIS"]
[{"$f":"VLOOKUP(B55,CCDDD!$A$3:$B$319,2,FALSE)","v":"13151"},"5303440","COULEE-HARTLINE",0,0,{"$f":"VLOOKUP(B55,'24-25 Adjusted Formula counts'!$A$3:$L$320,8,FALSE)","v":247},{"$f":"ROUND((F55/$F$5*Assumptions!$C$22*Assumptions!$C$30),0)","v":1328},{"$f":"VLOOKUP(B55,'24-25 Adjusted Formula counts'!$A$3:$L$320,9,FALSE)","v":40},{"$f":"ROUND((H55/$H$5*Assumptions!$C$22*Assumptions!$C$31),0)","v":7925},null,9253,null,null,9253,0,9253,null,0,9253,null,{"$f":"IFERROR(VLOOKUP($A55, 'Allocation 2023-24 Final'!$A$7:$S$323,19,FALSE),0)","v":7593},null,1660,0.21862241538258922,85,0,null,"5303440","COULEE-HARTLINE"]
[{"$f":"VLOOKUP(B56,CCDDD!$A$3:$B$319,2,FALSE)","v":"15204"},"5301800","COUPEVILLE",0,0,{"$f":"VLOOKUP(B56,'24-25 Adjusted Formula counts'!$A$3:$L$320,8,FALSE)","v":1094},{"$f":"ROUND((F56/$F$5*Assumptions!$C$22*Assumptions!$C$30),0)","v":5882},{"$f":"VLOOKUP(B56,'24-25 Adjusted Formula counts'!$A$3:$L$320,9,FALSE)","v":95},{"$f":"ROUND((H56/$H$5*Assumptions!$C$22*Assumptions!$C$31),0)","v":18822},null,24704,null,null,24704,0,24704,null,0,24704,null,{"$f":"IFERROR(VLOOKUP($A56, 'Allocation 2023-24 Final'!$A$7:$S$323,19,FALSE),0)","v":29753},null,-5049,-0.16969717339427956,234,0,null,"5301800","COUPEVILLE"]
[{"$f":"VLOOKUP(B57,CCDDD!$A$3:$B$319,2,FALSE)","v":"05313"},"5301830","CRESCENT",0,0,{"$f":"VLOOKUP(B57,'24-25 Adjusted Formula counts'!$A$3:$L$320,8,FALSE)","v":345},{"$f":"ROUND((F57/$F$5*Assumptions!$C$22*Assumptions!$C$30),0)","v":1855},{"$f":"VLOOKUP(B57,'24-25 Adjusted Formula counts'!$A$3:$L$320,9,FALSE)","v":62},{"$f":"ROUND((H57/$H$5*Assumptions!$C$22*Assumptions!$C$31),0)","v":12284},null,14139,null,null,14139,0,14139,null,0,14139,null,{"$f":"IFERROR(VLOOKUP($A57, 'Allocation 2023-24 Final'!$A$7:$S$323,19,FALSE),0)","v":10684},null,3455,0.32338075627105956,57,0,null,"5301830","CRESCENT"]
[{"$f":"VLOOKUP(B58,CCDDD!$A$3:$B$319,2,FALSE)","v":"22073"},"5301860","CRESTON",0,0,{"$f":"VLOOKUP(B58,'24-25 Adjusted Formula counts'!$A$3:$L$320,8,FALSE)","v":114},{"$f":"ROUND((F58/$F$5*Assumptions!$C$22*Assumptions!$C$30),0)","v":613},{"$f":"VLOOKUP(B58,'24-25 Adjusted Formula counts'!$A$3:$L$320,9,FALSE)","v":13},{"$f":"ROUND((H58/$H$5*Assumptions!$C$22*Assumptions!$C$31),0)","v":2576},null,3189,null,null,3189,0,3189,null,0,3189,null,{"$f":"IFERROR(VLOOKUP($A58, 'Allocation 2023-24 Final'!$A$7:$S$323,19,FALSE),0)","v":4292},null,-1103,-0.25698974836905869,180,0,null,"5301860","CRESTON"]
[{"$f":"VLOOKUP(B59,CCDDD!$A$3:$B$319,2,FALSE)","v":"10050"},"5301890","CURLEW",0,0,{"$f":"VLOOKUP(B59,'24-25 Adjusted Formula counts'!$A$3:$L$320,8,FALSE)","v":158},{"$f":"ROUND((F59/$F$5*Assumptions!$C$22*Assumptions!$C$30),0)","v":849},{"$f":"VLOOKUP(B59,'24-25 Adjusted Formula counts'!$A$3:$L$320,9,FALSE)","v":41},{"$f":"ROUND((H59/$H$5*Assumptions!$C$22*Assumptions!$C$31),0)","v":8123},null,8972,null,null,8972,0,8972,null,0,8972,null,{"$f":"IFERROR(VLOOKUP($A59, 'Allocation 2023-24 Final'!$A$7:$S$323,19,FALSE),0)","v":9584},null,-612,-6.3856427378964936E-2,160,0,null,"5301890","CURLEW"]
[{"$f":"VLOOKUP(B60,CCDDD!$A$3:$B$319,2,FALSE)","v":"26059"},"5301920","CUSICK",0,0,{"$f":"VLOOKUP(B60,'24-25 Adjusted Formula counts'!$A$3:$L$320,8,FALSE)","v":316},{"$f":"ROUND((F60/$F$5*Assumptions!$C$22*Assumptions!$C$30),0)","v":1699},{"$f":"VLOOKUP(B60,'24-25 Adjusted Formula counts'!$A$3:$L$320,9,FALSE)","v":70},{"$f":"ROUND((H60/$H$5*Assumptions!$C$22*Assumptions!$C$31),0)","v":13869},null,15568,null,null,15568,0,15568,null,0,15568,null,{"$f":"IFERROR(VLOOKUP($A60, 'Allocation 2023-24 Final'!$A$7:$S$323,19,FALSE),0)","v":13901},null,1667,0.11991943025681606,84,0,null,"5301920","CUSICK"]
[{"$f":"VLOOKUP(B61,CCDDD!$A$3:$B$319,2,FALSE)","v":"19007"},"5301950","DAMMAN",0,0,{"$f":"VLOOKUP(B61,'24-25 Adjusted Formula counts'!$A$3:$L$320,8,FALSE)","v":111},{"$f":"ROUND((F61/$F$5*Assumptions!$C$22*Assumptions!$C$30),0)","v":597},{"$f":"VLOOKUP(B61,'24-25 Adjusted Formula counts'!$A$3:$L$320,9,FALSE)","v":2},{"$f":"ROUND((H61/$H$5*Assumptions!$C$22*Assumptions!$C$31),0)","v":396},null,993,null,null,993,0,993,null,0,993,null,{"$f":"IFERROR(VLOOKUP($A61, 'Allocation 2023-24 Final'!$A$7:$S$323,19,FALSE),0)","v":975},null,18,1.8461538461538463E-2,136,0,null,"5301950","DAMMAN"]
[{"$f":"VLOOKUP(B62,CCDDD!$A$3:$B$319,2,FALSE)","v":"31330"},"5301980","DARRINGTON",0,0,{"$f":"VLOOKUP(B62,'24-25 Adjusted Formula counts'!$A$3:$L$320,8,FALSE)","v":504},{"$f":"ROUND((F62/$F$5*Assumptions!$C$22*Assumptions!$C$30),0)","v":2710},{"$f":"VLOOKUP(B62,'24-25 Adjusted Formula counts'!$A$3:$L$320,9,FALSE)","v":61},{"$f":"ROUND((H62/$H$5*Assumptions!$C$22*Assumptions!$C$31),0)","v":12086},null,14796,null,null,14796,0,14796,null,0,14796,null,{"$f":"IFERROR(VLOOKUP($A62, 'Allocation 2023-24 Final'!$A$7:$S$323,19,FALSE),0)","v":18129},null,-3333,-0.1838490815819957,215,0,null,"5301980","DARRINGTON"]
[{"$f":"VLOOKUP(B63,CCDDD!$A$3:$B$319,2,FALSE)","v":"22207"},"5302010","DAVENPORT",0,0,{"$f":"VLOOKUP(B63,'24-25 Adjusted Formula counts'!$A$3:$L$320,8,FALSE)","v":588},{"$f":"ROUND((F63/$F$5*Assumptions!$C$22*Assumptions!$C$30),0)","v":3161},{"$f":"VLOOKUP(B63,'24-25 Adjusted Formula counts'!$A$3:$L$320,9,FALSE)","v":80},{"$f":"ROUND((H63/$H$5*Assumptions!$C$22*Assumptions!$C$31),0)","v":15850},null,19011,null,null,19011,0,19011,null,0,19011,null,{"$f":"IFERROR(VLOOKUP($A63, 'Allocation 2023-24 Final'!$A$7:$S$323,19,FALSE),0)","v":16113},null,2898,0.17985477564699312,64,0,null,"5302010","DAVENPORT"]
[{"$f":"VLOOKUP(B64,CCDDD!$A$3:$B$319,2,FALSE)","v":"07002"},"5302040","DAYTON",0,0,{"$f":"VLOOKUP(B64,'24-25 Adjusted Formula counts'!$A$3:$L$320,8,FALSE)","v":505},{"$f":"ROUND((F64/$F$5*Assumptions!$C$22*Assumptions!$C$30),0)","v":2715},{"$f":"VLOOKUP(B64,'24-25 Adjusted Formula counts'!$A$3:$L$320,9,FALSE)","v":72},{"$f":"ROUND((H64/$H$5*Assumptions!$C$22*Assumptions!$C$31),0)","v":14265},null,16980,null,null,16980,0,16980,null,0,16980,null,{"$f":"IFERROR(VLOOKUP($A64, 'Allocation 2023-24 Final'!$A$7:$S$323,19,FALSE),0)","v":21716},null,-4736,-0.21808804568060416,232,0,null,"5302040","DAYTON"]
[{"$f":"VLOOKUP(B65,CCDDD!$A$3:$B$319,2,FALSE)","v":"32414"},"5302070","DEER PARK",0,0,{"$f":"VLOOKUP(B65,'24-25 Adjusted Formula counts'!$A$3:$L$320,8,FALSE)","v":2369},{"$f":"ROUND((F65/$F$5*Assumptions!$C$22*Assumptions!$C$30),0)","v":12737},{"$f":"VLOOKUP(B65,'24-25 Adjusted Formula counts'!$A$3:$L$320,9,FALSE)","v":329},{"$f":"ROUND((H65/$H$5*Assumptions!$C$22*Assumptions!$C$31),0)","v":65183},null,77920,null,null,77920,0,77920,null,0,77920,null,{"$f":"IFERROR(VLOOKUP($A65, 'Allocation 2023-24 Final'!$A$7:$S$323,19,FALSE),0)","v":80298},null,-2378,-2.9614685297267677E-2,202,0,null,"5302070","DEER PARK"]
[{"$f":"VLOOKUP(B66,CCDDD!$A$3:$B$319,2,FALSE)","v":"27343"},"5302130","DIERINGER",0,0,{"$f":"VLOOKUP(B66,'24-25 Adjusted Formula counts'!$A$3:$L$320,8,FALSE)","v":2275},{"$f":"ROUND((F66/$F$5*Assumptions!$C$22*Assumptions!$C$30),0)","v":12231},{"$f":"VLOOKUP(B66,'24-25 Adjusted Formula counts'!$A$3:$L$320,9,FALSE)","v":87},{"$f":"ROUND((H66/$H$5*Assumptions!$C$22*Assumptions!$C$31),0)","v":17237},null,29468,null,null,29468,0,29468,null,0,29468,null,{"$f":"IFERROR(VLOOKUP($A66, 'Allocation 2023-24 Final'!$A$7:$S$323,19,FALSE),0)","v":31701},null,-2233,-7.0439418314879654E-2,198,0,null,"5302130","DIERINGER"]
[{"$f":"VLOOKUP(B67,CCDDD!$A$3:$B$319,2,FALSE)","v":"36101"},"5302160","DIXIE",0,0,{"$f":"VLOOKUP(B67,'24-25 Adjusted Formula counts'!$A$3:$L$320,8,FALSE)","v":74},{"$f":"ROUND((F67/$F$5*Assumptions!$C$22*Assumptions!$C$30),0)","v":398},{"$f":"VLOOKUP(B67,'24-25 Adjusted Formula counts'!$A$3:$L$320,9,FALSE)","v":2},{"$f":"ROUND((H67/$H$5*Assumptions!$C$22*Assumptions!$C$31),0)","v":396},null,794,null,null,794,0,794,null,0,794,null,{"$f":"IFERROR(VLOOKUP($A67, 'Allocation 2023-24 Final'!$A$7:$S$323,19,FALSE),0)","v":2361},null,-1567,-0.66370182126217703,188,0,null,"5302160","DIXIE"]
[{"$f":"VLOOKUP(B68,CCDDD!$A$3:$B$319,2,FALSE)","v":"32361"},"5302280","EAST VALLEY (SPK)",0,0,{"$f":"VLOOKUP(B68,'24-25 Adjusted Formula counts'!$A$3:$L$320,8,FALSE)","v":4679},{"$f":"ROUND((F68/$F$5*Assumptions!$C$22*Assumptions!$C$30),0)","v":25156},{"$f":"VLOOKUP(B68,'24-25 Adjusted Formula counts'!$A$3:$L$320,9,FALSE)","v":772},{"$f":"ROUND((H68/$H$5*Assumptions!$C$22*Assumptions!$C$31),0)","v":152952},null,178108,null,null,178108,0,178108,null,0,178108,null,{"$f":"IFERROR(VLOOKUP($A68, 'Allocation 2023-24 Final'!$A$7:$S$323,19,FALSE),0)","v":160127},null,17981,0.11229211813123334,21,0,null,"5302280","EAST VALLEY (SPK)"]
[{"$f":"VLOOKUP(B69,CCDDD!$A$3:$B$319,2,FALSE)","v":"39090"},"5305370","EAST VALLEY (YAK)",0,0,{"$f":"VLOOKUP(B69,'24-25 Adjusted Formula counts'!$A$3:$L$320,8,FALSE)","v":3556},{"$f":"ROUND((F69/$F$5*Assumptions!$C$22*Assumptions!$C$30),0)","v":19119},{"$f":"VLOOKUP(B69,'24-25 Adjusted Formula counts'!$A$3:$L$320,9,FALSE)","v":411},{"$f":"ROUND((H69/$H$5*Assumptions!$C$22*Assumptions!$C$31),0)","v":81429},null,100548,null,null,100548,0,100548,null,0,100548,null,{"$f":"IFERROR(VLOOKUP($A69, 'Allocation 2023-24 Final'!$A$7:$S$323,19,FALSE),0)","v":107281},null,-6733,-6.2760414239240878E-2,249,0,null,"5305370","EAST VALLEY (YAK)"]
[{"$f":"VLOOKUP(B70,CCDDD!$A$3:$B$319,2,FALSE)","v":"09206"},"5302310","EASTMONT",0,0,{"$f":"VLOOKUP(B70,'24-25 Adjusted Formula counts'!$A$3:$L$320,8,FALSE)","v":6325},{"$f":"ROUND((F70/$F$5*Assumptions!$C$22*Assumptions!$C$30),0)","v":34006},{"$f":"VLOOKUP(B70,'24-25 Adjusted Formula counts'!$A$3:$L$320,9,FALSE)","v":597},{"$f":"ROUND((H70/$H$5*Assumptions!$C$22*Assumptions!$C$31),0)","v":118280},null,152286,null,null,152286,0,152286,null,0,152286,null,{"$f":"IFERROR(VLOOKUP($A70, 'Allocation 2023-24 Final'!$A$7:$S$323,19,FALSE),0)","v":165305},null,-13019,-7.8757448353044379E-2,274,0,null,"5302310","EASTMONT"]
[{"$f":"VLOOKUP(B71,CCDDD!$A$3:$B$319,2,FALSE)","v":"19028"},"5302340","EASTON",0,0,{"$f":"VLOOKUP(B71,'24-25 Adjusted Formula counts'!$A$3:$L$320,8,FALSE)","v":150},{"$f":"ROUND((F71/$F$5*Assumptions!$C$22*Assumptions!$C$30),0)","v":806},{"$f":"VLOOKUP(B71,'24-25 Adjusted Formula counts'!$A$3:$L$320,9,FALSE)","v":7},{"$f":"ROUND((H71/$H$5*Assumptions!$C$22*Assumptions!$C$31),0)","v":1387},null,{"$f":"ROUNDDOWN(+I71+G71+E71+D71+J71,0)","v":2193},null,null,{"$f":"K71","v":2193},{"$f":"-ROUND(N71/$N$5*$M$5,0)","v":0},{"$f":"+K71+O71+M71","v":2193},null,{"$f":"-1*(P71*Q71)","v":0},{"$f":"+P71+R71","v":2193},null,{"$f":"IFERROR(VLOOKUP($A71, 'Allocation 2023-24 Final'!$A$7:$S$323,19,FALSE),0)","v":3121},null,{"$f":"+S71-U71","v":-928},{"$f":"IF(U71>0,W71/U71,0)","v":-0.29734059596283241},172,{"$f":"(SUM(D71:E71)/S71)","v":0},null,{"$f":"+B71","v":"5302340"},"EASTON"]
[{"$f":"VLOOKUP(B72,CCDDD!$A$3:$B$319,2,FALSE)","v":"27404"},"5302370","EATONVILLE",0,0,{"$f":"VLOOKUP(B72,'24-25 Adjusted Formula counts'!$A$3:$L$320,8,FALSE)","v":2204},{"$f":"ROUND((F72/$F$5*Assumptions!$C$22*Assumptions!$C$30),0)","v":11850},{"$f":"VLOOKUP(B72,'24-25 Adjusted Formula counts'!$A$3:$L$320,9,FALSE)","v":180},{"$f":"ROUND((H72/$H$5*Assumptions!$C$22*Assumptions!$C$31),0)","v":35662},null,47512,null,null,47512,0,47512,null,0,47512,null,{"$f":"IFERROR(VLOOKUP($A72, 'Allocation 2023-24 Final'!$A$7:$S$323,19,FALSE),0)","v":52936},null,-5424,-0.10246335197219283,{"$f":"RANK(W72,$W$7:$W$322,0)","v":238},0,null,"5302370","EATONVILLE"]
[{"$f":"VLOOKUP(B73,CCDDD!$A$3:$B$319,2,FALSE)","v":"31015"},"5302400","EDMONDS",0,0,{"$f":"VLOOKUP(B73,'24-25 Adjusted Formula counts'!$A$3:$L$320,8,FALSE)","v":24249},{"$f":"ROUND((F73/$F$5*Assumptions!$C$22*Assumptions!$C$30),0)","v":130373},{"$f":"VLOOKUP(B73,'24-25 Adjusted Formula counts'!$A$3:$L$320,9,FALSE)","v":2088},{"$f":"ROUND((H73/$H$5*Assumptions!$C$22*Assumptions!$C$31),0)","v":413684},null,544057,null,null,544057,0,544057,null,0,544057,null,{"$f":"IFERROR(VLOOKUP($A73, 'Allocation 2023-24 Final'!$A$7:$S$323,19,FALSE),0)","v":504290},null,39767,7.8857403478157409E-2,10,0,null,"5302400","EDMONDS"]
[{"$f":"VLOOKUP(B74,CCDDD!$A$3:$B$319,2,FALSE)","v":"19401"},"5302460","ELLENSBURG",0,0,{"$f":"VLOOKUP(B74,'24-25 Adjusted Formula counts'!$A$3:$L$320,8,FALSE)","v":3543},{"$f":"ROUND((F74/$F$5*Assumptions!$C$22*Assumptions!$C$30),0)","v":19049},{"$f":"VLOOKUP(B74,'24-25 Adjusted Formula counts'!$A$3:$L$320,9,FALSE)","v":377},{"$f":"ROUND((H74/$H$5*Assumptions!$C$22*Assumptions!$C$31),0)","v":74693},null,93742,null,null,93742,0,93742,null,0,93742,null,{"$f":"IFERROR(VLOOKUP($A74, 'Allocation 2023-24 Final'!$A$7:$S$323,19,FALSE),0)","v":103006},null,-9264,-8.9936508552899835E-2,260,0,null,"5302460","ELLENSBURG"]
[{"$f":"VLOOKUP(B75,CCDDD!$A$3:$B$319,2,FALSE)","v":"14068"},"5302490","ELMA",0,0,{"$f":"VLOOKUP(B75,'24-25 Adjusted Formula counts'!$A$3:$L$320,8,FALSE)","v":1588},{"$f":"ROUND((F75/$F$5*Assumptions!$C$22*Assumptions!$C$30),0)","v":8538},{"$f":"VLOOKUP(B75,'24-25 Adjusted Formula counts'!$A$3:$L$320,9,FALSE)","v":325},{"$f":"ROUND((H75/$H$5*Assumptions!$C$22*Assumptions!$C$31),0)","v":64390},null,72928,null,null,72928,0,72928,null,0,72928,null,{"$f":"IFERROR(VLOOKUP($A75, 'Allocation 2023-24 Final'!$A$7:$S$323,19,FALSE),0)","v":63968},null,8960,0.14007003501750875,34,0,null,"5302490","ELMA"]
[{"$f":"VLOOKUP(B76,CCDDD!$A$3:$B$319,2,FALSE)","v":"38308"},"5302520","ENDICOTT",0,0,{"$f":"VLOOKUP(B76,'24-25 Adjusted Formula counts'!$A$3:$L$320,8,FALSE)","v":87},{"$f":"ROUND((F76/$F$5*Assumptions!$C$22*Assumptions!$C$30),0)","v":468},{"$f":"VLOOKUP(B76,'24-25 Adjusted Formula counts'!$A$3:$L$320,9,FALSE)","v":17},{"$f":"ROUND((H76/$H$5*Assumptions!$C$22*Assumptions!$C$31),0)","v":3368},null,3836,null,null,3836,0,3836,null,0,3836,null,{"$f":"IFERROR(VLOOKUP($A76, 'Allocation 2023-24 Final'!$A$7:$S$323,19,FALSE),0)","v":3974},null,-138,-3.4725717161550075E-2,142,0,null,"5302520","ENDICOTT"]
[{"$f":"VLOOKUP(B77,CCDDD!$A$3:$B$319,2,FALSE)","v":"04127"},"5302550","ENTIAT",0,0,{"$f":"VLOOKUP(B77,'24-25 Adjusted Formula counts'!$A$3:$L$320,8,FALSE)","v":406},{"$f":"ROUND((F77/$F$5*Assumptions!$C$22*Assumptions!$C$30),0)","v":2183},{"$f":"VLOOKUP(B77,'24-25 Adjusted Formula counts'!$A$3:$L$320,9,FALSE)","v":66},{"$f":"ROUND((H77/$H$5*Assumptions!$C$22*Assumptions!$C$31),0)","v":13076},null,15259,null,null,15259,0,15259,null,0,15259,null,{"$f":"IFERROR(VLOOKUP($A77, 'Allocation 2023-24 Final'!$A$7:$S$323,19,FALSE),0)","v":14117},null,1142,8.0895374371325351E-2,96,0,null,"5302550","ENTIAT"]
[{"$f":"VLOOKUP(B78,CCDDD!$A$3:$B$319,2,FALSE)","v":"17216"},"5300001","ENUMCLAW",0,0,{"$f":"VLOOKUP(B78,'24-25 Adjusted Formula counts'!$A$3:$L$320,8,FALSE)","v":4662},{"$f":"ROUND((F78/$F$5*Assumptions!$C$22*Assumptions!$C$30),0)","v":25065},{"$f":"VLOOKUP(B78,'24-25 Adjusted Formula counts'!$A$3:$L$320,9,FALSE)","v":282},{"$f":"ROUND((H78/$H$5*Assumptions!$C$22*Assumptions!$C$31),0)","v":55871},null,80936,null,null,80936,0,80936,null,0,80936,null,{"$f":"IFERROR(VLOOKUP($A78, 'Allocation 2023-24 Final'!$A$7:$S$323,19,FALSE),0)","v":91652},null,-10716,-0.11692052546589272,270,0,null,"5300001","ENUMCLAW"]
[{"$f":"VLOOKUP(B79,CCDDD!$A$3:$B$319,2,FALSE)","v":"13165"},"5302610","EPHRATA",0,0,{"$f":"VLOOKUP(B79,'24-25 Adjusted Formula counts'!$A$3:$L$320,8,FALSE)","v":2905},{"$f":"ROUND((F79/$F$5*Assumptions!$C$22*Assumptions!$C$30),0)","v":15618},{"$f":"VLOOKUP(B79,'24-25 Adjusted Formula counts'!$A$3:$L$320,9,FALSE)","v":461},{"$f":"ROUND((H79/$H$5*Assumptions!$C$22*Assumptions!$C$31),0)","v":91335},null,106953,null,null,106953,0,106953,null,0,106953,null,{"$f":"IFERROR(VLOOKUP($A79, 'Allocation 2023-24 Final'!$A$7:$S$323,19,FALSE),0)","v":82097},null,24856,0.30276380379307405,13,0,null,"5302610","EPHRATA"]
[{"$f":"VLOOKUP(B80,CCDDD!$A$3:$B$319,2,FALSE)","v":"21036"},"5302640","EVALINE",0,0,{"$f":"VLOOKUP(B80,'24-25 Adjusted Formula counts'!$A$3:$L$320,8,FALSE)","v":128},{"$f":"ROUND((F80/$F$5*Assumptions!$C$22*Assumptions!$C$30),0)","v":688},{"$f":"VLOOKUP(B80,'24-25 Adjusted Formula counts'!$A$3:$L$320,9,FALSE)","v":22},{"$f":"ROUND((H80/$H$5*Assumptions!$C$22*Assumptions!$C$31),0)","v":4359},null,5047,null,null,5047,0,5047,null,0,5047,null,{"$f":"IFERROR(VLOOKUP($A80, 'Allocation 2023-24 Final'!$A$7:$S$323,19,FALSE),0)","v":4194},null,853,0.20338578922269909,104,0,null,"5302640","EVALINE"]
[{"$f":"VLOOKUP(B81,CCDDD!$A$3:$B$319,2,FALSE)","v":"31002"},"5302670","EVERETT",0,0,{"$f":"VLOOKUP(B81,'24-25 Adjusted Formula counts'!$A$3:$L$320,8,FALSE)","v":22803},{"$f":"ROUND((F81/$F$5*Assumptions!$C$22*Assumptions!$C$30),0)","v":122598},{"$f":"VLOOKUP(B81,'24-25 Adjusted Formula counts'!$A$3:$L$320,9,FALSE)","v":2315},{"$f":"ROUND((H81/$H$5*Assumptions!$C$22*Assumptions!$C$31),0)","v":458658},null,581256,null,null,581256,0,581256,null,0,581256,null,{"$f":"IFERROR(VLOOKUP($A81, 'Allocation 2023-24 Final'!$A$7:$S$323,19,FALSE),0)","v":493305},null,87951,0.17828929364186458,4,0,null,"5302670","EVERETT"]
[{"$f":"VLOOKUP(B82,CCDDD!$A$3:$B$319,2,FALSE)","v":"06114"},"5302700","EVERGREEN (CLARK)",0,0,{"$f":"VLOOKUP(B82,'24-25 Adjusted Formula counts'!$A$3:$L$320,8,FALSE)","v":26645},{"$f":"ROUND((F82/$F$5*Assumptions!$C$22*Assumptions!$C$30),0)","v":143255},{"$f":"VLOOKUP(B82,'24-25 Adjusted Formula counts'!$A$3:$L$320,9,FALSE)","v":2599},{"$f":"ROUND((H82/$H$5*Assumptions!$C$22*Assumptions!$C$31),0)","v":514925},null,658180,null,null,658180,0,658180,null,0,658180,null,{"$f":"IFERROR(VLOOKUP($A82, 'Allocation 2023-24 Final'!$A$7:$S$323,19,FALSE),0)","v":724637},null,-66457,-9.1710746208101435E-2,311,0,null,"5302700","EVERGREEN (CLARK)"]
[{"$f":"VLOOKUP(B83,CCDDD!$A$3:$B$319,2,FALSE)","v":"33205"},"5302730","EVERGREEN (STEV)",0,0,{"$f":"VLOOKUP(B83,'24-25 Adjusted Formula counts'!$A$3:$L$320,8,FALSE)","v":56},{"$f":"ROUND((F83/$F$5*Assumptions!$C$22*Assumptions!$C$30),0)","v":301},{"$f":"VLOOKUP(B83,'24-25 Adjusted Formula counts'!$A$3:$L$320,9,FALSE)","v":14},{"$f":"ROUND((H83/$H$5*Assumptions!$C$22*Assumptions!$C$31),0)","v":2774},null,3075,null,null,3075,0,3075,null,0,3075,null,{"$f":"IFERROR(VLOOKUP($A83, 'Allocation 2023-24 Final'!$A$7:$S$323,19,FALSE),0)","v":3813},null,-738,-0.19354838709677419,163,0,null,"5302730","EVERGREEN (STEV)"]
[{"$f":"VLOOKUP(B84,CCDDD!$A$3:$B$319,2,FALSE)","v":"17210"},"5302820","FEDERAL WAY",0,0,{"$f":"VLOOKUP(B84,'24-25 Adjusted Formula counts'!$A$3:$L$320,8,FALSE)","v":24062},{"$f":"ROUND((F84/$F$5*Assumptions!$C$22*Assumptions!$C$30),0)","v":129367},{"$f":"VLOOKUP(B84,'24-25 Adjusted Formula counts'!$A$3:$L$320,9,FALSE)","v":4207},{"$f":"ROUND((H84/$H$5*Assumptions!$C$22*Assumptions!$C$31),0)","v":833509},null,962876,null,null,962876,0,962876,null,0,962876,null,{"$f":"IFERROR(VLOOKUP($A84, 'Allocation 2023-24 Final'!$A$7:$S$323,19,FALSE),0)","v":916747},null,46129,5.0318135756102826E-2,8,0,null,"5302820","FEDERAL WAY"]
[{"$f":"VLOOKUP(B85,CCDDD!$A$3:$B$319,2,FALSE)","v":"37502"},"5302850","FERNDALE",0,0,{"$f":"VLOOKUP(B85,'24-25 Adjusted Formula counts'!$A$3:$L$320,8,FALSE)","v":6171},{"$f":"ROUND((F85/$F$5*Assumptions!$C$22*Assumptions!$C$30),0)","v":33178},{"$f":"VLOOKUP(B85,'24-25 Adjusted Formula counts'!$A$3:$L$320,9,FALSE)","v":768},{"$f":"ROUND((H85/$H$5*Assumptions!$C$22*Assumptions!$C$31),0)","v":152160},null,185338,null,null,185338,0,185338,null,0,185338,null,{"$f":"IFERROR(VLOOKUP($A85, 'Allocation 2023-24 Final'!$A$7:$S$323,19,FALSE),0)","v":230528},null,-45190,-0.19602824819544698,307,0,null,"5302850","FERNDALE"]
[{"$f":"VLOOKUP(B86,CCDDD!$A$3:$B$319,2,FALSE)","v":"27417"},"5302880","FIFE",0,0,{"$f":"VLOOKUP(B86,'24-25 Adjusted Formula counts'!$A$3:$L$320,8,FALSE)","v":4064},{"$f":"ROUND((F86/$F$5*Assumptions!$C$22*Assumptions!$C$30),0)","v":21850},{"$f":"VLOOKUP(B86,'24-25 Adjusted Formula counts'!$A$3:$L$320,9,FALSE)","v":357},{"$f":"ROUND((H86/$H$5*Assumptions!$C$22*Assumptions!$C$31),0)","v":70730},null,92580,null,null,92580,0,92580,null,0,92580,null,{"$f":"IFERROR(VLOOKUP($A86, 'Allocation 2023-24 Final'!$A$7:$S$323,19,FALSE),0)","v":100925},null,-8345,-8.2685162249194949E-2,257,0,null,"5302880","FIFE"]
[{"$f":"VLOOKUP(B87,CCDDD!$A$3:$B$319,2,FALSE)","v":"03053"},"5302910","FINLEY",0,0,{"$f":"VLOOKUP(B87,'24-25 Adjusted Formula counts'!$A$3:$L$320,8,FALSE)","v":905},{"$f":"ROUND((F87/$F$5*Assumptions!$C$22*Assumptions!$C$30),0)","v":4866},{"$f":"VLOOKUP(B87,'24-25 Adjusted Formula counts'!$A$3:$L$320,9,FALSE)","v":118},{"$f":"ROUND((H87/$H$5*Assumptions!$C$22*Assumptions!$C$31),0)","v":23379},null,28245,null,null,28245,0,28245,null,0,28245,null,{"$f":"IFERROR(VLOOKUP($A87, 'Allocation 2023-24 Final'!$A$7:$S$323,19,FALSE),0)","v":31170},null,-2925,-9.3840230991337828E-2,208,0,null,"5302910","FINLEY"]
[{"$f":"VLOOKUP(B88,CCDDD!$A$3:$B$319,2,FALSE)","v":"27402"},"5302940","FRANKLIN PIERCE",0,0,{"$f":"VLOOKUP(B88,'24-25 Adjusted Formula counts'!$A$3:$L$320,8,FALSE)","v":9266},{"$f":"ROUND((F88/$F$5*Assumptions!$C$22*Assumptions!$C$30),0)","v":49818},{"$f":"VLOOKUP(B88,'24-25 Adjusted Formula counts'!$A$3:$L$320,9,FALSE)","v":1208},{"$f":"ROUND((H88/$H$5*Assumptions!$C$22*Assumptions!$C$31),0)","v":239334},null,289152,null,null,289152,0,289152,null,0,289152,null,{"$f":"IFERROR(VLOOKUP($A88, 'Allocation 2023-24 Final'!$A$7:$S$323,19,FALSE),0)","v":291380},null,-2228,-7.6463724346214563E-3,197,0,null,"5302940","FRANKLIN PIERCE"]
[{"$f":"VLOOKUP(B89,CCDDD!$A$3:$B$319,2,FALSE)","v":"32358"},"5302970","FREEMAN",0,0,{"$f":"VLOOKUP(B89,'24-25 Adjusted Formula counts'!$A$3:$L$320,8,FALSE)","v":994},{"$f":"ROUND((F89/$F$5*Assumptions!$C$22*Assumptions!$C$30),0)","v":5344},{"$f":"VLOOKUP(B89,'24-25 Adjusted Formula counts'!$A$3:$L$320,9,FALSE)","v":49},{"$f":"ROUND((H89/$H$5*Assumptions!$C$22*Assumptions!$C$31),0)","v":9708},null,15052,null,null,15052,0,15052,null,0,15052,null,{"$f":"IFERROR(VLOOKUP($A89, 'Allocation 2023-24 Final'!$A$7:$S$323,19,FALSE),0)","v":16521},null,-1469,-8.8917135766600083E-2,187,0,null,"5302970","FREEMAN"]
[{"$f":"VLOOKUP(B90,CCDDD!$A$3:$B$319,2,FALSE)","v":"38302"},"5303000","GARFIELD",0,0,{"$f":"VLOOKUP(B90,'24-25 Adjusted Formula counts'!$A$3:$L$320,8,FALSE)","v":127},{"$f":"ROUND((F90/$F$5*Assumptions!$C$22*Assumptions!$C$30),0)","v":683},{"$f":"VLOOKUP(B90,'24-25 Adjusted Formula counts'!$A$3:$L$320,9,FALSE)","v":35},{"$f":"ROUND((H90/$H$5*Assumptions!$C$22*Assumptions!$C$31),0)","v":6934},null,7617,null,null,7617,0,7617,null,0,7617,null,{"$f":"IFERROR(VLOOKUP($A90, 'Allocation 2023-24 Final'!$A$7:$S$323,19,FALSE),0)","v":5168},null,2449,0.47387770897832815,69,0,null,"5303000","GARFIELD"]
[{"$f":"VLOOKUP(B91,CCDDD!$A$3:$B$319,2,FALSE)","v":"20401"},"5303030","GLENWOOD",0,0,{"$f":"VLOOKUP(B91,'24-25 Adjusted Formula counts'!$A$3:$L$320,8,FALSE)","v":60},{"$f":"ROUND((F91/$F$5*Assumptions!$C$22*Assumptions!$C$30),0)","v":323},{"$f":"VLOOKUP(B91,'24-25 Adjusted Formula counts'!$A$3:$L$320,9,FALSE)","v":13},{"$f":"ROUND((H91/$H$5*Assumptions!$C$22*Assumptions!$C$31),0)","v":2576},null,2899,null,null,2899,0,2899,null,0,2899,null,{"$f":"IFERROR(VLOOKUP($A91, 'Allocation 2023-24 Final'!$A$7:$S$323,19,FALSE),0)","v":3450},null,-551,-0.15971014492753624,156,0,null,"5303030","GLENWOOD"]
[{"$f":"VLOOKUP(B92,CCDDD!$A$3:$B$319,2,FALSE)","v":"20404"},"5303090","GOLDENDALE",0,0,{"$f":"VLOOKUP(B92,'24-25 Adjusted Formula counts'!$A$3:$L$320,8,FALSE)","v":1055},{"$f":"ROUND((F92/$F$5*Assumptions!$C$22*Assumptions!$C$30),0)","v":5672},{"$f":"VLOOKUP(B92,'24-25 Adjusted Formula counts'!$A$3:$L$320,9,FALSE)","v":216},{"$f":"ROUND((H92/$H$5*Assumptions!$C$22*Assumptions!$C$31),0)","v":42795},null,48467,null,null,48467,0,48467,null,0,48467,null,{"$f":"IFERROR(VLOOKUP($A92, 'Allocation 2023-24 Final'!$A$7:$S$323,19,FALSE),0)","v":52735},null,-4268,-8.093296672039442E-2,229,0,null,"5303090","GOLDENDALE"]
[{"$f":"VLOOKUP(B93,CCDDD!$A$3:$B$319,2,FALSE)","v":"13301"},"5303130","GRAND COULEE",0,0,{"$f":"VLOOKUP(B93,'24-25 Adjusted Formula counts'!$A$3:$L$320,8,FALSE)","v":679},{"$f":"ROUND((F93/$F$5*Assumptions!$C$22*Assumptions!$C$30),0)","v":3651},{"$f":"VLOOKUP(B93,'24-25 Adjusted Formula counts'!$A$3:$L$320,9,FALSE)","v":101},{"$f":"ROUND((H93/$H$5*Assumptions!$C$22*Assumptions!$C$31),0)","v":20011},null,23662,null,null,23662,0,23662,null,0,23662,null,{"$f":"IFERROR(VLOOKUP($A93, 'Allocation 2023-24 Final'!$A$7:$S$323,19,FALSE),0)","v":20827},null,2835,0.13612138089979353,65,0,null,"5303130","GRAND COULEE"]
[{"$f":"VLOOKUP(B94,CCDDD!$A$3:$B$319,2,FALSE)","v":"39200"},"5303150","GRANDVIEW",0,0,{"$f":"VLOOKUP(B94,'24-25 Adjusted Formula counts'!$A$3:$L$320,8,FALSE)","v":3732},{"$f":"ROUND((F94/$F$5*Assumptions!$C$22*Assumptions!$C$30),0)","v":20065},{"$f":"VLOOKUP(B94,'24-25 Adjusted Formula counts'!$A$3:$L$320,9,FALSE)","v":651},{"$f":"ROUND((H94/$H$5*Assumptions!$C$22*Assumptions!$C$31),0)","v":128979},null,149044,null,null,149044,0,149044,null,0,149044,null,{"$f":"IFERROR(VLOOKUP($A94, 'Allocation 2023-24 Final'!$A$7:$S$323,19,FALSE),0)","v":141348},null,7696,5.4447180009621642E-2,37,0,null,"5303150","GRANDVIEW"]
[{"$f":"VLOOKUP(B95,CCDDD!$A$3:$B$319,2,FALSE)","v":"39204"},"5303180","GRANGER",0,0,{"$f":"VLOOKUP(B95,'24-25 Adjusted Formula counts'!$A$3:$L$320,8,FALSE)","v":1587},{"$f":"ROUND((F95/$F$5*Assumptions!$C$22*Assumptions!$C$30),0)","v":8532},{"$f":"VLOOKUP(B95,'24-25 Adjusted Formula counts'!$A$3:$L$320,9,FALSE)","v":368},{"$f":"ROUND((H95/$H$5*Assumptions!$C$22*Assumptions!$C$31),0)","v":72910},null,81442,null,null,81442,0,81442,null,0,81442,null,{"$f":"IFERROR(VLOOKUP($A95, 'Allocation 2023-24 Final'!$A$7:$S$323,19,FALSE),0)","v":77438},null,4004,5.1705880833699217E-2,52,0,null,"5303180","GRANGER"]
[{"$f":"VLOOKUP(B96,CCDDD!$A$3:$B$319,2,FALSE)","v":"31332"},"5303210","GRANITE FALLS",0,0,{"$f":"VLOOKUP(B96,'24-25 Adjusted Formula counts'!$A$3:$L$320,8,FALSE)","v":2798},{"$f":"ROUND((F96/$F$5*Assumptions!$C$22*Assumptions!$C$30),0)","v":15043},{"$f":"VLOOKUP(B96,'24-25 Adjusted Formula counts'!$A$3:$L$320,9,FALSE)","v":214},{"$f":"ROUND((H96/$H$5*Assumptions!$C$22*Assumptions!$C$31),0)","v":42399},null,57442,null,null,57442,0,57442,null,0,57442,null,{"$f":"IFERROR(VLOOKUP($A96, 'Allocation 2023-24 Final'!$A$7:$S$323,19,FALSE),0)","v":55945},null,1497,2.6758423451604254E-2,90,0,null,"5303210","GRANITE FALLS"]
[{"$f":"VLOOKUP(B97,CCDDD!$A$3:$B$319,2,FALSE)","v":"23054"},"5303240","GRAPEVIEW",0,0,{"$f":"VLOOKUP(B97,'24-25 Adjusted Formula counts'!$A$3:$L$320,8,FALSE)","v":338},{"$f":"ROUND((F97/$F$5*Assumptions!$C$22*Assumptions!$C$30),0)","v":1817},{"$f":"VLOOKUP(B97,'24-25 Adjusted Formula counts'!$A$3:$L$320,9,FALSE)","v":26},{"$f":"ROUND((H97/$H$5*Assumptions!$C$22*Assumptions!$C$31),0)","v":5151},null,6968,null,null,6968,0,6968,null,0,6968,null,{"$f":"IFERROR(VLOOKUP($A97, 'Allocation 2023-24 Final'!$A$7:$S$323,19,FALSE),0)","v":10793},null,-3825,-0.35439636801630686,221,0,null,"5303240","GRAPEVIEW"]
[{"$f":"VLOOKUP(B98,CCDDD!$A$3:$B$319,2,FALSE)","v":"32312"},"5303270","GREAT NORTHERN",0,0,{"$f":"VLOOKUP(B98,'24-25 Adjusted Formula counts'!$A$3:$L$320,8,FALSE)","v":187},{"$f":"ROUND((F98/$F$5*Assumptions!$C$22*Assumptions!$C$30),0)","v":1005},{"$f":"VLOOKUP(B98,'24-25 Adjusted Formula counts'!$A$3:$L$320,9,FALSE)","v":43},{"$f":"ROUND((H98/$H$5*Assumptions!$C$22*Assumptions!$C$31),0)","v":8519},null,9524,null,null,9524,0,9524,null,0,9524,null,{"$f":"IFERROR(VLOOKUP($A98, 'Allocation 2023-24 Final'!$A$7:$S$323,19,FALSE),0)","v":9587},null,-63,-6.5713987691665794E-3,138,0,null,"5303270","GREAT NORTHERN"]
[{"$f":"VLOOKUP(B99,CCDDD!$A$3:$B$319,2,FALSE)","v":"17910"},"5303280","RAINIER VALLEY CHARTER",0,0,{"$f":"VLOOKUP(B99,'24-25 Adjusted Formula counts'!$A$3:$L$320,8,FALSE)","v":308.06056000467635},{"$f":"ROUND((F99/$F$5*Assumptions!$C$22*Assumptions!$C$30),0)","v":1656},{"$f":"VLOOKUP(B99,'24-25 Adjusted Formula counts'!$A$3:$L$320,9,FALSE)","v":76.240890860995222},{"$f":"ROUND((H99/$H$5*Assumptions!$C$22*Assumptions!$C$31),0)","v":15105},null,16761,null,null,16761,0,16761,null,0,16761,null,{"$f":"IFERROR(VLOOKUP($A99, 'Allocation 2023-24 Final'!$A$7:$S$323,19,FALSE),0)","v":10859},null,5902,0.54351229394971912,43,0,null,"5303280","RAINIER VALLEY CHARTER"]
[{"$f":"VLOOKUP(B100,CCDDD!$A$3:$B$319,2,FALSE)","v":"06103"},"5303300","GREEN MOUNTAIN",0,0,{"$f":"VLOOKUP(B100,'24-25 Adjusted Formula counts'!$A$3:$L$320,8,FALSE)","v":205},{"$f":"ROUND((F100/$F$5*Assumptions!$C$22*Assumptions!$C$30),0)","v":1102},{"$f":"VLOOKUP(B100,'24-25 Adjusted Formula counts'!$A$3:$L$320,9,FALSE)","v":16},{"$f":"ROUND((H100/$H$5*Assumptions!$C$22*Assumptions!$C$31),0)","v":3170},null,4272,null,null,4272,0,4272,null,0,4272,null,{"$f":"IFERROR(VLOOKUP($A100, 'Allocation 2023-24 Final'!$A$7:$S$323,19,FALSE),0)","v":4629},null,-357,-7.7122488658457555E-2,150,0,null,"5303300","GREEN MOUNTAIN"]
[{"$f":"VLOOKUP(B101,CCDDD!$A$3:$B$319,2,FALSE)","v":"34324"},"5303330","GRIFFIN",0,0,{"$f":"VLOOKUP(B101,'24-25 Adjusted Formula counts'!$A$3:$L$320,8,FALSE)","v":897},{"$f":"ROUND((F101/$F$5*Assumptions!$C$22*Assumptions!$C$30),0)","v":4823},{"$f":"VLOOKUP(B101,'24-25 Adjusted Formula counts'!$A$3:$L$320,9,FALSE)","v":42},{"$f":"ROUND((H101/$H$5*Assumptions!$C$22*Assumptions!$C$31),0)","v":8321},null,13144,null,null,13144,0,13144,null,0,13144,null,{"$f":"IFERROR(VLOOKUP($A101, 'Allocation 2023-24 Final'!$A$7:$S$323,19,FALSE),0)","v":17758},null,-4614,-0.25982655704471225,231,0,null,"5303330","GRIFFIN"]
[{"$f":"VLOOKUP(B102,CCDDD!$A$3:$B$319,2,FALSE)","v":"22204"},"5303360","HARRINGTON",0,0,{"$f":"VLOOKUP(B102,'24-25 Adjusted Formula counts'!$A$3:$L$320,8,FALSE)","v":145},{"$f":"ROUND((F102/$F$5*Assumptions!$C$22*Assumptions!$C$30),0)","v":780},{"$f":"VLOOKUP(B102,'24-25 Adjusted Formula counts'!$A$3:$L$320,9,FALSE)","v":12},{"$f":"ROUND((H102/$H$5*Assumptions!$C$22*Assumptions!$C$31),0)","v":2377},null,3157,null,null,3157,0,3157,null,0,3157,null,{"$f":"IFERROR(VLOOKUP($A102, 'Allocation 2023-24 Final'!$A$7:$S$323,19,FALSE),0)","v":4264},null,-1107,-0.25961538461538464,181,0,null,"5303360","HARRINGTON"]
[{"$f":"VLOOKUP(B103,CCDDD!$A$3:$B$319,2,FALSE)","v":"39203"},"5303510","HIGHLAND",0,0,{"$f":"VLOOKUP(B103,'24-25 Adjusted Formula counts'!$A$3:$L$320,8,FALSE)","v":1272},{"$f":"ROUND((F103/$F$5*Assumptions!$C$22*Assumptions!$C$30),0)","v":6839},{"$f":"VLOOKUP(B103,'24-25 Adjusted Formula counts'!$A$3:$L$320,9,FALSE)","v":234},{"$f":"ROUND((H103/$H$5*Assumptions!$C$22*Assumptions!$C$31),0)","v":46361},null,53200,null,null,53200,0,53200,null,0,53200,null,{"$f":"IFERROR(VLOOKUP($A103, 'Allocation 2023-24 Final'!$A$7:$S$323,19,FALSE),0)","v":50777},null,2423,4.771845520609725E-2,70,0,null,"5303510","HIGHLAND"]
[{"$f":"VLOOKUP(B104,CCDDD!$A$3:$B$319,2,FALSE)","v":"17401"},"5303540","HIGHLINE",0,0,{"$f":"VLOOKUP(B104,'24-25 Adjusted Formula counts'!$A$3:$L$320,8,FALSE)","v":19449.959971210283},{"$f":"ROUND((F104/$F$5*Assumptions!$C$22*Assumptions!$C$30),0)","v":104571},{"$f":"VLOOKUP(B104,'24-25 Adjusted Formula counts'!$A$3:$L$320,9,FALSE)","v":2972.0757603023208},{"$f":"ROUND((H104/$H$5*Assumptions!$C$22*Assumptions!$C$31),0)","v":588841},null,693412,null,null,693412,0,693412,null,0,693412,null,{"$f":"IFERROR(VLOOKUP($A104, 'Allocation 2023-24 Final'!$A$7:$S$323,19,FALSE),0)","v":761314},null,-67902,-8.9190531108057913E-2,312,0,null,"5303540","HIGHLINE"]
[{"$f":"VLOOKUP(B105,CCDDD!$A$3:$B$319,2,FALSE)","v":"06098"},"5303570","HOCKINSON",0,0,{"$f":"VLOOKUP(B105,'24-25 Adjusted Formula counts'!$A$3:$L$320,8,FALSE)","v":2170},{"$f":"ROUND((F105/$F$5*Assumptions!$C$22*Assumptions!$C$30),0)","v":11667},{"$f":"VLOOKUP(B105,'24-25 Adjusted Formula counts'!$A$3:$L$320,9,FALSE)","v":92},{"$f":"ROUND((H105/$H$5*Assumptions!$C$22*Assumptions!$C$31),0)","v":18227},null,29894,null,null,29894,0,29894,null,0,29894,null,{"$f":"IFERROR(VLOOKUP($A105, 'Allocation 2023-24 Final'!$A$7:$S$323,19,FALSE),0)","v":39770},null,-9876,-0.24832788534070907,266,0,null,"5303570","HOCKINSON"]
[{"$f":"VLOOKUP(B106,CCDDD!$A$3:$B$319,2,FALSE)","v":"23404"},"5303600","HOOD CANAL",0,0,{"$f":"VLOOKUP(B106,'24-25 Adjusted Formula counts'!$A$3:$L$320,8,FALSE)","v":695},{"$f":"ROUND((F106/$F$5*Assumptions!$C$22*Assumptions!$C$30),0)","v":3737},{"$f":"VLOOKUP(B106,'24-25 Adjusted Formula counts'!$A$3:$L$320,9,FALSE)","v":114},{"$f":"ROUND((H106/$H$5*Assumptions!$C$22*Assumptions!$C$31),0)","v":22586},null,26323,null,null,26323,0,26323,null,0,26323,null,{"$f":"IFERROR(VLOOKUP($A106, 'Allocation 2023-24 Final'!$A$7:$S$323,19,FALSE),0)","v":30449},null,-4126,-0.13550527110906763,224,0,null,"5303600","HOOD CANAL"]
[{"$f":"VLOOKUP(B107,CCDDD!$A$3:$B$319,2,FALSE)","v":"14028"},"5303660","HOQUIAM",0,0,{"$f":"VLOOKUP(B107,'24-25 Adjusted Formula counts'!$A$3:$L$320,8,FALSE)","v":1816},{"$f":"ROUND((F107/$F$5*Assumptions!$C$22*Assumptions!$C$30),0)","v":9764},{"$f":"VLOOKUP(B107,'24-25 Adjusted Formula counts'!$A$3:$L$320,9,FALSE)","v":484},{"$f":"ROUND((H107/$H$5*Assumptions!$C$22*Assumptions!$C$31),0)","v":95892},null,105656,null,null,105656,0,105656,null,0,105656,null,{"$f":"IFERROR(VLOOKUP($A107, 'Allocation 2023-24 Final'!$A$7:$S$323,19,FALSE),0)","v":88393},null,17263,0.19529827022501781,23,0,null,"5303660","HOQUIAM"]
[{"$f":"VLOOKUP(B108,CCDDD!$A$3:$B$319,2,FALSE)","v":"27902"},"5303705","IMPACT COMMENCEMENT BAY CHARTER",0,0,{"$f":"VLOOKUP(B108,'24-25 Adjusted Formula counts'!$A$3:$L$320,8,FALSE)","v":366.61711134827408},{"$f":"ROUND((F108/$F$5*Assumptions!$C$22*Assumptions!$C$30),0)","v":1971},{"$f":"VLOOKUP(B108,'24-25 Adjusted Formula counts'!$A$3:$L$320,9,FALSE)","v":55.139916656143292},{"$f":"ROUND((H108/$H$5*Assumptions!$C$22*Assumptions!$C$31),0)","v":10925},null,12896,null,null,12896,0,12896,null,0,12896,null,{"$f":"IFERROR(VLOOKUP($A108, 'Allocation 2023-24 Final'!$A$7:$S$323,19,FALSE),0)","v":12812},null,84,6.5563534186699971E-3,130,0,null,"5303705","IMPACT COMMENCEMENT BAY CHARTER"]
[{"$f":"VLOOKUP(B109,CCDDD!$A$3:$B$319,2,FALSE)","v":"17911"},"5303700","IMPACT PUGET SOUND CHARTER",0,0,{"$f":"VLOOKUP(B109,'24-25 Adjusted Formula counts'!$A$3:$L$320,8,FALSE)","v":398.57498616491523},{"$f":"ROUND((F109/$F$5*Assumptions!$C$22*Assumptions!$C$30),0)","v":2143},{"$f":"VLOOKUP(B109,'24-25 Adjusted Formula counts'!$A$3:$L$320,9,FALSE)","v":72.405616224648881},{"$f":"ROUND((H109/$H$5*Assumptions!$C$22*Assumptions!$C$31),0)","v":14345},null,16488,null,null,16488,0,16488,null,0,16488,null,{"$f":"IFERROR(VLOOKUP($A109, 'Allocation 2023-24 Final'!$A$7:$S$323,19,FALSE),0)","v":22753},null,-6265,-0.27534830571792729,245,0,null,"5303700","IMPACT PUGET SOUND CHARTER"]
[{"$f":"VLOOKUP(B110,CCDDD!$A$3:$B$319,2,FALSE)","v":"17916"},"5303710","IMPACT SALISH SEA CHARTER",0,0,{"$f":"VLOOKUP(B110,'24-25 Adjusted Formula counts'!$A$3:$L$320,8,FALSE)","v":342.69230769230654},{"$f":"ROUND((F110/$F$5*Assumptions!$C$22*Assumptions!$C$30),0)","v":1842},{"$f":"VLOOKUP(B110,'24-25 Adjusted Formula counts'!$A$3:$L$320,9,FALSE)","v":51.875975039001581},{"$f":"ROUND((H110/$H$5*Assumptions!$C$22*Assumptions!$C$31),0)","v":10278},null,12120,null,null,12120,0,12120,null,0,12120,null,{"$f":"IFERROR(VLOOKUP($A110, 'Allocation 2023-24 Final'!$A$7:$S$323,19,FALSE),0)","v":12529},null,-409,-3.2644265304493575E-2,153,0,null,"5303710","IMPACT SALISH SEA CHARTER"]
[{"$f":"VLOOKUP(B111,CCDDD!$A$3:$B$319,2,FALSE)","v":"10070"},"5300002","INCHELIUM",0,0,{"$f":"VLOOKUP(B111,'24-25 Adjusted Formula counts'!$A$3:$L$320,8,FALSE)","v":189},{"$f":"ROUND((F111/$F$5*Assumptions!$C$22*Assumptions!$C$30),0)","v":1016},{"$f":"VLOOKUP(B111,'24-25 Adjusted Formula counts'!$A$3:$L$320,9,FALSE)","v":44},{"$f":"ROUND((H111/$H$5*Assumptions!$C$22*Assumptions!$C$31),0)","v":8717},null,9733,null,null,9733,0,9733,null,0,9733,null,{"$f":"IFERROR(VLOOKUP($A111, 'Allocation 2023-24 Final'!$A$7:$S$323,19,FALSE),0)","v":9550},null,183,1.9162303664921467E-2,125,0,null,"5300002","INCHELIUM"]
[{"$f":"VLOOKUP(B112,CCDDD!$A$3:$B$319,2,FALSE)","v":"31063"},"5303720","INDEX",0,0,{"$f":"VLOOKUP(B112,'24-25 Adjusted Formula counts'!$A$3:$L$320,8,FALSE)","v":54},{"$f":"ROUND((F112/$F$5*Assumptions!$C$22*Assumptions!$C$30),0)","v":290},{"$f":"VLOOKUP(B112,'24-25 Adjusted Formula counts'!$A$3:$L$320,9,FALSE)","v":9},{"$f":"ROUND((H112/$H$5*Assumptions!$C$22*Assumptions!$C$31),0)","v":1783},null,2073,null,null,2073,0,2073,null,0,2073,null,{"$f":"IFERROR(VLOOKUP($A112, 'Allocation 2023-24 Final'!$A$7:$S$323,19,FALSE),0)","v":2049},null,24,1.171303074670571E-2,133,0,null,"5303720","INDEX"]
[{"$f":"VLOOKUP(B113,CCDDD!$A$3:$B$319,2,FALSE)","v":"17411"},"5303750","ISSAQUAH",0,0,{"$f":"VLOOKUP(B113,'24-25 Adjusted Formula counts'!$A$3:$L$320,8,FALSE)","v":22715},{"$f":"ROUND((F113/$F$5*Assumptions!$C$22*Assumptions!$C$30),0)","v":122125},{"$f":"VLOOKUP(B113,'24-25 Adjusted Formula counts'!$A$3:$L$320,9,FALSE)","v":847},{"$f":"ROUND((H113/$H$5*Assumptions!$C$22*Assumptions!$C$31),0)","v":167811},null,289936,null,null,289936,0,289936,null,0,289936,null,{"$f":"IFERROR(VLOOKUP($A113, 'Allocation 2023-24 Final'!$A$7:$S$323,19,FALSE),0)","v":307105},null,-17169,-5.5905960502108401E-2,287,0,null,"5303750","ISSAQUAH"]
[{"$f":"VLOOKUP(B114,CCDDD!$A$3:$B$319,2,FALSE)","v":"11056"},"5303780","KAHLOTUS",0,0,{"$f":"VLOOKUP(B114,'24-25 Adjusted Formula counts'!$A$3:$L$320,8,FALSE)","v":60},{"$f":"ROUND((F114/$F$5*Assumptions!$C$22*Assumptions!$C$30),0)","v":323},{"$f":"VLOOKUP(B114,'24-25 Adjusted Formula counts'!$A$3:$L$320,9,FALSE)","v":22},{"$f":"ROUND((H114/$H$5*Assumptions!$C$22*Assumptions!$C$31),0)","v":4359},null,4682,null,null,4682,0,4682,null,0,4682,null,{"$f":"IFERROR(VLOOKUP($A114, 'Allocation 2023-24 Final'!$A$7:$S$323,19,FALSE),0)","v":3055},null,1627,0.532569558101473,86,0,null,"5303780","KAHLOTUS"]
[{"$f":"VLOOKUP(B115,CCDDD!$A$3:$B$319,2,FALSE)","v":"08402"},"5303810","KALAMA",0,0,{"$f":"VLOOKUP(B115,'24-25 Adjusted Formula counts'!$A$3:$L$320,8,FALSE)","v":1354},{"$f":"ROUND((F115/$F$5*Assumptions!$C$22*Assumptions!$C$30),0)","v":7280},{"$f":"VLOOKUP(B115,'24-25 Adjusted Formula counts'!$A$3:$L$320,9,FALSE)","v":111},{"$f":"ROUND((H115/$H$5*Assumptions!$C$22*Assumptions!$C$31),0)","v":21992},null,29272,null,null,29272,0,29272,null,0,29272,null,{"$f":"IFERROR(VLOOKUP($A115, 'Allocation 2023-24 Final'!$A$7:$S$323,19,FALSE),0)","v":31068},null,-1796,-5.7808677739152825E-2,189,0,null,"5303810","KALAMA"]
[{"$f":"VLOOKUP(B116,CCDDD!$A$3:$B$319,2,FALSE)","v":"10003"},"5303870","KELLER",0,0,{"$f":"VLOOKUP(B116,'24-25 Adjusted Formula counts'!$A$3:$L$320,8,FALSE)","v":103},{"$f":"ROUND((F116/$F$5*Assumptions!$C$22*Assumptions!$C$30),0)","v":554},{"$f":"VLOOKUP(B116,'24-25 Adjusted Formula counts'!$A$3:$L$320,9,FALSE)","v":31},{"$f":"ROUND((H116/$H$5*Assumptions!$C$22*Assumptions!$C$31),0)","v":6142},null,6696,null,null,6696,0,6696,null,0,6696,null,{"$f":"IFERROR(VLOOKUP($A116, 'Allocation 2023-24 Final'!$A$7:$S$323,19,FALSE),0)","v":6382},null,314,4.9200877467878407E-2,116,0,null,"5303870","KELLER"]
[{"$f":"VLOOKUP(B117,CCDDD!$A$3:$B$319,2,FALSE)","v":"08458"},"5300003","KELSO",0,0,{"$f":"VLOOKUP(B117,'24-25 Adjusted Formula counts'!$A$3:$L$320,8,FALSE)","v":5470},{"$f":"ROUND((F117/$F$5*Assumptions!$C$22*Assumptions!$C$30),0)","v":29409},{"$f":"VLOOKUP(B117,'24-25 Adjusted Formula counts'!$A$3:$L$320,9,FALSE)","v":899},{"$f":"ROUND((H117/$H$5*Assumptions!$C$22*Assumptions!$C$31),0)","v":178114},null,207523,null,null,207523,0,207523,null,0,207523,null,{"$f":"IFERROR(VLOOKUP($A117, 'Allocation 2023-24 Final'!$A$7:$S$323,19,FALSE),0)","v":196084},null,11439,5.8337243222292487E-2,27,0,null,"5300003","KELSO"]
[{"$f":"VLOOKUP(B118,CCDDD!$A$3:$B$319,2,FALSE)","v":"03017"},"5303930","KENNEWICK",0,0,{"$f":"VLOOKUP(B118,'24-25 Adjusted Formula counts'!$A$3:$L$320,8,FALSE)","v":20412},{"$f":"ROUND((F118/$F$5*Assumptions!$C$22*Assumptions!$C$30),0)","v":109743},{"$f":"VLOOKUP(B118,'24-25 Adjusted Formula counts'!$A$3:$L$320,9,FALSE)","v":2775},{"$f":"ROUND((H118/$H$5*Assumptions!$C$22*Assumptions!$C$31),0)","v":549795},null,659538,null,null,659538,0,659538,null,0,659538,null,{"$f":"IFERROR(VLOOKUP($A118, 'Allocation 2023-24 Final'!$A$7:$S$323,19,FALSE),0)","v":608176},null,51362,8.4452526900107863E-2,5,0,null,"5303930","KENNEWICK"]
[{"$f":"VLOOKUP(B119,CCDDD!$A$3:$B$319,2,FALSE)","v":"17415"},"5303960","KENT",0,0,{"$f":"VLOOKUP(B119,'24-25 Adjusted Formula counts'!$A$3:$L$320,8,FALSE)","v":29989},{"$f":"ROUND((F119/$F$5*Assumptions!$C$22*Assumptions!$C$30),0)","v":161233},{"$f":"VLOOKUP(B119,'24-25 Adjusted Formula counts'!$A$3:$L$320,9,FALSE)","v":4261},{"$f":"ROUND((H119/$H$5*Assumptions!$C$22*Assumptions!$C$31),0)","v":844208},null,1005441,null,null,1005441,0,1005441,null,0,1005441,null,{"$f":"IFERROR(VLOOKUP($A119, 'Allocation 2023-24 Final'!$A$7:$S$323,19,FALSE),0)","v":1038529},null,-33088,-3.1860448769365134E-2,304,0,null,"5303960","KENT"]
[{"$f":"VLOOKUP(B120,CCDDD!$A$3:$B$319,2,FALSE)","v":"33212"},"5303990","KETTLE FALLS",0,0,{"$f":"VLOOKUP(B120,'24-25 Adjusted Formula counts'!$A$3:$L$320,8,FALSE)","v":936},{"$f":"ROUND((F120/$F$5*Assumptions!$C$22*Assumptions!$C$30),0)","v":5032},{"$f":"VLOOKUP(B120,'24-25 Adjusted Formula counts'!$A$3:$L$320,9,FALSE)","v":144},{"$f":"ROUND((H120/$H$5*Assumptions!$C$22*Assumptions!$C$31),0)","v":28530},null,33562,null,null,33562,0,33562,null,0,33562,null,{"$f":"IFERROR(VLOOKUP($A120, 'Allocation 2023-24 Final'!$A$7:$S$323,19,FALSE),0)","v":37192},null,-3630,-9.760163476016348E-2,219,0,null,"5303990","KETTLE FALLS"]
[{"$f":"VLOOKUP(B121,CCDDD!$A$3:$B$319,2,FALSE)","v":"03052"},"5304020","KIONA-BENTON",0,0,{"$f":"VLOOKUP(B121,'24-25 Adjusted Formula counts'!$A$3:$L$320,8,FALSE)","v":1729},{"$f":"ROUND((F121/$F$5*Assumptions!$C$22*Assumptions!$C$30),0)","v":9296},{"$f":"VLOOKUP(B121,'24-25 Adjusted Formula counts'!$A$3:$L$320,9,FALSE)","v":241},{"$f":"ROUND((H121/$H$5*Assumptions!$C$22*Assumptions!$C$31),0)","v":47748},null,57044,null,null,57044,0,57044,null,0,57044,null,{"$f":"IFERROR(VLOOKUP($A121, 'Allocation 2023-24 Final'!$A$7:$S$323,19,FALSE),0)","v":61127},null,-4083,-6.6795360479002738E-2,223,0,null,"5304020","KIONA-BENTON"]
[{"$f":"VLOOKUP(B122,CCDDD!$A$3:$B$319,2,FALSE)","v":"19403"},"5304050","KITTITAS",0,0,{"$f":"VLOOKUP(B122,'24-25 Adjusted Formula counts'!$A$3:$L$320,8,FALSE)","v":736},{"$f":"ROUND((F122/$F$5*Assumptions!$C$22*Assumptions!$C$30),0)","v":3957},{"$f":"VLOOKUP(B122,'24-25 Adjusted Formula counts'!$A$3:$L$320,9,FALSE)","v":57},{"$f":"ROUND((H122/$H$5*Assumptions!$C$22*Assumptions!$C$31),0)","v":11293},null,15250,null,null,15250,0,15250,null,0,15250,null,{"$f":"IFERROR(VLOOKUP($A122, 'Allocation 2023-24 Final'!$A$7:$S$323,19,FALSE),0)","v":15175},null,75,4.9423393739703456E-3,131,0,null,"5304050","KITTITAS"]
[{"$f":"VLOOKUP(B123,CCDDD!$A$3:$B$319,2,FALSE)","v":"20402"},"5304080","KLICKITAT",0,0,{"$f":"VLOOKUP(B123,'24-25 Adjusted Formula counts'!$A$3:$L$320,8,FALSE)","v":80},{"$f":"ROUND((F123/$F$5*Assumptions!$C$22*Assumptions!$C$30),0)","v":430},{"$f":"VLOOKUP(B123,'24-25 Adjusted Formula counts'!$A$3:$L$320,9,FALSE)","v":13},{"$f":"ROUND((H123/$H$5*Assumptions!$C$22*Assumptions!$C$31),0)","v":2576},null,3006,null,null,3006,0,3006,null,0,3006,null,{"$f":"IFERROR(VLOOKUP($A123, 'Allocation 2023-24 Final'!$A$7:$S$323,19,FALSE),0)","v":2778},null,228,8.2073434125269976E-2,123,0,null,"5304080","KLICKITAT"]
[{"$f":"VLOOKUP(B124,CCDDD!$A$3:$B$319,2,FALSE)","v":"06101"},"5304170","LA CENTER",0,0,{"$f":"VLOOKUP(B124,'24-25 Adjusted Formula counts'!$A$3:$L$320,8,FALSE)","v":1926},{"$f":"ROUND((F124/$F$5*Assumptions!$C$22*Assumptions!$C$30),0)","v":10355},{"$f":"VLOOKUP(B124,'24-25 Adjusted Formula counts'!$A$3:$L$320,9,FALSE)","v":98},{"$f":"ROUND((H124/$H$5*Assumptions!$C$22*Assumptions!$C$31),0)","v":19416},null,29771,null,null,29771,0,29771,null,0,29771,null,{"$f":"IFERROR(VLOOKUP($A124, 'Allocation 2023-24 Final'!$A$7:$S$323,19,FALSE),0)","v":37848},null,-8077,-0.21340625660536885,255,0,null,"5304170","LA CENTER"]
[{"$f":"VLOOKUP(B125,CCDDD!$A$3:$B$319,2,FALSE)","v":"29311"},"5304110","LA CONNER",0,0,{"$f":"VLOOKUP(B125,'24-25 Adjusted Formula counts'!$A$3:$L$320,8,FALSE)","v":595},{"$f":"ROUND((F125/$F$5*Assumptions!$C$22*Assumptions!$C$30),0)","v":3199},{"$f":"VLOOKUP(B125,'24-25 Adjusted Formula counts'!$A$3:$L$320,9,FALSE)","v":91},{"$f":"ROUND((H125/$H$5*Assumptions!$C$22*Assumptions!$C$31),0)","v":18029},null,21228,null,null,21228,0,21228,null,0,21228,null,{"$f":"IFERROR(VLOOKUP($A125, 'Allocation 2023-24 Final'!$A$7:$S$323,19,FALSE),0)","v":29338},null,-8110,-0.2764332947031154,256,0,null,"5304110","LA CONNER"]
[{"$f":"VLOOKUP(B126,CCDDD!$A$3:$B$319,2,FALSE)","v":"38126"},"5304150","LACROSSE",0,0,{"$f":"VLOOKUP(B126,'24-25 Adjusted Formula counts'!$A$3:$L$320,8,FALSE)","v":87},{"$f":"ROUND((F126/$F$5*Assumptions!$C$22*Assumptions!$C$30),0)","v":468},{"$f":"VLOOKUP(B126,'24-25 Adjusted Formula counts'!$A$3:$L$320,9,FALSE)","v":18},{"$f":"ROUND((H126/$H$5*Assumptions!$C$22*Assumptions!$C$31),0)","v":3566},null,4034,null,null,4034,0,4034,null,0,4034,null,{"$f":"IFERROR(VLOOKUP($A126, 'Allocation 2023-24 Final'!$A$7:$S$323,19,FALSE),0)","v":2221},null,1813,0.8162989644304367,82,0,null,"5304150","LACROSSE"]
[{"$f":"VLOOKUP(B127,CCDDD!$A$3:$B$319,2,FALSE)","v":"04129"},"5301200","LAKE CHELAN",0,0,{"$f":"VLOOKUP(B127,'24-25 Adjusted Formula counts'!$A$3:$L$320,8,FALSE)","v":1236},{"$f":"ROUND((F127/$F$5*Assumptions!$C$22*Assumptions!$C$30),0)","v":6645},{"$f":"VLOOKUP(B127,'24-25 Adjusted Formula counts'!$A$3:$L$320,9,FALSE)","v":163},{"$f":"ROUND((H127/$H$5*Assumptions!$C$22*Assumptions!$C$31),0)","v":32294},null,38939,null,null,38939,0,38939,null,0,38939,null,{"$f":"IFERROR(VLOOKUP($A127, 'Allocation 2023-24 Final'!$A$7:$S$323,19,FALSE),0)","v":39905},null,-966,-2.420749279538905E-2,176,0,null,"5301200","LAKE CHELAN"]
[{"$f":"VLOOKUP(B128,CCDDD!$A$3:$B$319,2,FALSE)","v":"14097"},"5307050","QUINAULT",0,0,{"$f":"VLOOKUP(B128,'24-25 Adjusted Formula counts'!$A$3:$L$320,8,FALSE)","v":174},{"$f":"ROUND((F128/$F$5*Assumptions!$C$22*Assumptions!$C$30),0)","v":935},{"$f":"VLOOKUP(B128,'24-25 Adjusted Formula counts'!$A$3:$L$320,9,FALSE)","v":40},{"$f":"ROUND((H128/$H$5*Assumptions!$C$22*Assumptions!$C$31),0)","v":7925},null,8860,null,null,8860,0,8860,null,0,8860,null,{"$f":"IFERROR(VLOOKUP($A128, 'Allocation 2023-24 Final'!$A$7:$S$323,19,FALSE),0)","v":8932},null,-72,-8.0609046126287505E-3,140,0,null,"5307050","QUINAULT"]
[{"$f":"VLOOKUP(B129,CCDDD!$A$3:$B$319,2,FALSE)","v":"31004"},"5304200","LAKE STEVENS",0,0,{"$f":"VLOOKUP(B129,'24-25 Adjusted Formula counts'!$A$3:$L$320,8,FALSE)","v":10259},{"$f":"ROUND((F129/$F$5*Assumptions!$C$22*Assumptions!$C$30),0)","v":55157},{"$f":"VLOOKUP(B129,'24-25 Adjusted Formula counts'!$A$3:$L$320,9,FALSE)","v":567},{"$f":"ROUND((H129/$H$5*Assumptions!$C$22*Assumptions!$C$31),0)","v":112337},null,167494,null,null,167494,0,167494,null,0,167494,null,{"$f":"IFERROR(VLOOKUP($A129, 'Allocation 2023-24 Final'!$A$7:$S$323,19,FALSE),0)","v":157340},null,10154,6.4535401042328716E-2,30,0,null,"5304200","LAKE STEVENS"]
[{"$f":"VLOOKUP(B130,CCDDD!$A$3:$B$319,2,FALSE)","v":"17414"},"5304230","LAKE WASHINGTON",0,0,{"$f":"VLOOKUP(B130,'24-25 Adjusted Formula counts'!$A$3:$L$320,8,FALSE)","v":35606},{"$f":"ROUND((F130/$F$5*Assumptions!$C$22*Assumptions!$C$30),0)","v":191433},{"$f":"VLOOKUP(B130,'24-25 Adjusted Formula counts'!$A$3:$L$320,9,FALSE)","v":1390},{"$f":"ROUND((H130/$H$5*Assumptions!$C$22*Assumptions!$C$31),0)","v":275393},null,466826,null,null,466826,0,466826,null,0,466826,null,{"$f":"IFERROR(VLOOKUP($A130, 'Allocation 2023-24 Final'!$A$7:$S$323,19,FALSE),0)","v":493246},null,-26420,-5.3563536247633027E-2,300,0,null,"5304230","LAKE WASHINGTON"]
[{"$f":"VLOOKUP(B131,CCDDD!$A$3:$B$319,2,FALSE)","v":"31306"},"5304260","LAKEWOOD",0,0,{"$f":"VLOOKUP(B131,'24-25 Adjusted Formula counts'!$A$3:$L$320,8,FALSE)","v":2643},{"$f":"ROUND((F131/$F$5*Assumptions!$C$22*Assumptions!$C$30),0)","v":14210},{"$f":"VLOOKUP(B131,'24-25 Adjusted Formula counts'!$A$3:$L$320,9,FALSE)","v":351},{"$f":"ROUND((H131/$H$5*Assumptions!$C$22*Assumptions!$C$31),0)","v":69542},null,83752,null,null,83752,0,83752,null,0,83752,null,{"$f":"IFERROR(VLOOKUP($A131, 'Allocation 2023-24 Final'!$A$7:$S$323,19,FALSE),0)","v":72249},null,11503,0.1592132763083226,26,0,null,"5304260","LAKEWOOD"]
[{"$f":"VLOOKUP(B132,CCDDD!$A$3:$B$319,2,FALSE)","v":"38264"},"5304290","LAMONT",0,0,{"$f":"VLOOKUP(B132,'24-25 Adjusted Formula counts'!$A$3:$L$320,8,FALSE)","v":27},{"$f":"ROUND((F132/$F$5*Assumptions!$C$22*Assumptions!$C$30),0)","v":145},{"$f":"VLOOKUP(B132,'24-25 Adjusted Formula counts'!$A$3:$L$320,9,FALSE)","v":9},{"$f":"ROUND((H132/$H$5*Assumptions!$C$22*Assumptions!$C$31),0)","v":1783},null,1928,null,null,1928,0,1928,null,0,1928,null,{"$f":"IFERROR(VLOOKUP($A132, 'Allocation 2023-24 Final'!$A$7:$S$323,19,FALSE),0)","v":1904},null,24,1.2605042016806723E-2,133,0,null,"5304290","LAMONT"]
[{"$f":"VLOOKUP(B133,CCDDD!$A$3:$B$319,2,FALSE)","v":"32362"},"5304380","LIBERTY",0,0,{"$f":"VLOOKUP(B133,'24-25 Adjusted Formula counts'!$A$3:$L$320,8,FALSE)","v":827},{"$f":"ROUND((F133/$F$5*Assumptions!$C$22*Assumptions!$C$30),0)","v":4446},{"$f":"VLOOKUP(B133,'24-25 Adjusted Formula counts'!$A$3:$L$320,9,FALSE)","v":77},{"$f":"ROUND((H133/$H$5*Assumptions!$C$22*Assumptions!$C$31),0)","v":15256},null,19702,null,null,19702,0,19702,null,0,19702,null,{"$f":"IFERROR(VLOOKUP($A133, 'Allocation 2023-24 Final'!$A$7:$S$323,19,FALSE),0)","v":17556},null,2146,0.12223741171109592,77,0,null,"5304380","LIBERTY"]
[{"$f":"VLOOKUP(B134,CCDDD!$A$3:$B$319,2,FALSE)","v":"01158"},"5304410","LIND",0,0,{"$f":"VLOOKUP(B134,'24-25 Adjusted Formula counts'!$A$3:$L$320,8,FALSE)","v":307},{"$f":"ROUND((F134/$F$5*Assumptions!$C$22*Assumptions!$C$30),0)","v":1651},{"$f":"VLOOKUP(B134,'24-25 Adjusted Formula counts'!$A$3:$L$320,9,FALSE)","v":81},{"$f":"ROUND((H134/$H$5*Assumptions!$C$22*Assumptions!$C$31),0)","v":16048},null,17699,null,null,17699,0,17699,null,0,17699,null,{"$f":"IFERROR(VLOOKUP($A134, 'Allocation 2023-24 Final'!$A$7:$S$323,19,FALSE),0)","v":14523},null,3176,0.2186875989809268,59,0,null,"5304410","LIND"]
[{"$f":"VLOOKUP(B135,CCDDD!$A$3:$B$319,2,FALSE)","v":"08122"},"5304470","LONGVIEW",0,0,{"$f":"VLOOKUP(B135,'24-25 Adjusted Formula counts'!$A$3:$L$320,8,FALSE)","v":7214},{"$f":"ROUND((F135/$F$5*Assumptions!$C$22*Assumptions!$C$30),0)","v":38785},{"$f":"VLOOKUP(B135,'24-25 Adjusted Formula counts'!$A$3:$L$320,9,FALSE)","v":1316},{"$f":"ROUND((H135/$H$5*Assumptions!$C$22*Assumptions!$C$31),0)","v":260732},null,{"$f":"ROUNDDOWN(+I135+G135+E135+D135+J135,0)","v":299517},null,null,{"$f":"K135","v":299517},{"$f":"-ROUND(N135/$N$5*$M$5,0)","v":0},{"$f":"+K135+O135+M135","v":299517},null,{"$f":"-1*(P135*Q135)","v":0},{"$f":"+P135+R135","v":299517},null,{"$f":"IFERROR(VLOOKUP($A135, 'Allocation 2023-24 Final'!$A$7:$S$323,19,FALSE),0)","v":269982},null,{"$f":"+S135-U135","v":29535},{"$f":"IF(U135>0,W135/U135,0)","v":0.10939618196768673},12,{"$f":"(SUM(D135:E135)/S135)","v":0},null,{"$f":"+B135","v":"5304470"},"LONGVIEW"]
[{"$f":"VLOOKUP(B136,CCDDD!$A$3:$B$319,2,FALSE)","v":"33183"},"5304500","LOON LAKE",0,0,{"$f":"VLOOKUP(B136,'24-25 Adjusted Formula counts'!$A$3:$L$320,8,FALSE)","v":255},{"$f":"ROUND((F136/$F$5*Assumptions!$C$22*Assumptions!$C$30),0)","v":1371},{"$f":"VLOOKUP(B136,'24-25 Adjusted Formula counts'!$A$3:$L$320,9,FALSE)","v":50},{"$f":"ROUND((H136/$H$5*Assumptions!$C$22*Assumptions!$C$31),0)","v":9906},null,11277,null,null,11277,0,11277,null,0,11277,null,{"$f":"IFERROR(VLOOKUP($A136, 'Allocation 2023-24 Final'!$A$7:$S$323,19,FALSE),0)","v":9952},null,1325,0.13313906752411575,{"$f":"RANK(W136,$W$7:$W$322,0)","v":92},0,null,"5304500","LOON LAKE"]
[{"$f":"VLOOKUP(B137,CCDDD!$A$3:$B$319,2,FALSE)","v":"28144"},"5304530","LOPEZ",0,0,{"$f":"VLOOKUP(B137,'24-25 Adjusted Formula counts'!$A$3:$L$320,8,FALSE)","v":286},{"$f":"ROUND((F137/$F$5*Assumptions!$C$22*Assumptions!$C$30),0)","v":1538},{"$f":"VLOOKUP(B137,'24-25 Adjusted Formula counts'!$A$3:$L$320,9,FALSE)","v":47},{"$f":"ROUND((H137/$H$5*Assumptions!$C$22*Assumptions!$C$31),0)","v":9312},null,10850,null,null,10850,0,10850,null,0,10850,null,{"$f":"IFERROR(VLOOKUP($A137, 'Allocation 2023-24 Final'!$A$7:$S$323,19,FALSE),0)","v":12657},null,-1807,-0.14276684838429327,190,0,null,"5304530","LOPEZ"]
[{"$f":"VLOOKUP(B138,CCDDD!$A$3:$B$319,2,FALSE)","v":"32903"},"5304550","LUMEN CHARTER",0,0,{"$f":"VLOOKUP(B138,'24-25 Adjusted Formula counts'!$A$3:$L$320,8,FALSE)","v":35.79770402289406},{"$f":"ROUND((F138/$F$5*Assumptions!$C$22*Assumptions!$C$30),0)","v":192},{"$f":"VLOOKUP(B138,'24-25 Adjusted Formula counts'!$A$3:$L$320,9,FALSE)","v":8.7334849409284985},{"$f":"ROUND((H138/$H$5*Assumptions!$C$22*Assumptions!$C$31),0)","v":1730},null,1922,null,null,1922,0,1922,null,0,1922,null,{"$f":"IFERROR(VLOOKUP($A138, 'Allocation 2023-24 Final'!$A$7:$S$323,19,FALSE),0)","v":2008},null,-86,-4.282868525896414E-2,141,0,null,"5304550","LUMEN CHARTER"]
[{"$f":"VLOOKUP(B139,CCDDD!$A$3:$B$319,2,FALSE)","v":"20406"},"5304590","LYLE",0,0,{"$f":"VLOOKUP(B139,'24-25 Adjusted Formula counts'!$A$3:$L$320,8,FALSE)","v":410},{"$f":"ROUND((F139/$F$5*Assumptions!$C$22*Assumptions!$C$30),0)","v":2204},{"$f":"VLOOKUP(B139,'24-25 Adjusted Formula counts'!$A$3:$L$320,9,FALSE)","v":72},{"$f":"ROUND((H139/$H$5*Assumptions!$C$22*Assumptions!$C$31),0)","v":14265},null,16469,null,null,16469,0,16469,null,0,16469,null,{"$f":"IFERROR(VLOOKUP($A139, 'Allocation 2023-24 Final'!$A$7:$S$323,19,FALSE),0)","v":15692},null,777,4.9515676777976039E-2,107,0,null,"5304590","LYLE"]
[{"$f":"VLOOKUP(B140,CCDDD!$A$3:$B$319,2,FALSE)","v":"37504"},"5304620","LYNDEN",0,0,{"$f":"VLOOKUP(B140,'24-25 Adjusted Formula counts'!$A$3:$L$320,8,FALSE)","v":4352},{"$f":"ROUND((F140/$F$5*Assumptions!$C$22*Assumptions!$C$30),0)","v":23398},{"$f":"VLOOKUP(B140,'24-25 Adjusted Formula counts'!$A$3:$L$320,9,FALSE)","v":303},{"$f":"ROUND((H140/$H$5*Assumptions!$C$22*Assumptions!$C$31),0)","v":60032},null,83430,null,null,83430,0,83430,null,0,83430,null,{"$f":"IFERROR(VLOOKUP($A140, 'Allocation 2023-24 Final'!$A$7:$S$323,19,FALSE),0)","v":104656},null,-21226,-0.20281684757682311,293,0,null,"5304620","LYNDEN"]
[{"$f":"VLOOKUP(B141,CCDDD!$A$3:$B$319,2,FALSE)","v":"39120"},"5304650","MABTON",0,0,{"$f":"VLOOKUP(B141,'24-25 Adjusted Formula counts'!$A$3:$L$320,8,FALSE)","v":770},{"$f":"ROUND((F141/$F$5*Assumptions!$C$22*Assumptions!$C$30),0)","v":4140},{"$f":"VLOOKUP(B141,'24-25 Adjusted Formula counts'!$A$3:$L$320,9,FALSE)","v":191},{"$f":"ROUND((H141/$H$5*Assumptions!$C$22*Assumptions!$C$31),0)","v":37842},null,41982,null,null,41982,0,41982,null,0,41982,null,{"$f":"IFERROR(VLOOKUP($A141, 'Allocation 2023-24 Final'!$A$7:$S$323,19,FALSE),0)","v":36155},null,5827,0.16116719679159175,44,0,null,"5304650","MABTON"]
[{"$f":"VLOOKUP(B142,CCDDD!$A$3:$B$319,2,FALSE)","v":"09207"},"5304710","MANSFIELD",0,0,{"$f":"VLOOKUP(B142,'24-25 Adjusted Formula counts'!$A$3:$L$320,8,FALSE)","v":85},{"$f":"ROUND((F142/$F$5*Assumptions!$C$22*Assumptions!$C$30),0)","v":457},{"$f":"VLOOKUP(B142,'24-25 Adjusted Formula counts'!$A$3:$L$320,9,FALSE)","v":16},{"$f":"ROUND((H142/$H$5*Assumptions!$C$22*Assumptions!$C$31),0)","v":3170},null,3627,null,null,3627,0,3627,null,0,3627,null,{"$f":"IFERROR(VLOOKUP($A142, 'Allocation 2023-24 Final'!$A$7:$S$323,19,FALSE),0)","v":5733},null,-2106,-0.36734693877551022,195,0,null,"5304710","MANSFIELD"]
[{"$f":"VLOOKUP(B143,CCDDD!$A$3:$B$319,2,FALSE)","v":"04019"},"5304740","MANSON",0,0,{"$f":"VLOOKUP(B143,'24-25 Adjusted Formula counts'!$A$3:$L$320,8,FALSE)","v":609},{"$f":"ROUND((F143/$F$5*Assumptions!$C$22*Assumptions!$C$30),0)","v":3274},{"$f":"VLOOKUP(B143,'24-25 Adjusted Formula counts'!$A$3:$L$320,9,FALSE)","v":120},{"$f":"ROUND((H143/$H$5*Assumptions!$C$22*Assumptions!$C$31),0)","v":23775},null,27049,null,null,27049,0,27049,null,0,27049,null,{"$f":"IFERROR(VLOOKUP($A143, 'Allocation 2023-24 Final'!$A$7:$S$323,19,FALSE),0)","v":23996},null,3053,0.12722953825637606,61,0,null,"5304740","MANSON"]
[{"$f":"VLOOKUP(B144,CCDDD!$A$3:$B$319,2,FALSE)","v":"23311"},"5304800","MARY M KNIGHT",0,0,{"$f":"VLOOKUP(B144,'24-25 Adjusted Formula counts'!$A$3:$L$320,8,FALSE)","v":206},{"$f":"ROUND((F144/$F$5*Assumptions!$C$22*Assumptions!$C$30),0)","v":1108},{"$f":"VLOOKUP(B144,'24-25 Adjusted Formula counts'!$A$3:$L$320,9,FALSE)","v":33},{"$f":"ROUND((H144/$H$5*Assumptions!$C$22*Assumptions!$C$31),0)","v":6538},null,7646,null,null,7646,0,7646,null,0,7646,null,{"$f":"IFERROR(VLOOKUP($A144, 'Allocation 2023-24 Final'!$A$7:$S$323,19,FALSE),0)","v":7541},null,105,1.3923882774167883E-2,126,0,null,"5304800","MARY M KNIGHT"]
[{"$f":"VLOOKUP(B145,CCDDD!$A$3:$B$319,2,FALSE)","v":"33207"},"5304830","MARY WALKER",0,0,{"$f":"VLOOKUP(B145,'24-25 Adjusted Formula counts'!$A$3:$L$320,8,FALSE)","v":640},{"$f":"ROUND((F145/$F$5*Assumptions!$C$22*Assumptions!$C$30),0)","v":3441},{"$f":"VLOOKUP(B145,'24-25 Adjusted Formula counts'!$A$3:$L$320,9,FALSE)","v":146},{"$f":"ROUND((H145/$H$5*Assumptions!$C$22*Assumptions!$C$31),0)","v":28926},null,32367,null,null,32367,0,32367,null,0,32367,null,{"$f":"IFERROR(VLOOKUP($A145, 'Allocation 2023-24 Final'!$A$7:$S$323,19,FALSE),0)","v":32693},null,-326,-9.9715535435720183E-3,148,0,null,"5304830","MARY WALKER"]
[{"$f":"VLOOKUP(B146,CCDDD!$A$3:$B$319,2,FALSE)","v":"31025"},"5304860","MARYSVILLE",0,0,{"$f":"VLOOKUP(B146,'24-25 Adjusted Formula counts'!$A$3:$L$320,8,FALSE)","v":12544},{"$f":"ROUND((F146/$F$5*Assumptions!$C$22*Assumptions!$C$30),0)","v":67442},{"$f":"VLOOKUP(B146,'24-25 Adjusted Formula counts'!$A$3:$L$320,9,FALSE)","v":1469},{"$f":"ROUND((H146/$H$5*Assumptions!$C$22*Assumptions!$C$31),0)","v":291045},null,358487,null,null,358487,0,358487,null,0,358487,null,{"$f":"IFERROR(VLOOKUP($A146, 'Allocation 2023-24 Final'!$A$7:$S$323,19,FALSE),0)","v":307129},null,51358,0.1672196373510805,6,0,null,"5304860","MARYSVILLE"]
[{"$f":"VLOOKUP(B147,CCDDD!$A$3:$B$319,2,FALSE)","v":"14065"},"5304890","MCCLEARY",0,0,{"$f":"VLOOKUP(B147,'24-25 Adjusted Formula counts'!$A$3:$L$320,8,FALSE)","v":572},{"$f":"ROUND((F147/$F$5*Assumptions!$C$22*Assumptions!$C$30),0)","v":3075},{"$f":"VLOOKUP(B147,'24-25 Adjusted Formula counts'!$A$3:$L$320,9,FALSE)","v":72},{"$f":"ROUND((H147/$H$5*Assumptions!$C$22*Assumptions!$C$31),0)","v":14265},null,17340,null,null,17340,0,17340,null,0,17340,null,{"$f":"IFERROR(VLOOKUP($A147, 'Allocation 2023-24 Final'!$A$7:$S$323,19,FALSE),0)","v":15771},null,1569,9.9486399086931715E-2,88,0,null,"5304890","MCCLEARY"]
[{"$f":"VLOOKUP(B148,CCDDD!$A$3:$B$319,2,FALSE)","v":"32354"},"5304920","MEAD",0,0,{"$f":"VLOOKUP(B148,'24-25 Adjusted Formula counts'!$A$3:$L$320,8,FALSE)","v":12016},{"$f":"ROUND((F148/$F$5*Assumptions!$C$22*Assumptions!$C$30),0)","v":64603},{"$f":"VLOOKUP(B148,'24-25 Adjusted Formula counts'!$A$3:$L$320,9,FALSE)","v":1000},{"$f":"ROUND((H148/$H$5*Assumptions!$C$22*Assumptions!$C$31),0)","v":198124},null,262727,null,null,262727,0,262727,null,0,262727,null,{"$f":"IFERROR(VLOOKUP($A148, 'Allocation 2023-24 Final'!$A$7:$S$323,19,FALSE),0)","v":257398},null,5329,2.0703346568349403E-2,45,0,null,"5304920","MEAD"]
[{"$f":"VLOOKUP(B149,CCDDD!$A$3:$B$319,2,FALSE)","v":"32326"},"5304950","MEDICAL LAKE",0,0,{"$f":"VLOOKUP(B149,'24-25 Adjusted Formula counts'!$A$3:$L$320,8,FALSE)","v":1801},{"$f":"ROUND((F149/$F$5*Assumptions!$C$22*Assumptions!$C$30),0)","v":9683},{"$f":"VLOOKUP(B149,'24-25 Adjusted Formula counts'!$A$3:$L$320,9,FALSE)","v":208},{"$f":"ROUND((H149/$H$5*Assumptions!$C$22*Assumptions!$C$31),0)","v":41210},null,50893,null,null,50893,0,50893,null,0,50893,null,{"$f":"IFERROR(VLOOKUP($A149, 'Allocation 2023-24 Final'!$A$7:$S$323,19,FALSE),0)","v":43522},null,7371,0.16936262120306972,39,0,null,"5304950","MEDICAL LAKE"]
[{"$f":"VLOOKUP(B150,CCDDD!$A$3:$B$319,2,FALSE)","v":"17400"},"5304980","MERCER ISLAND",0,0,{"$f":"VLOOKUP(B150,'24-25 Adjusted Formula counts'!$A$3:$L$320,8,FALSE)","v":4878},{"$f":"ROUND((F150/$F$5*Assumptions!$C$22*Assumptions!$C$30),0)","v":26226},{"$f":"VLOOKUP(B150,'24-25 Adjusted Formula counts'!$A$3:$L$320,9,FALSE)","v":118},{"$f":"ROUND((H150/$H$5*Assumptions!$C$22*Assumptions!$C$31),0)","v":23379},null,49605,null,null,49605,0,49605,null,0,49605,null,{"$f":"IFERROR(VLOOKUP($A150, 'Allocation 2023-24 Final'!$A$7:$S$323,19,FALSE),0)","v":62638},null,-13033,-0.20806858456527985,275,0,null,"5304980","MERCER ISLAND"]
[{"$f":"VLOOKUP(B151,CCDDD!$A$3:$B$319,2,FALSE)","v":"37505"},"5305010","MERIDIAN",0,0,{"$f":"VLOOKUP(B151,'24-25 Adjusted Formula counts'!$A$3:$L$320,8,FALSE)","v":1705},{"$f":"ROUND((F151/$F$5*Assumptions!$C$22*Assumptions!$C$30),0)","v":9167},{"$f":"VLOOKUP(B151,'24-25 Adjusted Formula counts'!$A$3:$L$320,9,FALSE)","v":204},{"$f":"ROUND((H151/$H$5*Assumptions!$C$22*Assumptions!$C$31),0)","v":40417},null,49584,null,null,49584,0,49584,null,0,49584,null,{"$f":"IFERROR(VLOOKUP($A151, 'Allocation 2023-24 Final'!$A$7:$S$323,19,FALSE),0)","v":55497},null,-5913,-0.10654629979998918,242,0,null,"5305010","MERIDIAN"]
[{"$f":"VLOOKUP(B152,CCDDD!$A$3:$B$319,2,FALSE)","v":"24350"},"5305020","METHOW VALLEY",0,0,{"$f":"VLOOKUP(B152,'24-25 Adjusted Formula counts'!$A$3:$L$320,8,FALSE)","v":859},{"$f":"ROUND((F152/$F$5*Assumptions!$C$22*Assumptions!$C$30),0)","v":4618},{"$f":"VLOOKUP(B152,'24-25 Adjusted Formula counts'!$A$3:$L$320,9,FALSE)","v":70},{"$f":"ROUND((H152/$H$5*Assumptions!$C$22*Assumptions!$C$31),0)","v":13869},null,18487,null,null,18487,0,18487,null,0,18487,null,{"$f":"IFERROR(VLOOKUP($A152, 'Allocation 2023-24 Final'!$A$7:$S$323,19,FALSE),0)","v":24294},null,-5807,-0.23903021322137152,240,0,null,"5305020","METHOW VALLEY"]
[{"$f":"VLOOKUP(B153,CCDDD!$A$3:$B$319,2,FALSE)","v":"30031"},"5305040","MILL A",0,0,{"$f":"VLOOKUP(B153,'24-25 Adjusted Formula counts'!$A$3:$L$320,8,FALSE)","v":74},{"$f":"ROUND((F153/$F$5*Assumptions!$C$22*Assumptions!$C$30),0)","v":398},{"$f":"VLOOKUP(B153,'24-25 Adjusted Formula counts'!$A$3:$L$320,9,FALSE)","v":18},{"$f":"ROUND((H153/$H$5*Assumptions!$C$22*Assumptions!$C$31),0)","v":3566},null,3964,null,null,3964,0,3964,null,0,3964,null,{"$f":"IFERROR(VLOOKUP($A153, 'Allocation 2023-24 Final'!$A$7:$S$323,19,FALSE),0)","v":2735},null,1229,0.44936014625228521,94,0,null,"5305040","MILL A"]
[{"$f":"VLOOKUP(B154,CCDDD!$A$3:$B$319,2,FALSE)","v":"31103"},"5305130","MONROE",0,0,{"$f":"VLOOKUP(B154,'24-25 Adjusted Formula counts'!$A$3:$L$320,8,FALSE)","v":6648},{"$f":"ROUND((F154/$F$5*Assumptions!$C$22*Assumptions!$C$30),0)","v":35742},{"$f":"VLOOKUP(B154,'24-25 Adjusted Formula counts'!$A$3:$L$320,9,FALSE)","v":430},{"$f":"ROUND((H154/$H$5*Assumptions!$C$22*Assumptions!$C$31),0)","v":85193},null,120935,null,null,120935,0,120935,null,0,120935,null,{"$f":"IFERROR(VLOOKUP($A154, 'Allocation 2023-24 Final'!$A$7:$S$323,19,FALSE),0)","v":113719},null,7216,6.3454655774320912E-2,41,0,null,"5305130","MONROE"]
[{"$f":"VLOOKUP(B155,CCDDD!$A$3:$B$319,2,FALSE)","v":"14066"},"5305160","MONTESANO",0,0,{"$f":"VLOOKUP(B155,'24-25 Adjusted Formula counts'!$A$3:$L$320,8,FALSE)","v":1334},{"$f":"ROUND((F155/$F$5*Assumptions!$C$22*Assumptions!$C$30),0)","v":7172},{"$f":"VLOOKUP(B155,'24-25 Adjusted Formula counts'!$A$3:$L$320,9,FALSE)","v":206},{"$f":"ROUND((H155/$H$5*Assumptions!$C$22*Assumptions!$C$31),0)","v":40814},null,47986,null,null,47986,0,47986,null,0,47986,null,{"$f":"IFERROR(VLOOKUP($A155, 'Allocation 2023-24 Final'!$A$7:$S$323,19,FALSE),0)","v":38229},null,9757,0.25522509089957884,31,0,null,"5305160","MONTESANO"]
[{"$f":"VLOOKUP(B156,CCDDD!$A$3:$B$319,2,FALSE)","v":"21214"},"5305190","MORTON",0,0,{"$f":"VLOOKUP(B156,'24-25 Adjusted Formula counts'!$A$3:$L$320,8,FALSE)","v":333},{"$f":"ROUND((F156/$F$5*Assumptions!$C$22*Assumptions!$C$30),0)","v":1790},{"$f":"VLOOKUP(B156,'24-25 Adjusted Formula counts'!$A$3:$L$320,9,FALSE)","v":44},{"$f":"ROUND((H156/$H$5*Assumptions!$C$22*Assumptions!$C$31),0)","v":8717},null,10507,null,null,10507,0,10507,null,0,10507,null,{"$f":"IFERROR(VLOOKUP($A156, 'Allocation 2023-24 Final'!$A$7:$S$323,19,FALSE),0)","v":14641},null,-4134,-0.28235776244792021,226,0,null,"5305190","MORTON"]
[{"$f":"VLOOKUP(B157,CCDDD!$A$3:$B$319,2,FALSE)","v":"13161"},"5305220","MOSES LAKE",0,0,{"$f":"VLOOKUP(B157,'24-25 Adjusted Formula counts'!$A$3:$L$320,8,FALSE)","v":9756},{"$f":"ROUND((F157/$F$5*Assumptions!$C$22*Assumptions!$C$30),0)","v":52452},{"$f":"VLOOKUP(B157,'24-25 Adjusted Formula counts'!$A$3:$L$320,9,FALSE)","v":1341},{"$f":"ROUND((H157/$H$5*Assumptions!$C$22*Assumptions!$C$31),0)","v":265685},null,318137,null,null,318137,0,318137,null,0,318137,null,{"$f":"IFERROR(VLOOKUP($A157, 'Allocation 2023-24 Final'!$A$7:$S$323,19,FALSE),0)","v":295221},null,22916,7.7623204311346408E-2,15,0,null,"5305220","MOSES LAKE"]
[{"$f":"VLOOKUP(B158,CCDDD!$A$3:$B$319,2,FALSE)","v":"21206"},"5305250","MOSSYROCK",0,0,{"$f":"VLOOKUP(B158,'24-25 Adjusted Formula counts'!$A$3:$L$320,8,FALSE)","v":699},{"$f":"ROUND((F158/$F$5*Assumptions!$C$22*Assumptions!$C$30),0)","v":3758},{"$f":"VLOOKUP(B158,'24-25 Adjusted Formula counts'!$A$3:$L$320,9,FALSE)","v":124},{"$f":"ROUND((H158/$H$5*Assumptions!$C$22*Assumptions!$C$31),0)","v":24567},null,28325,null,null,28325,0,28325,null,0,28325,null,{"$f":"IFERROR(VLOOKUP($A158, 'Allocation 2023-24 Final'!$A$7:$S$323,19,FALSE),0)","v":24399},null,3926,0.1609082339440141,53,0,null,"5305250","MOSSYROCK"]
[{"$f":"VLOOKUP(B159,CCDDD!$A$3:$B$319,2,FALSE)","v":"39209"},"5305280","MOUNT ADAMS",0,0,{"$f":"VLOOKUP(B159,'24-25 Adjusted Formula counts'!$A$3:$L$320,8,FALSE)","v":998},{"$f":"ROUND((F159/$F$5*Assumptions!$C$22*Assumptions!$C$30),0)","v":5366},{"$f":"VLOOKUP(B159,'24-25 Adjusted Formula counts'!$A$3:$L$320,9,FALSE)","v":259},{"$f":"ROUND((H159/$H$5*Assumptions!$C$22*Assumptions!$C$31),0)","v":51314},null,56680,null,null,56680,0,56680,null,0,56680,null,{"$f":"IFERROR(VLOOKUP($A159, 'Allocation 2023-24 Final'!$A$7:$S$323,19,FALSE),0)","v":53572},null,3108,5.8015381169267528E-2,60,0,null,"5305280","MOUNT ADAMS"]
[{"$f":"VLOOKUP(B160,CCDDD!$A$3:$B$319,2,FALSE)","v":"37507"},"5305310","MOUNT BAKER",0,0,{"$f":"VLOOKUP(B160,'24-25 Adjusted Formula counts'!$A$3:$L$320,8,FALSE)","v":2435},{"$f":"ROUND((F160/$F$5*Assumptions!$C$22*Assumptions!$C$30),0)","v":13092},{"$f":"VLOOKUP(B160,'24-25 Adjusted Formula counts'!$A$3:$L$320,9,FALSE)","v":278},{"$f":"ROUND((H160/$H$5*Assumptions!$C$22*Assumptions!$C$31),0)","v":55079},null,68171,null,null,68171,0,68171,null,0,68171,null,{"$f":"IFERROR(VLOOKUP($A160, 'Allocation 2023-24 Final'!$A$7:$S$323,19,FALSE),0)","v":94366},null,-26195,-0.27758938600767225,299,0,null,"5305310","MOUNT BAKER"]
[{"$f":"VLOOKUP(B161,CCDDD!$A$3:$B$319,2,FALSE)","v":"30029"},"5305340","MOUNT PLEASANT",0,0,{"$f":"VLOOKUP(B161,'24-25 Adjusted Formula counts'!$A$3:$L$320,8,FALSE)","v":41},{"$f":"ROUND((F161/$F$5*Assumptions!$C$22*Assumptions!$C$30),0)","v":220},{"$f":"VLOOKUP(B161,'24-25 Adjusted Formula counts'!$A$3:$L$320,9,FALSE)","v":3},{"$f":"ROUND((H161/$H$5*Assumptions!$C$22*Assumptions!$C$31),0)","v":594},null,814,null,null,814,0,814,null,0,814,null,{"$f":"IFERROR(VLOOKUP($A161, 'Allocation 2023-24 Final'!$A$7:$S$323,19,FALSE),0)","v":1389},null,-575,-0.41396688264938802,159,0,null,"5305340","MOUNT PLEASANT"]
[{"$f":"VLOOKUP(B162,CCDDD!$A$3:$B$319,2,FALSE)","v":"29320"},"5305400","MOUNT VERNON",0,0,{"$f":"VLOOKUP(B162,'24-25 Adjusted Formula counts'!$A$3:$L$320,8,FALSE)","v":6839},{"$f":"ROUND((F162/$F$5*Assumptions!$C$22*Assumptions!$C$30),0)","v":36769},{"$f":"VLOOKUP(B162,'24-25 Adjusted Formula counts'!$A$3:$L$320,9,FALSE)","v":917},{"$f":"ROUND((H162/$H$5*Assumptions!$C$22*Assumptions!$C$31),0)","v":181680},null,218449,null,null,218449,0,218449,null,0,218449,null,{"$f":"IFERROR(VLOOKUP($A162, 'Allocation 2023-24 Final'!$A$7:$S$323,19,FALSE),0)","v":221899},null,-3450,-1.5547614004569646E-2,217,0,null,"5305400","MOUNT VERNON"]
[{"$f":"VLOOKUP(B163,CCDDD!$A$3:$B$319,2,FALSE)","v":"31006"},"5305430","MUKILTEO",0,0,{"$f":"VLOOKUP(B163,'24-25 Adjusted Formula counts'!$A$3:$L$320,8,FALSE)","v":16936},{"$f":"ROUND((F163/$F$5*Assumptions!$C$22*Assumptions!$C$30),0)","v":91055},{"$f":"VLOOKUP(B163,'24-25 Adjusted Formula counts'!$A$3:$L$320,9,FALSE)","v":2310},{"$f":"ROUND((H163/$H$5*Assumptions!$C$22*Assumptions!$C$31),0)","v":457667},null,548722,null,null,548722,0,548722,null,0,548722,null,{"$f":"IFERROR(VLOOKUP($A163, 'Allocation 2023-24 Final'!$A$7:$S$323,19,FALSE),0)","v":458653},null,90069,0.19637721763511848,3,0,null,"5305430","MUKILTEO"]
[{"$f":"VLOOKUP(B164,CCDDD!$A$3:$B$319,2,FALSE)","v":"39003"},"5305460","NACHES VALLEY",0,0,{"$f":"VLOOKUP(B164,'24-25 Adjusted Formula counts'!$A$3:$L$320,8,FALSE)","v":1613},{"$f":"ROUND((F164/$F$5*Assumptions!$C$22*Assumptions!$C$30),0)","v":8672},{"$f":"VLOOKUP(B164,'24-25 Adjusted Formula counts'!$A$3:$L$320,9,FALSE)","v":218},{"$f":"ROUND((H164/$H$5*Assumptions!$C$22*Assumptions!$C$31),0)","v":43191},null,51863,null,null,51863,0,51863,null,0,51863,null,{"$f":"IFERROR(VLOOKUP($A164, 'Allocation 2023-24 Final'!$A$7:$S$323,19,FALSE),0)","v":48158},null,3705,7.6934258067195477E-2,54,0,null,"5305460","NACHES VALLEY"]
[{"$f":"VLOOKUP(B165,CCDDD!$A$3:$B$319,2,FALSE)","v":"21014"},"5305490","NAPAVINE",0,0,{"$f":"VLOOKUP(B165,'24-25 Adjusted Formula counts'!$A$3:$L$320,8,FALSE)","v":774},{"$f":"ROUND((F165/$F$5*Assumptions!$C$22*Assumptions!$C$30),0)","v":4161},{"$f":"VLOOKUP(B165,'24-25 Adjusted Formula counts'!$A$3:$L$320,9,FALSE)","v":65},{"$f":"ROUND((H165/$H$5*Assumptions!$C$22*Assumptions!$C$31),0)","v":12878},null,17039,null,null,17039,0,17039,null,0,17039,null,{"$f":"IFERROR(VLOOKUP($A165, 'Allocation 2023-24 Final'!$A$7:$S$323,19,FALSE),0)","v":19350},null,-2311,-0.11943152454780362,199,0,null,"5305490","NAPAVINE"]
[{"$f":"VLOOKUP(B166,CCDDD!$A$3:$B$319,2,FALSE)","v":"25155"},"5305520","NASELLE-GRAYS",0,0,{"$f":"VLOOKUP(B166,'24-25 Adjusted Formula counts'!$A$3:$L$320,8,FALSE)","v":340},{"$f":"ROUND((F166/$F$5*Assumptions!$C$22*Assumptions!$C$30),0)","v":1828},{"$f":"VLOOKUP(B166,'24-25 Adjusted Formula counts'!$A$3:$L$320,9,FALSE)","v":35},{"$f":"ROUND((H166/$H$5*Assumptions!$C$22*Assumptions!$C$31),0)","v":6934},null,8762,null,null,8762,0,8762,null,0,8762,null,{"$f":"IFERROR(VLOOKUP($A166, 'Allocation 2023-24 Final'!$A$7:$S$323,19,FALSE),0)","v":11193},null,-2431,-0.21718931475029035,203,0,null,"5305520","NASELLE-GRAYS"]
[{"$f":"VLOOKUP(B167,CCDDD!$A$3:$B$319,2,FALSE)","v":"24014"},"5305550","NESPELEM",0,0,{"$f":"VLOOKUP(B167,'24-25 Adjusted Formula counts'!$A$3:$L$320,8,FALSE)","v":253},{"$f":"ROUND((F167/$F$5*Assumptions!$C$22*Assumptions!$C$30),0)","v":1360},{"$f":"VLOOKUP(B167,'24-25 Adjusted Formula counts'!$A$3:$L$320,9,FALSE)","v":68},{"$f":"ROUND((H167/$H$5*Assumptions!$C$22*Assumptions!$C$31),0)","v":13472},null,14832,null,null,14832,0,14832,null,0,14832,null,{"$f":"IFERROR(VLOOKUP($A167, 'Allocation 2023-24 Final'!$A$7:$S$323,19,FALSE),0)","v":12464},null,2368,0.18998716302952504,72,0,null,"5305550","NESPELEM"]
[{"$f":"VLOOKUP(B168,CCDDD!$A$3:$B$319,2,FALSE)","v":"26056"},"5305610","NEWPORT",0,0,{"$f":"VLOOKUP(B168,'24-25 Adjusted Formula counts'!$A$3:$L$320,8,FALSE)","v":1399},{"$f":"ROUND((F168/$F$5*Assumptions!$C$22*Assumptions!$C$30),0)","v":7522},{"$f":"VLOOKUP(B168,'24-25 Adjusted Formula counts'!$A$3:$L$320,9,FALSE)","v":268},{"$f":"ROUND((H168/$H$5*Assumptions!$C$22*Assumptions!$C$31),0)","v":53097},null,60619,null,null,60619,0,60619,null,0,60619,null,{"$f":"IFERROR(VLOOKUP($A168, 'Allocation 2023-24 Final'!$A$7:$S$323,19,FALSE),0)","v":67600},null,-6981,-0.10326923076923077,250,0,null,"5305610","NEWPORT"]
[{"$f":"VLOOKUP(B169,CCDDD!$A$3:$B$319,2,FALSE)","v":"32325"},"5305640","NINE MILE FALLS",0,0,{"$f":"VLOOKUP(B169,'24-25 Adjusted Formula counts'!$A$3:$L$320,8,FALSE)","v":1563},{"$f":"ROUND((F169/$F$5*Assumptions!$C$22*Assumptions!$C$30),0)","v":8403},{"$f":"VLOOKUP(B169,'24-25 Adjusted Formula counts'!$A$3:$L$320,9,FALSE)","v":104},{"$f":"ROUND((H169/$H$5*Assumptions!$C$22*Assumptions!$C$31),0)","v":20605},null,29008,null,null,29008,0,29008,null,0,29008,null,{"$f":"IFERROR(VLOOKUP($A169, 'Allocation 2023-24 Final'!$A$7:$S$323,19,FALSE),0)","v":37510},null,-8502,-0.22665955745134631,258,0,null,"5305640","NINE MILE FALLS"]
[{"$f":"VLOOKUP(B170,CCDDD!$A$3:$B$319,2,FALSE)","v":"37506"},"5305670","NOOKSACK VALLEY",0,0,{"$f":"VLOOKUP(B170,'24-25 Adjusted Formula counts'!$A$3:$L$320,8,FALSE)","v":2210},{"$f":"ROUND((F170/$F$5*Assumptions!$C$22*Assumptions!$C$30),0)","v":11882},{"$f":"VLOOKUP(B170,'24-25 Adjusted Formula counts'!$A$3:$L$320,9,FALSE)","v":200},{"$f":"ROUND((H170/$H$5*Assumptions!$C$22*Assumptions!$C$31),0)","v":39625},null,51507,null,null,51507,0,51507,null,0,51507,null,{"$f":"IFERROR(VLOOKUP($A170, 'Allocation 2023-24 Final'!$A$7:$S$323,19,FALSE),0)","v":69367},null,-17860,-0.25747113180619025,289,0,null,"5305670","NOOKSACK VALLEY"]
[{"$f":"VLOOKUP(B171,CCDDD!$A$3:$B$319,2,FALSE)","v":"14064"},"5305700","NORTH BEACH",0,0,{"$f":"VLOOKUP(B171,'24-25 Adjusted Formula counts'!$A$3:$L$320,8,FALSE)","v":703},{"$f":"ROUND((F171/$F$5*Assumptions!$C$22*Assumptions!$C$30),0)","v":3780},{"$f":"VLOOKUP(B171,'24-25 Adjusted Formula counts'!$A$3:$L$320,9,FALSE)","v":157},{"$f":"ROUND((H171/$H$5*Assumptions!$C$22*Assumptions!$C$31),0)","v":31106},null,34886,null,null,34886,0,34886,null,0,34886,null,{"$f":"IFERROR(VLOOKUP($A171, 'Allocation 2023-24 Final'!$A$7:$S$323,19,FALSE),0)","v":35195},null,-309,-8.7796562011649374E-3,147,0,null,"5305700","NORTH BEACH"]
[{"$f":"VLOOKUP(B172,CCDDD!$A$3:$B$319,2,FALSE)","v":"11051"},"5305730","NORTH FRANKLIN",0,0,{"$f":"VLOOKUP(B172,'24-25 Adjusted Formula counts'!$A$3:$L$320,8,FALSE)","v":2211},{"$f":"ROUND((F172/$F$5*Assumptions!$C$22*Assumptions!$C$30),0)","v":11887},{"$f":"VLOOKUP(B172,'24-25 Adjusted Formula counts'!$A$3:$L$320,9,FALSE)","v":414},{"$f":"ROUND((H172/$H$5*Assumptions!$C$22*Assumptions!$C$31),0)","v":82023},null,93910,null,null,93910,0,93910,null,0,93910,null,{"$f":"IFERROR(VLOOKUP($A172, 'Allocation 2023-24 Final'!$A$7:$S$323,19,FALSE),0)","v":72842},null,21068,0.28922874166003132,16,0,null,"5305730","NORTH FRANKLIN"]
[{"$f":"VLOOKUP(B173,CCDDD!$A$3:$B$319,2,FALSE)","v":"18400"},"5305760","NORTH KITSAP",0,0,{"$f":"VLOOKUP(B173,'24-25 Adjusted Formula counts'!$A$3:$L$320,8,FALSE)","v":7166},{"$f":"ROUND((F173/$F$5*Assumptions!$C$22*Assumptions!$C$30),0)","v":38527},{"$f":"VLOOKUP(B173,'24-25 Adjusted Formula counts'!$A$3:$L$320,9,FALSE)","v":548},{"$f":"ROUND((H173/$H$5*Assumptions!$C$22*Assumptions!$C$31),0)","v":108572},null,147099,null,null,147099,0,147099,null,0,147099,null,{"$f":"IFERROR(VLOOKUP($A173, 'Allocation 2023-24 Final'!$A$7:$S$323,19,FALSE),0)","v":156158},null,-9059,-5.8011757322711612E-2,259,0,null,"5305760","NORTH KITSAP"]
[{"$f":"VLOOKUP(B174,CCDDD!$A$3:$B$319,2,FALSE)","v":"23403"},"5305790","NORTH MASON",0,0,{"$f":"VLOOKUP(B174,'24-25 Adjusted Formula counts'!$A$3:$L$320,8,FALSE)","v":2444},{"$f":"ROUND((F174/$F$5*Assumptions!$C$22*Assumptions!$C$30),0)","v":13140},{"$f":"VLOOKUP(B174,'24-25 Adjusted Formula counts'!$A$3:$L$320,9,FALSE)","v":339},{"$f":"ROUND((H174/$H$5*Assumptions!$C$22*Assumptions!$C$31),0)","v":67164},null,80304,null,null,80304,0,80304,null,0,80304,null,{"$f":"IFERROR(VLOOKUP($A174, 'Allocation 2023-24 Final'!$A$7:$S$323,19,FALSE),0)","v":89994},null,-9690,-0.10767384492299487,263,0,null,"5305790","NORTH MASON"]
[{"$f":"VLOOKUP(B175,CCDDD!$A$3:$B$319,2,FALSE)","v":"25200"},"5305820","NORTH RIVER",0,0,{"$f":"VLOOKUP(B175,'24-25 Adjusted Formula counts'!$A$3:$L$320,8,FALSE)","v":52},{"$f":"ROUND((F175/$F$5*Assumptions!$C$22*Assumptions!$C$30),0)","v":280},{"$f":"VLOOKUP(B175,'24-25 Adjusted Formula counts'!$A$3:$L$320,9,FALSE)","v":7},{"$f":"ROUND((H175/$H$5*Assumptions!$C$22*Assumptions!$C$31),0)","v":1387},null,1667,null,null,1667,0,1667,null,0,1667,null,{"$f":"IFERROR(VLOOKUP($A175, 'Allocation 2023-24 Final'!$A$7:$S$323,19,FALSE),0)","v":1849},null,-182,-9.843158464034614E-2,145,0,null,"5305820","NORTH RIVER"]
[{"$f":"VLOOKUP(B176,CCDDD!$A$3:$B$319,2,FALSE)","v":"34003"},"5305850","NORTH THURSTON",0,0,{"$f":"VLOOKUP(B176,'24-25 Adjusted Formula counts'!$A$3:$L$320,8,FALSE)","v":17009},{"$f":"ROUND((F176/$F$5*Assumptions!$C$22*Assumptions!$C$30),0)","v":91447},{"$f":"VLOOKUP(B176,'24-25 Adjusted Formula counts'!$A$3:$L$320,9,FALSE)","v":1459},{"$f":"ROUND((H176/$H$5*Assumptions!$C$22*Assumptions!$C$31),0)","v":289063},null,380510,null,null,380510,0,380510,null,0,380510,null,{"$f":"IFERROR(VLOOKUP($A176, 'Allocation 2023-24 Final'!$A$7:$S$323,19,FALSE),0)","v":441555},null,-61045,-0.13825004812537509,310,0,null,"5305850","NORTH THURSTON"]
[{"$f":"VLOOKUP(B177,CCDDD!$A$3:$B$319,2,FALSE)","v":"33211"},"5305880","NORTHPORT",0,0,{"$f":"VLOOKUP(B177,'24-25 Adjusted Formula counts'!$A$3:$L$320,8,FALSE)","v":225},{"$f":"ROUND((F177/$F$5*Assumptions!$C$22*Assumptions!$C$30),0)","v":1210},{"$f":"VLOOKUP(B177,'24-25 Adjusted Formula counts'!$A$3:$L$320,9,FALSE)","v":70},{"$f":"ROUND((H177/$H$5*Assumptions!$C$22*Assumptions!$C$31),0)","v":13869},null,15079,null,null,15079,0,15079,null,0,15079,null,{"$f":"IFERROR(VLOOKUP($A177, 'Allocation 2023-24 Final'!$A$7:$S$323,19,FALSE),0)","v":12908},null,2171,0.16819026960024791,75,0,null,"5305880","NORTHPORT"]
[{"$f":"VLOOKUP(B178,CCDDD!$A$3:$B$319,2,FALSE)","v":"17417"},"5305910","NORTHSHORE",0,0,{"$f":"VLOOKUP(B178,'24-25 Adjusted Formula counts'!$A$3:$L$320,8,FALSE)","v":26236},{"$f":"ROUND((F178/$F$5*Assumptions!$C$22*Assumptions!$C$30),0)","v":141056},{"$f":"VLOOKUP(B178,'24-25 Adjusted Formula counts'!$A$3:$L$320,9,FALSE)","v":974},{"$f":"ROUND((H178/$H$5*Assumptions!$C$22*Assumptions!$C$31),0)","v":192973},null,334029,null,null,334029,0,334029,null,0,334029,null,{"$f":"IFERROR(VLOOKUP($A178, 'Allocation 2023-24 Final'!$A$7:$S$323,19,FALSE),0)","v":343780},null,-9751,-2.8364070044796092E-2,265,0,null,"5305910","NORTHSHORE"]
[{"$f":"VLOOKUP(B179,CCDDD!$A$3:$B$319,2,FALSE)","v":"15201"},"5305940","OAK HARBOR",0,0,{"$f":"VLOOKUP(B179,'24-25 Adjusted Formula counts'!$A$3:$L$320,8,FALSE)","v":6006},{"$f":"ROUND((F179/$F$5*Assumptions!$C$22*Assumptions!$C$30),0)","v":32291},{"$f":"VLOOKUP(B179,'24-25 Adjusted Formula counts'!$A$3:$L$320,9,FALSE)","v":409},{"$f":"ROUND((H179/$H$5*Assumptions!$C$22*Assumptions!$C$31),0)","v":81033},null,113324,null,null,113324,0,113324,null,0,113324,null,{"$f":"IFERROR(VLOOKUP($A179, 'Allocation 2023-24 Final'!$A$7:$S$323,19,FALSE),0)","v":140819},null,-27495,-0.19525064089362942,302,0,null,"5305940","OAK HARBOR"]
[{"$f":"VLOOKUP(B180,CCDDD!$A$3:$B$319,2,FALSE)","v":"38324"},"5305970","OAKESDALE",0,0,{"$f":"VLOOKUP(B180,'24-25 Adjusted Formula counts'!$A$3:$L$320,8,FALSE)","v":126},{"$f":"ROUND((F180/$F$5*Assumptions!$C$22*Assumptions!$C$30),0)","v":677},{"$f":"VLOOKUP(B180,'24-25 Adjusted Formula counts'!$A$3:$L$320,9,FALSE)","v":17},{"$f":"ROUND((H180/$H$5*Assumptions!$C$22*Assumptions!$C$31),0)","v":3368},null,4045,null,null,4045,0,4045,null,0,4045,null,{"$f":"IFERROR(VLOOKUP($A180, 'Allocation 2023-24 Final'!$A$7:$S$323,19,FALSE),0)","v":3020},null,1025,0.33940397350993379,100,0,null,"5305970","OAKESDALE"]
[{"$f":"VLOOKUP(B181,CCDDD!$A$3:$B$319,2,FALSE)","v":"14400"},"5306000","OAKVILLE",0,0,{"$f":"VLOOKUP(B181,'24-25 Adjusted Formula counts'!$A$3:$L$320,8,FALSE)","v":450},{"$f":"ROUND((F181/$F$5*Assumptions!$C$22*Assumptions!$C$30),0)","v":2419},{"$f":"VLOOKUP(B181,'24-25 Adjusted Formula counts'!$A$3:$L$320,9,FALSE)","v":108},{"$f":"ROUND((H181/$H$5*Assumptions!$C$22*Assumptions!$C$31),0)","v":21397},null,23816,null,null,23816,0,23816,null,0,23816,null,{"$f":"IFERROR(VLOOKUP($A181, 'Allocation 2023-24 Final'!$A$7:$S$323,19,FALSE),0)","v":16475},null,7341,0.44558421851289831,40,0,null,"5306000","OAKVILLE"]
[{"$f":"VLOOKUP(B182,CCDDD!$A$3:$B$319,2,FALSE)","v":"25101"},"5306060","OCEAN BEACH",0,0,{"$f":"VLOOKUP(B182,'24-25 Adjusted Formula counts'!$A$3:$L$320,8,FALSE)","v":1047},{"$f":"ROUND((F182/$F$5*Assumptions!$C$22*Assumptions!$C$30),0)","v":5629},{"$f":"VLOOKUP(B182,'24-25 Adjusted Formula counts'!$A$3:$L$320,9,FALSE)","v":189},{"$f":"ROUND((H182/$H$5*Assumptions!$C$22*Assumptions!$C$31),0)","v":37446},null,43075,null,null,43075,0,43075,null,0,43075,null,{"$f":"IFERROR(VLOOKUP($A182, 'Allocation 2023-24 Final'!$A$7:$S$323,19,FALSE),0)","v":46636},null,-3561,-7.6357320524916367E-2,218,0,null,"5306060","OCEAN BEACH"]
[{"$f":"VLOOKUP(B183,CCDDD!$A$3:$B$319,2,FALSE)","v":"14172"},"5306090","OCOSTA",0,0,{"$f":"VLOOKUP(B183,'24-25 Adjusted Formula counts'!$A$3:$L$320,8,FALSE)","v":660},{"$f":"ROUND((F183/$F$5*Assumptions!$C$22*Assumptions!$C$30),0)","v":3548},{"$f":"VLOOKUP(B183,'24-25 Adjusted Formula counts'!$A$3:$L$320,9,FALSE)","v":195},{"$f":"ROUND((H183/$H$5*Assumptions!$C$22*Assumptions!$C$31),0)","v":38634},null,42182,null,null,42182,0,42182,null,0,42182,null,{"$f":"IFERROR(VLOOKUP($A183, 'Allocation 2023-24 Final'!$A$7:$S$323,19,FALSE),0)","v":40999},null,1183,2.885436230151955E-2,95,0,null,"5306090","OCOSTA"]
[{"$f":"VLOOKUP(B184,CCDDD!$A$3:$B$319,2,FALSE)","v":"22105"},"5306120","ODESSA",0,0,{"$f":"VLOOKUP(B184,'24-25 Adjusted Formula counts'!$A$3:$L$320,8,FALSE)","v":310},{"$f":"ROUND((F184/$F$5*Assumptions!$C$22*Assumptions!$C$30),0)","v":1667},{"$f":"VLOOKUP(B184,'24-25 Adjusted Formula counts'!$A$3:$L$320,9,FALSE)","v":32},{"$f":"ROUND((H184/$H$5*Assumptions!$C$22*Assumptions!$C$31),0)","v":6340},null,8007,null,null,8007,0,8007,null,0,8007,null,{"$f":"IFERROR(VLOOKUP($A184, 'Allocation 2023-24 Final'!$A$7:$S$323,19,FALSE),0)","v":9424},null,-1417,-0.15036078098471986,185,0,null,"5306120","ODESSA"]
[{"$f":"VLOOKUP(B185,CCDDD!$A$3:$B$319,2,FALSE)","v":"24105"},"5306150","OKANOGAN",0,0,{"$f":"VLOOKUP(B185,'24-25 Adjusted Formula counts'!$A$3:$L$320,8,FALSE)","v":980},{"$f":"ROUND((F185/$F$5*Assumptions!$C$22*Assumptions!$C$30),0)","v":5269},{"$f":"VLOOKUP(B185,'24-25 Adjusted Formula counts'!$A$3:$L$320,9,FALSE)","v":172},{"$f":"ROUND((H185/$H$5*Assumptions!$C$22*Assumptions!$C$31),0)","v":34077},null,39346,null,null,39346,0,39346,null,0,39346,null,{"$f":"IFERROR(VLOOKUP($A185, 'Allocation 2023-24 Final'!$A$7:$S$323,19,FALSE),0)","v":37808},null,1538,4.06792213288193E-2,89,0,null,"5306150","OKANOGAN"]
[{"$f":"VLOOKUP(B186,CCDDD!$A$3:$B$319,2,FALSE)","v":"34111"},"5306180","OLYMPIA",0,0,{"$f":"VLOOKUP(B186,'24-25 Adjusted Formula counts'!$A$3:$L$320,8,FALSE)","v":10394},{"$f":"ROUND((F186/$F$5*Assumptions!$C$22*Assumptions!$C$30),0)","v":55882},{"$f":"VLOOKUP(B186,'24-25 Adjusted Formula counts'!$A$3:$L$320,9,FALSE)","v":1070},{"$f":"ROUND((H186/$H$5*Assumptions!$C$22*Assumptions!$C$31),0)","v":211993},null,267875,null,null,267875,0,267875,null,0,267875,null,{"$f":"IFERROR(VLOOKUP($A186, 'Allocation 2023-24 Final'!$A$7:$S$323,19,FALSE),0)","v":282639},null,-14764,-5.2236244821132254E-2,278,0,null,"5306180","OLYMPIA"]
[{"$f":"VLOOKUP(B187,CCDDD!$A$3:$B$319,2,FALSE)","v":"24019"},"5306220","OMAK",0,0,{"$f":"VLOOKUP(B187,'24-25 Adjusted Formula counts'!$A$3:$L$320,8,FALSE)","v":1930},{"$f":"ROUND((F187/$F$5*Assumptions!$C$22*Assumptions!$C$30),0)","v":10376},{"$f":"VLOOKUP(B187,'24-25 Adjusted Formula counts'!$A$3:$L$320,9,FALSE)","v":371},{"$f":"ROUND((H187/$H$5*Assumptions!$C$22*Assumptions!$C$31),0)","v":73504},null,83880,null,null,83880,0,83880,null,0,83880,null,{"$f":"IFERROR(VLOOKUP($A187, 'Allocation 2023-24 Final'!$A$7:$S$323,19,FALSE),0)","v":90256},null,-6376,-7.0643502925013299E-2,246,0,null,"5306220","OMAK"]
[{"$f":"VLOOKUP(B188,CCDDD!$A$3:$B$319,2,FALSE)","v":"21300"},"5306240","ONALASKA",0,0,{"$f":"VLOOKUP(B188,'24-25 Adjusted Formula counts'!$A$3:$L$320,8,FALSE)","v":933},{"$f":"ROUND((F188/$F$5*Assumptions!$C$22*Assumptions!$C$30),0)","v":5016},{"$f":"VLOOKUP(B188,'24-25 Adjusted Formula counts'!$A$3:$L$320,9,FALSE)","v":127},{"$f":"ROUND((H188/$H$5*Assumptions!$C$22*Assumptions!$C$31),0)","v":25162},null,30178,null,null,30178,0,30178,null,0,30178,null,{"$f":"IFERROR(VLOOKUP($A188, 'Allocation 2023-24 Final'!$A$7:$S$323,19,FALSE),0)","v":32668},null,-2490,-7.6221378719235955E-2,204,0,null,"5306240","ONALASKA"]
[{"$f":"VLOOKUP(B189,CCDDD!$A$3:$B$319,2,FALSE)","v":"33030"},"5306270","ONION CREEK",0,0,{"$f":"VLOOKUP(B189,'24-25 Adjusted Formula counts'!$A$3:$L$320,8,FALSE)","v":62},{"$f":"ROUND((F189/$F$5*Assumptions!$C$22*Assumptions!$C$30),0)","v":333},{"$f":"VLOOKUP(B189,'24-25 Adjusted Formula counts'!$A$3:$L$320,9,FALSE)","v":19},{"$f":"ROUND((H189/$H$5*Assumptions!$C$22*Assumptions!$C$31),0)","v":3764},null,4097,null,null,4097,0,4097,null,0,4097,null,{"$f":"IFERROR(VLOOKUP($A189, 'Allocation 2023-24 Final'!$A$7:$S$323,19,FALSE),0)","v":3261},null,836,0.25636307881018094,106,0,null,"5306270","ONION CREEK"]
[{"$f":"VLOOKUP(B190,CCDDD!$A$3:$B$319,2,FALSE)","v":"28137"},"5306300","ORCAS ISLAND",0,0,{"$f":"VLOOKUP(B190,'24-25 Adjusted Formula counts'!$A$3:$L$320,8,FALSE)","v":587},{"$f":"ROUND((F190/$F$5*Assumptions!$C$22*Assumptions!$C$30),0)","v":3156},{"$f":"VLOOKUP(B190,'24-25 Adjusted Formula counts'!$A$3:$L$320,9,FALSE)","v":79},{"$f":"ROUND((H190/$H$5*Assumptions!$C$22*Assumptions!$C$31),0)","v":15652},null,18808,null,null,18808,0,18808,null,0,18808,null,{"$f":"IFERROR(VLOOKUP($A190, 'Allocation 2023-24 Final'!$A$7:$S$323,19,FALSE),0)","v":19738},null,-930,-4.7117235788833721E-2,173,0,null,"5306300","ORCAS ISLAND"]
[{"$f":"VLOOKUP(B191,CCDDD!$A$3:$B$319,2,FALSE)","v":"32123"},"5306330","ORCHARD PRAIRIE",0,0,{"$f":"VLOOKUP(B191,'24-25 Adjusted Formula counts'!$A$3:$L$320,8,FALSE)","v":177},{"$f":"ROUND((F191/$F$5*Assumptions!$C$22*Assumptions!$C$30),0)","v":952},{"$f":"VLOOKUP(B191,'24-25 Adjusted Formula counts'!$A$3:$L$320,9,FALSE)","v":22},{"$f":"ROUND((H191/$H$5*Assumptions!$C$22*Assumptions!$C$31),0)","v":4359},null,5311,null,null,5311,0,5311,null,0,5311,null,{"$f":"IFERROR(VLOOKUP($A191, 'Allocation 2023-24 Final'!$A$7:$S$323,19,FALSE),0)","v":2330},null,2981,1.2793991416309012,63,0,null,"5306330","ORCHARD PRAIRIE"]
[{"$f":"VLOOKUP(B192,CCDDD!$A$3:$B$319,2,FALSE)","v":"10065"},"5306360","ORIENT",0,0,{"$f":"VLOOKUP(B192,'24-25 Adjusted Formula counts'!$A$3:$L$320,8,FALSE)","v":128},{"$f":"ROUND((F192/$F$5*Assumptions!$C$22*Assumptions!$C$30),0)","v":688},{"$f":"VLOOKUP(B192,'24-25 Adjusted Formula counts'!$A$3:$L$320,9,FALSE)","v":36},{"$f":"ROUND((H192/$H$5*Assumptions!$C$22*Assumptions!$C$31),0)","v":7132},null,7820,null,null,7820,0,7820,null,0,7820,null,{"$f":"IFERROR(VLOOKUP($A192, 'Allocation 2023-24 Final'!$A$7:$S$323,19,FALSE),0)","v":6722},null,1098,0.16334424278488546,98,0,null,"5306360","ORIENT"]
[{"$f":"VLOOKUP(B193,CCDDD!$A$3:$B$319,2,FALSE)","v":"09013"},"5306390","ORONDO",0,0,{"$f":"VLOOKUP(B193,'24-25 Adjusted Formula counts'!$A$3:$L$320,8,FALSE)","v":261},{"$f":"ROUND((F193/$F$5*Assumptions!$C$22*Assumptions!$C$30),0)","v":1403},{"$f":"VLOOKUP(B193,'24-25 Adjusted Formula counts'!$A$3:$L$320,9,FALSE)","v":34},{"$f":"ROUND((H193/$H$5*Assumptions!$C$22*Assumptions!$C$31),0)","v":6736},null,8139,null,null,8139,0,8139,null,0,8139,null,{"$f":"IFERROR(VLOOKUP($A193, 'Allocation 2023-24 Final'!$A$7:$S$323,19,FALSE),0)","v":11386},null,-3247,-0.28517477604075181,214,0,null,"5306390","ORONDO"]
[{"$f":"VLOOKUP(B194,CCDDD!$A$3:$B$319,2,FALSE)","v":"24410"},"5306420","OROVILLE",0,0,{"$f":"VLOOKUP(B194,'24-25 Adjusted Formula counts'!$A$3:$L$320,8,FALSE)","v":710},{"$f":"ROUND((F194/$F$5*Assumptions!$C$22*Assumptions!$C$30),0)","v":3817},{"$f":"VLOOKUP(B194,'24-25 Adjusted Formula counts'!$A$3:$L$320,9,FALSE)","v":178},{"$f":"ROUND((H194/$H$5*Assumptions!$C$22*Assumptions!$C$31),0)","v":35266},null,39083,null,null,39083,0,39083,null,0,39083,null,{"$f":"IFERROR(VLOOKUP($A194, 'Allocation 2023-24 Final'!$A$7:$S$323,19,FALSE),0)","v":44347},null,-5264,-0.11870025029878008,236,0,null,"5306420","OROVILLE"]
[{"$f":"VLOOKUP(B195,CCDDD!$A$3:$B$319,2,FALSE)","v":"27344"},"5306450","ORTING",0,0,{"$f":"VLOOKUP(B195,'24-25 Adjusted Formula counts'!$A$3:$L$320,8,FALSE)","v":3249},{"$f":"ROUND((F195/$F$5*Assumptions!$C$22*Assumptions!$C$30),0)","v":17468},{"$f":"VLOOKUP(B195,'24-25 Adjusted Formula counts'!$A$3:$L$320,9,FALSE)","v":168},{"$f":"ROUND((H195/$H$5*Assumptions!$C$22*Assumptions!$C$31),0)","v":33285},null,50753,null,null,50753,0,50753,null,0,50753,null,{"$f":"IFERROR(VLOOKUP($A195, 'Allocation 2023-24 Final'!$A$7:$S$323,19,FALSE),0)","v":56303},null,-5550,-9.8573788252846212E-2,239,0,null,"5306450","ORTING"]
[{"$f":"VLOOKUP(B196,CCDDD!$A$3:$B$319,2,FALSE)","v":"01147"},"5306480","OTHELLO",0,0,{"$f":"VLOOKUP(B196,'24-25 Adjusted Formula counts'!$A$3:$L$320,8,FALSE)","v":4618},{"$f":"ROUND((F196/$F$5*Assumptions!$C$22*Assumptions!$C$30),0)","v":24828},{"$f":"VLOOKUP(B196,'24-25 Adjusted Formula counts'!$A$3:$L$320,9,FALSE)","v":735},{"$f":"ROUND((H196/$H$5*Assumptions!$C$22*Assumptions!$C$31),0)","v":145621},null,170449,null,null,170449,0,170449,null,0,170449,null,{"$f":"IFERROR(VLOOKUP($A196, 'Allocation 2023-24 Final'!$A$7:$S$323,19,FALSE),0)","v":197053},null,-26604,-0.13500936296326368,301,0,null,"5306480","OTHELLO"]
[{"$f":"VLOOKUP(B197,CCDDD!$A$3:$B$319,2,FALSE)","v":"09102"},"5306510","PALISADES",0,0,{"$f":"VLOOKUP(B197,'24-25 Adjusted Formula counts'!$A$3:$L$320,8,FALSE)","v":46},{"$f":"ROUND((F197/$F$5*Assumptions!$C$22*Assumptions!$C$30),0)","v":247},{"$f":"VLOOKUP(B197,'24-25 Adjusted Formula counts'!$A$3:$L$320,9,FALSE)","v":10},{"$f":"ROUND((H197/$H$5*Assumptions!$C$22*Assumptions!$C$31),0)","v":1981},null,2228,null,null,2228,0,2228,null,0,2228,null,{"$f":"IFERROR(VLOOKUP($A197, 'Allocation 2023-24 Final'!$A$7:$S$323,19,FALSE),0)","v":2206},null,22,9.9728014505893019E-3,135,0,null,"5306510","PALISADES"]
[{"$f":"VLOOKUP(B198,CCDDD!$A$3:$B$319,2,FALSE)","v":"38301"},"5306540","PALOUSE",0,0,{"$f":"VLOOKUP(B198,'24-25 Adjusted Formula counts'!$A$3:$L$320,8,FALSE)","v":237},{"$f":"ROUND((F198/$F$5*Assumptions!$C$22*Assumptions!$C$30),0)","v":1274},{"$f":"VLOOKUP(B198,'24-25 Adjusted Formula counts'!$A$3:$L$320,9,FALSE)","v":11},{"$f":"ROUND((H198/$H$5*Assumptions!$C$22*Assumptions!$C$31),0)","v":2179},null,3453,null,null,3453,0,3453,null,0,3453,null,{"$f":"IFERROR(VLOOKUP($A198, 'Allocation 2023-24 Final'!$A$7:$S$323,19,FALSE),0)","v":5769},null,-2316,-0.40145605824232972,200,0,null,"5306540","PALOUSE"]
[{"$f":"VLOOKUP(B199,CCDDD!$A$3:$B$319,2,FALSE)","v":"11001"},"5306570","PASCO",0,0,{"$f":"VLOOKUP(B199,'24-25 Adjusted Formula counts'!$A$3:$L$320,8,FALSE)","v":20405},{"$f":"ROUND((F199/$F$5*Assumptions!$C$22*Assumptions!$C$30),0)","v":109706},{"$f":"VLOOKUP(B199,'24-25 Adjusted Formula counts'!$A$3:$L$320,9,FALSE)","v":2379},{"$f":"ROUND((H199/$H$5*Assumptions!$C$22*Assumptions!$C$31),0)","v":471338},null,{"$f":"ROUNDDOWN(+I199+G199+E199+D199+J199,0)","v":581044},null,null,{"$f":"K199","v":581044},{"$f":"-ROUND(N199/$N$5*$M$5,0)","v":0},{"$f":"+K199+O199+M199","v":581044},null,{"$f":"-1*(P199*Q199)","v":0},{"$f":"+P199+R199","v":581044},null,{"$f":"IFERROR(VLOOKUP($A199, 'Allocation 2023-24 Final'!$A$7:$S$323,19,FALSE),0)","v":649393},null,{"$f":"+S199-U199","v":-68349},{"$f":"IF(U199>0,W199/U199,0)","v":-0.10525059555615783},313,{"$f":"(SUM(D199:E199)/S199)","v":0},null,{"$f":"+B199","v":"5306570"},"PASCO"]
[{"$f":"VLOOKUP(B200,CCDDD!$A$3:$B$319,2,FALSE)","v":"24122"},"5306600","PATEROS",0,0,{"$f":"VLOOKUP(B200,'24-25 Adjusted Formula counts'!$A$3:$L$320,8,FALSE)","v":294},{"$f":"ROUND((F200/$F$5*Assumptions!$C$22*Assumptions!$C$30),0)","v":1581},{"$f":"VLOOKUP(B200,'24-25 Adjusted Formula counts'!$A$3:$L$320,9,FALSE)","v":33},{"$f":"ROUND((H200/$H$5*Assumptions!$C$22*Assumptions!$C$31),0)","v":6538},null,8119,null,null,8119,0,8119,null,0,8119,null,{"$f":"IFERROR(VLOOKUP($A200, 'Allocation 2023-24 Final'!$A$7:$S$323,19,FALSE),0)","v":8597},null,-478,-5.5600790973595438E-2,{"$f":"RANK(W200,$W$7:$W$322,0)","v":154},0,null,"5306600","PATEROS"]
[{"$f":"VLOOKUP(B201,CCDDD!$A$3:$B$319,2,FALSE)","v":"03050"},"5306630","PATERSON",0,0,{"$f":"VLOOKUP(B201,'24-25 Adjusted Formula counts'!$A$3:$L$320,8,FALSE)","v":87},{"$f":"ROUND((F201/$F$5*Assumptions!$C$22*Assumptions!$C$30),0)","v":468},{"$f":"VLOOKUP(B201,'24-25 Adjusted Formula counts'!$A$3:$L$320,9,FALSE)","v":7},{"$f":"ROUND((H201/$H$5*Assumptions!$C$22*Assumptions!$C$31),0)","v":1387},null,1855,null,null,1855,0,1855,null,0,1855,null,{"$f":"IFERROR(VLOOKUP($A201, 'Allocation 2023-24 Final'!$A$7:$S$323,19,FALSE),0)","v":2420},null,-565,-0.23347107438016529,158,0,null,"5306630","PATERSON"]
[{"$f":"VLOOKUP(B202,CCDDD!$A$3:$B$319,2,FALSE)","v":"21301"},"5306660","PE ELL",0,0,{"$f":"VLOOKUP(B202,'24-25 Adjusted Formula counts'!$A$3:$L$320,8,FALSE)","v":249},{"$f":"ROUND((F202/$F$5*Assumptions!$C$22*Assumptions!$C$30),0)","v":1339},{"$f":"VLOOKUP(B202,'24-25 Adjusted Formula counts'!$A$3:$L$320,9,FALSE)","v":30},{"$f":"ROUND((H202/$H$5*Assumptions!$C$22*Assumptions!$C$31),0)","v":5944},null,7283,null,null,7283,0,7283,null,0,7283,null,{"$f":"IFERROR(VLOOKUP($A202, 'Allocation 2023-24 Final'!$A$7:$S$323,19,FALSE),0)","v":8540},null,-1257,-0.1471896955503513,182,0,null,"5306660","PE ELL"]
[{"$f":"VLOOKUP(B203,CCDDD!$A$3:$B$319,2,FALSE)","v":"27401"},"5306690","PENINSULA",0,0,{"$f":"VLOOKUP(B203,'24-25 Adjusted Formula counts'!$A$3:$L$320,8,FALSE)","v":11683},{"$f":"ROUND((F203/$F$5*Assumptions!$C$22*Assumptions!$C$30),0)","v":62813},{"$f":"VLOOKUP(B203,'24-25 Adjusted Formula counts'!$A$3:$L$320,9,FALSE)","v":517},{"$f":"ROUND((H203/$H$5*Assumptions!$C$22*Assumptions!$C$31),0)","v":102430},null,165243,null,null,165243,0,165243,null,0,165243,null,{"$f":"IFERROR(VLOOKUP($A203, 'Allocation 2023-24 Final'!$A$7:$S$323,19,FALSE),0)","v":184740},null,-19497,-0.10553751217927898,290,0,null,"5306690","PENINSULA"]
[{"$f":"VLOOKUP(B204,CCDDD!$A$3:$B$319,2,FALSE)","v":"04901"},"5306770","PINNACLE PREP CHARTER",0,0,{"$f":"VLOOKUP(B204,'24-25 Adjusted Formula counts'!$A$3:$L$320,8,FALSE)","v":282.1539611360239},{"$f":"ROUND((F204/$F$5*Assumptions!$C$22*Assumptions!$C$30),0)","v":1517},{"$f":"VLOOKUP(B204,'24-25 Adjusted Formula counts'!$A$3:$L$320,9,FALSE)","v":27.587345254470446},{"$f":"ROUND((H204/$H$5*Assumptions!$C$22*Assumptions!$C$31),0)","v":5466},null,6983,null,null,6983,0,6983,null,0,6983,null,{"$f":"IFERROR(VLOOKUP($A204, 'Allocation 2023-24 Final'!$A$7:$S$323,19,FALSE),0)","v":2467},null,4516,1.8305634373733279,48,0,null,"5306770","PINNACLE PREP CHARTER"]
[{"$f":"VLOOKUP(B205,CCDDD!$A$3:$B$319,2,FALSE)","v":"23402"},"5306750","PIONEER",0,0,{"$f":"VLOOKUP(B205,'24-25 Adjusted Formula counts'!$A$3:$L$320,8,FALSE)","v":1491},{"$f":"ROUND((F205/$F$5*Assumptions!$C$22*Assumptions!$C$30),0)","v":8016},{"$f":"VLOOKUP(B205,'24-25 Adjusted Formula counts'!$A$3:$L$320,9,FALSE)","v":179},{"$f":"ROUND((H205/$H$5*Assumptions!$C$22*Assumptions!$C$31),0)","v":35464},null,43480,null,null,43480,0,43480,null,0,43480,null,{"$f":"IFERROR(VLOOKUP($A205, 'Allocation 2023-24 Final'!$A$7:$S$323,19,FALSE),0)","v":55222},null,-11742,-0.21263264640903987,272,0,null,"5306750","PIONEER"]
[{"$f":"VLOOKUP(B206,CCDDD!$A$3:$B$319,2,FALSE)","v":"12110"},"5306780","POMEROY",0,0,{"$f":"VLOOKUP(B206,'24-25 Adjusted Formula counts'!$A$3:$L$320,8,FALSE)","v":377},{"$f":"ROUND((F206/$F$5*Assumptions!$C$22*Assumptions!$C$30),0)","v":2027},{"$f":"VLOOKUP(B206,'24-25 Adjusted Formula counts'!$A$3:$L$320,9,FALSE)","v":65},{"$f":"ROUND((H206/$H$5*Assumptions!$C$22*Assumptions!$C$31),0)","v":12878},null,14905,null,null,14905,0,14905,null,0,14905,null,{"$f":"IFERROR(VLOOKUP($A206, 'Allocation 2023-24 Final'!$A$7:$S$323,19,FALSE),0)","v":13443},null,1462,0.10875548612660864,91,0,null,"5306780","POMEROY"]
[{"$f":"VLOOKUP(B207,CCDDD!$A$3:$B$319,2,FALSE)","v":"05121"},"5306820","PORT ANGELES",0,0,{"$f":"VLOOKUP(B207,'24-25 Adjusted Formula counts'!$A$3:$L$320,8,FALSE)","v":4288},{"$f":"ROUND((F207/$F$5*Assumptions!$C$22*Assumptions!$C$30),0)","v":23054},{"$f":"VLOOKUP(B207,'24-25 Adjusted Formula counts'!$A$3:$L$320,9,FALSE)","v":566},{"$f":"ROUND((H207/$H$5*Assumptions!$C$22*Assumptions!$C$31),0)","v":112138},null,135192,null,null,135192,0,135192,null,0,135192,null,{"$f":"IFERROR(VLOOKUP($A207, 'Allocation 2023-24 Final'!$A$7:$S$323,19,FALSE),0)","v":151055},null,-15863,-0.10501472973420277,283,0,null,"5306820","PORT ANGELES"]
[{"$f":"VLOOKUP(B208,CCDDD!$A$3:$B$319,2,FALSE)","v":"16050"},"5306840","PORT TOWNSEND",0,0,{"$f":"VLOOKUP(B208,'24-25 Adjusted Formula counts'!$A$3:$L$320,8,FALSE)","v":1344},{"$f":"ROUND((F208/$F$5*Assumptions!$C$22*Assumptions!$C$30),0)","v":7226},{"$f":"VLOOKUP(B208,'24-25 Adjusted Formula counts'!$A$3:$L$320,9,FALSE)","v":178},{"$f":"ROUND((H208/$H$5*Assumptions!$C$22*Assumptions!$C$31),0)","v":35266},null,42492,null,null,42492,0,42492,null,0,42492,null,{"$f":"IFERROR(VLOOKUP($A208, 'Allocation 2023-24 Final'!$A$7:$S$323,19,FALSE),0)","v":58241},null,-15749,-0.27041087893408422,282,0,null,"5306840","PORT TOWNSEND"]
[{"$f":"VLOOKUP(B209,CCDDD!$A$3:$B$319,2,FALSE)","v":"36402"},"5306870","PRESCOTT",0,0,{"$f":"VLOOKUP(B209,'24-25 Adjusted Formula counts'!$A$3:$L$320,8,FALSE)","v":345},{"$f":"ROUND((F209/$F$5*Assumptions!$C$22*Assumptions!$C$30),0)","v":1855},{"$f":"VLOOKUP(B209,'24-25 Adjusted Formula counts'!$A$3:$L$320,9,FALSE)","v":46},{"$f":"ROUND((H209/$H$5*Assumptions!$C$22*Assumptions!$C$31),0)","v":9114},null,10969,null,null,10969,0,10969,null,0,10969,null,{"$f":"IFERROR(VLOOKUP($A209, 'Allocation 2023-24 Final'!$A$7:$S$323,19,FALSE),0)","v":10879},null,90,8.2728191929405271E-3,129,0,null,"5306870","PRESCOTT"]
[{"$f":"VLOOKUP(B210,CCDDD!$A$3:$B$319,2,FALSE)","v":"32907"},"5306890","PRIDE PREP CHARTER",0,0,{"$f":"VLOOKUP(B210,'24-25 Adjusted Formula counts'!$A$3:$L$320,8,FALSE)","v":517.33456136311304},{"$f":"ROUND((F210/$F$5*Assumptions!$C$22*Assumptions!$C$30),0)","v":2781},{"$f":"VLOOKUP(B210,'24-25 Adjusted Formula counts'!$A$3:$L$320,9,FALSE)","v":63.82162072216979},{"$f":"ROUND((H210/$H$5*Assumptions!$C$22*Assumptions!$C$31),0)","v":12645},null,15426,null,null,15426,0,15426,null,0,15426,null,{"$f":"IFERROR(VLOOKUP($A210, 'Allocation 2023-24 Final'!$A$7:$S$323,19,FALSE),0)","v":18549},null,-3123,-0.16836487142163997,212,0,null,"5306890","PRIDE PREP CHARTER"]
[{"$f":"VLOOKUP(B211,CCDDD!$A$3:$B$319,2,FALSE)","v":"03116"},"5306900","PROSSER",0,0,{"$f":"VLOOKUP(B211,'24-25 Adjusted Formula counts'!$A$3:$L$320,8,FALSE)","v":2901},{"$f":"ROUND((F211/$F$5*Assumptions!$C$22*Assumptions!$C$30),0)","v":15597},{"$f":"VLOOKUP(B211,'24-25 Adjusted Formula counts'!$A$3:$L$320,9,FALSE)","v":331},{"$f":"ROUND((H211/$H$5*Assumptions!$C$22*Assumptions!$C$31),0)","v":65579},null,81176,null,null,81176,0,81176,null,0,81176,null,{"$f":"IFERROR(VLOOKUP($A211, 'Allocation 2023-24 Final'!$A$7:$S$323,19,FALSE),0)","v":85352},null,-4176,-4.8926797263098697E-2,228,0,null,"5306900","PROSSER"]
[{"$f":"VLOOKUP(B212,CCDDD!$A$3:$B$319,2,FALSE)","v":"38901"},"5306940","PULLMAN MONTESSORI CHARTER",0,0,{"$f":"VLOOKUP(B212,'24-25 Adjusted Formula counts'!$A$3:$L$320,8,FALSE)","v":160.25468694729383},{"$f":"ROUND((F212/$F$5*Assumptions!$C$22*Assumptions!$C$30),0)","v":862},{"$f":"VLOOKUP(B212,'24-25 Adjusted Formula counts'!$A$3:$L$320,9,FALSE)","v":17.964356435643548},{"$f":"ROUND((H212/$H$5*Assumptions!$C$22*Assumptions!$C$31),0)","v":3559},null,4421,null,null,4421,0,4421,null,0,4421,null,{"$f":"IFERROR(VLOOKUP($A212, 'Allocation 2023-24 Final'!$A$7:$S$323,19,FALSE),0)","v":2033},null,2388,1.1746187899655682,71,0,null,"5306940","PULLMAN MONTESSORI CHARTER"]
[{"$f":"VLOOKUP(B213,CCDDD!$A$3:$B$319,2,FALSE)","v":"38267"},"5306930","PULLMAN",0,0,{"$f":"VLOOKUP(B213,'24-25 Adjusted Formula counts'!$A$3:$L$320,8,FALSE)","v":3075.7453130527056},{"$f":"ROUND((F213/$F$5*Assumptions!$C$22*Assumptions!$C$30),0)","v":16536},{"$f":"VLOOKUP(B213,'24-25 Adjusted Formula counts'!$A$3:$L$320,9,FALSE)","v":306.03564356435623},{"$f":"ROUND((H213/$H$5*Assumptions!$C$22*Assumptions!$C$31),0)","v":60633},null,77169,null,null,77169,0,77169,null,0,77169,null,{"$f":"IFERROR(VLOOKUP($A213, 'Allocation 2023-24 Final'!$A$7:$S$323,19,FALSE),0)","v":84697},null,-7528,-8.8881542439519706E-2,252,0,null,"5306930","PULLMAN"]
[{"$f":"VLOOKUP(B214,CCDDD!$A$3:$B$319,2,FALSE)","v":"27003"},"5306960","PUYALLUP",0,0,{"$f":"VLOOKUP(B214,'24-25 Adjusted Formula counts'!$A$3:$L$320,8,FALSE)","v":25544},{"$f":"ROUND((F214/$F$5*Assumptions!$C$22*Assumptions!$C$30),0)","v":137335},{"$f":"VLOOKUP(B214,'24-25 Adjusted Formula counts'!$A$3:$L$320,9,FALSE)","v":1798},{"$f":"ROUND((H214/$H$5*Assumptions!$C$22*Assumptions!$C$31),0)","v":356228},null,493563,null,null,493563,0,493563,null,0,493563,null,{"$f":"IFERROR(VLOOKUP($A214, 'Allocation 2023-24 Final'!$A$7:$S$323,19,FALSE),0)","v":498300},null,-4737,-9.5063214930764597E-3,233,0,null,"5306960","PUYALLUP"]
[{"$f":"VLOOKUP(B215,CCDDD!$A$3:$B$319,2,FALSE)","v":"16020"},"5301380","QUEETS-CLEARWATER",0,0,{"$f":"VLOOKUP(B215,'24-25 Adjusted Formula counts'!$A$3:$L$320,8,FALSE)","v":32},{"$f":"ROUND((F215/$F$5*Assumptions!$C$22*Assumptions!$C$30),0)","v":172},{"$f":"VLOOKUP(B215,'24-25 Adjusted Formula counts'!$A$3:$L$320,9,FALSE)","v":11},{"$f":"ROUND((H215/$H$5*Assumptions!$C$22*Assumptions!$C$31),0)","v":2179},null,2351,null,null,2351,0,2351,null,0,2351,null,{"$f":"IFERROR(VLOOKUP($A215, 'Allocation 2023-24 Final'!$A$7:$S$323,19,FALSE),0)","v":1931},null,420,0.21750388399792853,114,0,null,"5301380","QUEETS-CLEARWATER"]
[{"$f":"VLOOKUP(B216,CCDDD!$A$3:$B$319,2,FALSE)","v":"16048"},"5306990","QUILCENE",0,0,{"$f":"VLOOKUP(B216,'24-25 Adjusted Formula counts'!$A$3:$L$320,8,FALSE)","v":199},{"$f":"ROUND((F216/$F$5*Assumptions!$C$22*Assumptions!$C$30),0)","v":1070},{"$f":"VLOOKUP(B216,'24-25 Adjusted Formula counts'!$A$3:$L$320,9,FALSE)","v":29},{"$f":"ROUND((H216/$H$5*Assumptions!$C$22*Assumptions!$C$31),0)","v":5746},null,6816,null,null,6816,0,6816,null,{"$f":"-1*(P216*Q216)","v":0},6816,null,{"$f":"IFERROR(VLOOKUP($A216, 'Allocation 2023-24 Final'!$A$7:$S$323,19,FALSE),0)","v":5867.49},null,948.51000000000022,0.16165515407780845,101,0,null,"5306990","QUILCENE"]
[{"$f":"VLOOKUP(B217,CCDDD!$A$3:$B$319,2,FALSE)","v":"05402"},"5307020","QUILLAYUTE VALLEY",0,0,{"$f":"VLOOKUP(B217,'24-25 Adjusted Formula counts'!$A$3:$L$320,8,FALSE)","v":1172},{"$f":"ROUND((F217/$F$5*Assumptions!$C$22*Assumptions!$C$30),0)","v":6301},{"$f":"VLOOKUP(B217,'24-25 Adjusted Formula counts'!$A$3:$L$320,9,FALSE)","v":264},{"$f":"ROUND((H217/$H$5*Assumptions!$C$22*Assumptions!$C$31),0)","v":52305},null,58606,null,null,58606,0,58606,null,{"$f":"-1*(P217*Q217)","v":0},58606,null,{"$f":"IFERROR(VLOOKUP($A217, 'Allocation 2023-24 Final'!$A$7:$S$323,19,FALSE),0)","v":59505},null,-899,-1.5107974119821864E-2,170,0,null,"5307020","QUILLAYUTE VALLEY"]
[{"$f":"VLOOKUP(B218,CCDDD!$A$3:$B$319,2,FALSE)","v":"13144"},"5307080","QUINCY",0,0,{"$f":"VLOOKUP(B218,'24-25 Adjusted Formula counts'!$A$3:$L$320,8,FALSE)","v":3136},{"$f":"ROUND((F218/$F$5*Assumptions!$C$22*Assumptions!$C$30),0)","v":16860},{"$f":"VLOOKUP(B218,'24-25 Adjusted Formula counts'!$A$3:$L$320,9,FALSE)","v":461},{"$f":"ROUND((H218/$H$5*Assumptions!$C$22*Assumptions!$C$31),0)","v":91335},null,108195,null,null,108195,0,108195,null,0,108195,null,{"$f":"IFERROR(VLOOKUP($A218, 'Allocation 2023-24 Final'!$A$7:$S$323,19,FALSE),0)","v":100119},null,8076,8.0664009828304323E-2,36,0,null,"5307080","QUINCY"]
[{"$f":"VLOOKUP(B219,CCDDD!$A$3:$B$319,2,FALSE)","v":"17908"},"5307120","RAINIER PREP CHARTER",0,0,{"$f":"VLOOKUP(B219,'24-25 Adjusted Formula counts'!$A$3:$L$320,8,FALSE)","v":370.59201638799743},{"$f":"ROUND((F219/$F$5*Assumptions!$C$22*Assumptions!$C$30),0)","v":1992},{"$f":"VLOOKUP(B219,'24-25 Adjusted Formula counts'!$A$3:$L$320,9,FALSE)","v":57.27235918661134},{"$f":"ROUND((H219/$H$5*Assumptions!$C$22*Assumptions!$C$31),0)","v":11347},null,13339,null,null,13339,0,13339,null,0,13339,null,{"$f":"IFERROR(VLOOKUP($A219, 'Allocation 2023-24 Final'!$A$7:$S$323,19,FALSE),0)","v":12937},null,402,3.1073664682693052E-2,115,0,null,"5307120","RAINIER PREP CHARTER"]
[{"$f":"VLOOKUP(B220,CCDDD!$A$3:$B$319,2,FALSE)","v":"34307"},"5307110","RAINIER",0,0,{"$f":"VLOOKUP(B220,'24-25 Adjusted Formula counts'!$A$3:$L$320,8,FALSE)","v":1025},{"$f":"ROUND((F220/$F$5*Assumptions!$C$22*Assumptions!$C$30),0)","v":5511},{"$f":"VLOOKUP(B220,'24-25 Adjusted Formula counts'!$A$3:$L$320,9,FALSE)","v":103},{"$f":"ROUND((H220/$H$5*Assumptions!$C$22*Assumptions!$C$31),0)","v":20407},null,25918,null,null,25918,0,25918,null,0,25918,null,{"$f":"IFERROR(VLOOKUP($A220, 'Allocation 2023-24 Final'!$A$7:$S$323,19,FALSE),0)","v":35802},null,-9884,-0.27607396234847215,267,0,null,"5307110","RAINIER"]
[{"$f":"VLOOKUP(B221,CCDDD!$A$3:$B$319,2,FALSE)","v":"25116"},"5307140","RAYMOND",0,0,{"$f":"VLOOKUP(B221,'24-25 Adjusted Formula counts'!$A$3:$L$320,8,FALSE)","v":629},{"$f":"ROUND((F221/$F$5*Assumptions!$C$22*Assumptions!$C$30),0)","v":3382},{"$f":"VLOOKUP(B221,'24-25 Adjusted Formula counts'!$A$3:$L$320,9,FALSE)","v":106},{"$f":"ROUND((H221/$H$5*Assumptions!$C$22*Assumptions!$C$31),0)","v":21001},null,24383,null,null,24383,0,24383,null,0,24383,null,{"$f":"IFERROR(VLOOKUP($A221, 'Allocation 2023-24 Final'!$A$7:$S$323,19,FALSE),0)","v":23508},null,875,3.7221371448017695E-2,103,0,null,"5307140","RAYMOND"]
[{"$f":"VLOOKUP(B222,CCDDD!$A$3:$B$319,2,FALSE)","v":"22009"},"5307210","REARDAN-EDWALL",0,0,{"$f":"VLOOKUP(B222,'24-25 Adjusted Formula counts'!$A$3:$L$320,8,FALSE)","v":994},{"$f":"ROUND((F222/$F$5*Assumptions!$C$22*Assumptions!$C$30),0)","v":5344},{"$f":"VLOOKUP(B222,'24-25 Adjusted Formula counts'!$A$3:$L$320,9,FALSE)","v":124},{"$f":"ROUND((H222/$H$5*Assumptions!$C$22*Assumptions!$C$31),0)","v":24567},null,29911,null,null,29911,0,29911,null,0,29911,null,{"$f":"IFERROR(VLOOKUP($A222, 'Allocation 2023-24 Final'!$A$7:$S$323,19,FALSE),0)","v":27724},null,2187,7.8884720819506565E-2,74,0,null,"5307210","REARDAN-EDWALL"]
[{"$f":"VLOOKUP(B223,CCDDD!$A$3:$B$319,2,FALSE)","v":"17403"},"5307230","RENTON",0,0,{"$f":"VLOOKUP(B223,'24-25 Adjusted Formula counts'!$A$3:$L$320,8,FALSE)","v":17415.483093404746},{"$f":"ROUND((F223/$F$5*Assumptions!$C$22*Assumptions!$C$30),0)","v":93633},{"$f":"VLOOKUP(B223,'24-25 Adjusted Formula counts'!$A$3:$L$320,9,FALSE)","v":2218.6794144009573},{"$f":"ROUND((H223/$H$5*Assumptions!$C$22*Assumptions!$C$31),0)","v":439574},null,533207,null,null,533207,0,533207,null,0,533207,null,{"$f":"IFERROR(VLOOKUP($A223, 'Allocation 2023-24 Final'!$A$7:$S$323,19,FALSE),0)","v":558106},null,-24899,-4.4613388854447003E-2,296,0,null,"5307230","RENTON"]
[{"$f":"VLOOKUP(B224,CCDDD!$A$3:$B$319,2,FALSE)","v":"10309"},"5307260","REPUBLIC",0,0,{"$f":"VLOOKUP(B224,'24-25 Adjusted Formula counts'!$A$3:$L$320,8,FALSE)","v":359},{"$f":"ROUND((F224/$F$5*Assumptions!$C$22*Assumptions!$C$30),0)","v":1930},{"$f":"VLOOKUP(B224,'24-25 Adjusted Formula counts'!$A$3:$L$320,9,FALSE)","v":89},{"$f":"ROUND((H224/$H$5*Assumptions!$C$22*Assumptions!$C$31),0)","v":17633},null,19563,null,null,19563,0,19563,null,0,19563,null,{"$f":"IFERROR(VLOOKUP($A224, 'Allocation 2023-24 Final'!$A$7:$S$323,19,FALSE),0)","v":18423},null,1140,6.187917277316398E-2,97,0,null,"5307260","REPUBLIC"]
[{"$f":"VLOOKUP(B225,CCDDD!$A$3:$B$319,2,FALSE)","v":"03400"},"5307320","RICHLAND",0,0,{"$f":"VLOOKUP(B225,'24-25 Adjusted Formula counts'!$A$3:$L$320,8,FALSE)","v":15487},{"$f":"ROUND((F225/$F$5*Assumptions!$C$22*Assumptions!$C$30),0)","v":83265},{"$f":"VLOOKUP(B225,'24-25 Adjusted Formula counts'!$A$3:$L$320,9,FALSE)","v":1312},{"$f":"ROUND((H225/$H$5*Assumptions!$C$22*Assumptions!$C$31),0)","v":259939},null,343204,null,null,343204,0,343204,null,0,343204,null,{"$f":"IFERROR(VLOOKUP($A225, 'Allocation 2023-24 Final'!$A$7:$S$323,19,FALSE),0)","v":372817},null,-29613,-7.9430390781536256E-2,303,0,null,"5307320","RICHLAND"]
[{"$f":"VLOOKUP(B226,CCDDD!$A$3:$B$319,2,FALSE)","v":"06122"},"5307350","RIDGEFIELD",0,0,{"$f":"VLOOKUP(B226,'24-25 Adjusted Formula counts'!$A$3:$L$320,8,FALSE)","v":4134},{"$f":"ROUND((F226/$F$5*Assumptions!$C$22*Assumptions!$C$30),0)","v":22226},{"$f":"VLOOKUP(B226,'24-25 Adjusted Formula counts'!$A$3:$L$320,9,FALSE)","v":160},{"$f":"ROUND((H226/$H$5*Assumptions!$C$22*Assumptions!$C$31),0)","v":31700},null,53926,null,null,53926,0,53926,null,0,53926,null,{"$f":"IFERROR(VLOOKUP($A226, 'Allocation 2023-24 Final'!$A$7:$S$323,19,FALSE),0)","v":70803},null,-16877,-0.23836560597714787,286,0,null,"5307350","RIDGEFIELD"]
[{"$f":"VLOOKUP(B227,CCDDD!$A$3:$B$319,2,FALSE)","v":"01160"},"5307380","RITZVILLE",0,0,{"$f":"VLOOKUP(B227,'24-25 Adjusted Formula counts'!$A$3:$L$320,8,FALSE)","v":421},{"$f":"ROUND((F227/$F$5*Assumptions!$C$22*Assumptions!$C$30),0)","v":2263},{"$f":"VLOOKUP(B227,'24-25 Adjusted Formula counts'!$A$3:$L$320,9,FALSE)","v":58},{"$f":"ROUND((H227/$H$5*Assumptions!$C$22*Assumptions!$C$31),0)","v":11491},null,13754,null,null,13754,0,13754,null,0,13754,null,{"$f":"IFERROR(VLOOKUP($A227, 'Allocation 2023-24 Final'!$A$7:$S$323,19,FALSE),0)","v":12997},null,757,5.8244210202354388E-2,108,0,null,"5307380","RITZVILLE"]
[{"$f":"VLOOKUP(B228,CCDDD!$A$3:$B$319,2,FALSE)","v":"32416"},"5307440","RIVERSIDE",0,0,{"$f":"VLOOKUP(B228,'24-25 Adjusted Formula counts'!$A$3:$L$320,8,FALSE)","v":2040},{"$f":"ROUND((F228/$F$5*Assumptions!$C$22*Assumptions!$C$30),0)","v":10968},{"$f":"VLOOKUP(B228,'24-25 Adjusted Formula counts'!$A$3:$L$320,9,FALSE)","v":247},{"$f":"ROUND((H228/$H$5*Assumptions!$C$22*Assumptions!$C$31),0)","v":48937},null,59905,null,null,59905,0,59905,null,0,59905,null,{"$f":"IFERROR(VLOOKUP($A228, 'Allocation 2023-24 Final'!$A$7:$S$323,19,FALSE),0)","v":59595},null,310,5.2017786727074416E-3,117,0,null,"5307440","RIVERSIDE"]
[{"$f":"VLOOKUP(B229,CCDDD!$A$3:$B$319,2,FALSE)","v":"17407"},"5304560","RIVERVIEW",0,0,{"$f":"VLOOKUP(B229,'24-25 Adjusted Formula counts'!$A$3:$L$320,8,FALSE)","v":3807},{"$f":"ROUND((F229/$F$5*Assumptions!$C$22*Assumptions!$C$30),0)","v":20468},{"$f":"VLOOKUP(B229,'24-25 Adjusted Formula counts'!$A$3:$L$320,9,FALSE)","v":130},{"$f":"ROUND((H229/$H$5*Assumptions!$C$22*Assumptions!$C$31),0)","v":25756},null,46224,null,null,46224,0,46224,null,0,46224,null,{"$f":"IFERROR(VLOOKUP($A229, 'Allocation 2023-24 Final'!$A$7:$S$323,19,FALSE),0)","v":61043},null,-14819,-0.24276329800304702,280,0,null,"5304560","RIVERVIEW"]
[{"$f":"VLOOKUP(B230,CCDDD!$A$3:$B$319,2,FALSE)","v":"34401"},"5307470","ROCHESTER",0,0,{"$f":"VLOOKUP(B230,'24-25 Adjusted Formula counts'!$A$3:$L$320,8,FALSE)","v":2477},{"$f":"ROUND((F230/$F$5*Assumptions!$C$22*Assumptions!$C$30),0)","v":13317},{"$f":"VLOOKUP(B230,'24-25 Adjusted Formula counts'!$A$3:$L$320,9,FALSE)","v":244},{"$f":"ROUND((H230/$H$5*Assumptions!$C$22*Assumptions!$C$31),0)","v":48342},null,61659,null,null,61659,0,61659,null,0,61659,null,{"$f":"IFERROR(VLOOKUP($A230, 'Allocation 2023-24 Final'!$A$7:$S$323,19,FALSE),0)","v":81532},null,-19873,-0.24374478732276897,292,0,null,"5307470","ROCHESTER"]
[{"$f":"VLOOKUP(B231,CCDDD!$A$3:$B$319,2,FALSE)","v":"20403"},"5307530","ROOSEVELT",0,0,{"$f":"VLOOKUP(B231,'24-25 Adjusted Formula counts'!$A$3:$L$320,8,FALSE)","v":42},{"$f":"ROUND((F231/$F$5*Assumptions!$C$22*Assumptions!$C$30),0)","v":226},{"$f":"VLOOKUP(B231,'24-25 Adjusted Formula counts'!$A$3:$L$320,9,FALSE)","v":5},{"$f":"ROUND((H231/$H$5*Assumptions!$C$22*Assumptions!$C$31),0)","v":991},null,1217,null,null,1217,0,1217,null,0,1217,null,{"$f":"IFERROR(VLOOKUP($A231, 'Allocation 2023-24 Final'!$A$7:$S$323,19,FALSE),0)","v":2179},null,-962,-0.44148692060578248,175,0,null,"5307530","ROOSEVELT"]
[{"$f":"VLOOKUP(B232,CCDDD!$A$3:$B$319,2,FALSE)","v":"38320"},"5307560","ROSALIA",0,0,{"$f":"VLOOKUP(B232,'24-25 Adjusted Formula counts'!$A$3:$L$320,8,FALSE)","v":237},{"$f":"ROUND((F232/$F$5*Assumptions!$C$22*Assumptions!$C$30),0)","v":1274},{"$f":"VLOOKUP(B232,'24-25 Adjusted Formula counts'!$A$3:$L$320,9,FALSE)","v":33},{"$f":"ROUND((H232/$H$5*Assumptions!$C$22*Assumptions!$C$31),0)","v":6538},null,7812,null,null,7812,0,7812,null,0,7812,null,{"$f":"IFERROR(VLOOKUP($A232, 'Allocation 2023-24 Final'!$A$7:$S$323,19,FALSE),0)","v":8692},null,-880,-0.10124252185918085,168,0,null,"5307560","ROSALIA"]
[{"$f":"VLOOKUP(B233,CCDDD!$A$3:$B$319,2,FALSE)","v":"13160"},"5307620","ROYAL",0,0,{"$f":"VLOOKUP(B233,'24-25 Adjusted Formula counts'!$A$3:$L$320,8,FALSE)","v":1645},{"$f":"ROUND((F233/$F$5*Assumptions!$C$22*Assumptions!$C$30),0)","v":8844},{"$f":"VLOOKUP(B233,'24-25 Adjusted Formula counts'!$A$3:$L$320,9,FALSE)","v":261},{"$f":"ROUND((H233/$H$5*Assumptions!$C$22*Assumptions!$C$31),0)","v":51710},null,60554,null,null,60554,0,60554,null,0,60554,null,{"$f":"IFERROR(VLOOKUP($A233, 'Allocation 2023-24 Final'!$A$7:$S$323,19,FALSE),0)","v":49699},null,10855,0.21841485744179964,29,0,null,"5307620","ROYAL"]
[{"$f":"VLOOKUP(B234,CCDDD!$A$3:$B$319,2,FALSE)","v":"28149"},"5307650","SAN JUAN ISLAND",0,0,{"$f":"VLOOKUP(B234,'24-25 Adjusted Formula counts'!$A$3:$L$320,8,FALSE)","v":890},{"$f":"ROUND((F234/$F$5*Assumptions!$C$22*Assumptions!$C$30),0)","v":4785},{"$f":"VLOOKUP(B234,'24-25 Adjusted Formula counts'!$A$3:$L$320,9,FALSE)","v":79},{"$f":"ROUND((H234/$H$5*Assumptions!$C$22*Assumptions!$C$31),0)","v":15652},null,20437,null,null,20437,0,20437,null,0,20437,null,{"$f":"IFERROR(VLOOKUP($A234, 'Allocation 2023-24 Final'!$A$7:$S$323,19,FALSE),0)","v":28204},null,-7767,-0.2753864700042547,254,0,null,"5307650","SAN JUAN ISLAND"]
[{"$f":"VLOOKUP(B235,CCDDD!$A$3:$B$319,2,FALSE)","v":"14104"},"5307680","SATSOP",0,0,{"$f":"VLOOKUP(B235,'24-25 Adjusted Formula counts'!$A$3:$L$320,8,FALSE)","v":110},{"$f":"ROUND((F235/$F$5*Assumptions!$C$22*Assumptions!$C$30),0)","v":591},{"$f":"VLOOKUP(B235,'24-25 Adjusted Formula counts'!$A$3:$L$320,9,FALSE)","v":18},{"$f":"ROUND((H235/$H$5*Assumptions!$C$22*Assumptions!$C$31),0)","v":3566},null,4157,null,null,4157,0,4157,null,0,4157,null,{"$f":"IFERROR(VLOOKUP($A235, 'Allocation 2023-24 Final'!$A$7:$S$323,19,FALSE),0)","v":4887},null,-730,-0.14937589523224881,162,0,null,"5307680","SATSOP"]
[{"$f":"VLOOKUP(B236,CCDDD!$A$3:$B$319,2,FALSE)","v":"34975"},"5307700","SCHOOL FOR THE DEAF",0,0,{"$f":"VLOOKUP(B236,'24-25 Adjusted Formula counts'!$A$3:$L$320,8,FALSE)","v":135.31300189479373},{"$f":"ROUND((F236/$F$5*Assumptions!$C$22*Assumptions!$C$30),0)","v":727},{"$f":"VLOOKUP(B236,'24-25 Adjusted Formula counts'!$A$3:$L$320,9,FALSE)","v":21.904635055940339},{"$f":"ROUND((H236/$H$5*Assumptions!$C$22*Assumptions!$C$31),0)","v":4340},null,{"$f":"ROUNDDOWN(+I236+G236+E236+D236+J236,0)","v":5067},null,null,5067,0,5067,null,0,5067,null,{"$f":"IFERROR(VLOOKUP($A236, 'Allocation 2023-24 Final'!$A$7:$S$323,19,FALSE),0)","v":4487},null,580,0.12926231334967683,112,0,null,"5307700","SCHOOL FOR THE DEAF"]
[{"$f":"VLOOKUP(B237,CCDDD!$A$3:$B$319,2,FALSE)","v":"34974"},"5307690","SCHOOL OF THE BLIND",0,0,{"$f":"VLOOKUP(B237,'24-25 Adjusted Formula counts'!$A$3:$L$320,8,FALSE)","v":60.387620680321298},{"$f":"ROUND((F237/$F$5*Assumptions!$C$22*Assumptions!$C$30),0)","v":325},{"$f":"VLOOKUP(B237,'24-25 Adjusted Formula counts'!$A$3:$L$320,9,FALSE)","v":3.7968034096963308},{"$f":"ROUND((H237/$H$5*Assumptions!$C$22*Assumptions!$C$31),0)","v":752},null,{"$f":"ROUNDDOWN(+I237+G237+E237+D237+J237,0)","v":1077},null,null,1077,0,1077,null,0,1077,null,{"$f":"IFERROR(VLOOKUP($A237, 'Allocation 2023-24 Final'!$A$7:$S$323,19,FALSE),0)","v":1228},null,-151,-0.12296416938110749,143,0,null,"5307690","SCHOOL OF THE BLIND"]
[{"$f":"VLOOKUP(B238,CCDDD!$A$3:$B$319,2,FALSE)","v":"17001"},"5307710","SEATTLE",0,0,{"$f":"VLOOKUP(B238,'24-25 Adjusted Formula counts'!$A$3:$L$320,8,FALSE)","v":67992.208335769014},{"$f":"ROUND((F238/$F$5*Assumptions!$C$22*Assumptions!$C$30),0)","v":365554},{"$f":"VLOOKUP(B238,'24-25 Adjusted Formula counts'!$A$3:$L$320,9,FALSE)","v":5686.2577011690419},{"$f":"ROUND((H238/$H$5*Assumptions!$C$22*Assumptions!$C$31),0)","v":1126586},null,{"$f":"ROUNDDOWN(+I238+G238+E238+D238+J238,0)+10","v":1492150},null,null,1492150,0,1492150,null,0,1492150,null,{"$f":"IFERROR(VLOOKUP($A238, 'Allocation 2023-24 Final'!$A$7:$S$323,19,FALSE),0)","v":1702867},null,-210717,-0.12374248840338088,316,0,null,"5307710","SEATTLE"]
[{"$f":"VLOOKUP(B239,CCDDD!$A$3:$B$319,2,FALSE)","v":"29101"},"5307740","SEDRO-WOOLLEY",0,0,{"$f":"VLOOKUP(B239,'24-25 Adjusted Formula counts'!$A$3:$L$320,8,FALSE)","v":5146},{"$f":"ROUND((F239/$F$5*Assumptions!$C$22*Assumptions!$C$30),0)","v":27667},{"$f":"VLOOKUP(B239,'24-25 Adjusted Formula counts'!$A$3:$L$320,9,FALSE)","v":607},{"$f":"ROUND((H239/$H$5*Assumptions!$C$22*Assumptions!$C$31),0)","v":120261},null,147928,null,null,147928,0,147928,null,0,147928,null,{"$f":"IFERROR(VLOOKUP($A239, 'Allocation 2023-24 Final'!$A$7:$S$323,19,FALSE),0)","v":152101},null,-4173,-2.7435717056429609E-2,227,0,null,"5307740","SEDRO-WOOLLEY"]
[{"$f":"VLOOKUP(B240,CCDDD!$A$3:$B$319,2,FALSE)","v":"39119"},"5307770","SELAH",0,0,{"$f":"VLOOKUP(B240,'24-25 Adjusted Formula counts'!$A$3:$L$320,8,FALSE)","v":4177},{"$f":"ROUND((F240/$F$5*Assumptions!$C$22*Assumptions!$C$30),0)","v":22457},{"$f":"VLOOKUP(B240,'24-25 Adjusted Formula counts'!$A$3:$L$320,9,FALSE)","v":459},{"$f":"ROUND((H240/$H$5*Assumptions!$C$22*Assumptions!$C$31),0)","v":90939},null,113396,null,null,113396,0,113396,null,0,113396,null,{"$f":"IFERROR(VLOOKUP($A240, 'Allocation 2023-24 Final'!$A$7:$S$323,19,FALSE),0)","v":109888},null,3508,3.1923412929528244E-2,56,0,null,"5307770","SELAH"]
[{"$f":"VLOOKUP(B241,CCDDD!$A$3:$B$319,2,FALSE)","v":"26070"},"5307800","SELKIRK",0,0,{"$f":"VLOOKUP(B241,'24-25 Adjusted Formula counts'!$A$3:$L$320,8,FALSE)","v":312},{"$f":"ROUND((F241/$F$5*Assumptions!$C$22*Assumptions!$C$30),0)","v":1677},{"$f":"VLOOKUP(B241,'24-25 Adjusted Formula counts'!$A$3:$L$320,9,FALSE)","v":86},{"$f":"ROUND((H241/$H$5*Assumptions!$C$22*Assumptions!$C$31),0)","v":17039},null,18716,null,null,18716,0,18716,null,0,18716,null,{"$f":"IFERROR(VLOOKUP($A241, 'Allocation 2023-24 Final'!$A$7:$S$323,19,FALSE),0)","v":16802},null,1914,0.11391501011784311,80,0,null,"5307800","SELKIRK"]
[{"$f":"VLOOKUP(B242,CCDDD!$A$3:$B$319,2,FALSE)","v":"05323"},"5307830","SEQUIM",0,0,{"$f":"VLOOKUP(B242,'24-25 Adjusted Formula counts'!$A$3:$L$320,8,FALSE)","v":3152},{"$f":"ROUND((F242/$F$5*Assumptions!$C$22*Assumptions!$C$30),0)","v":16946},{"$f":"VLOOKUP(B242,'24-25 Adjusted Formula counts'!$A$3:$L$320,9,FALSE)","v":420},{"$f":"ROUND((H242/$H$5*Assumptions!$C$22*Assumptions!$C$31),0)","v":83212},null,100158,null,null,100158,0,100158,null,0,100158,null,{"$f":"IFERROR(VLOOKUP($A242, 'Allocation 2023-24 Final'!$A$7:$S$323,19,FALSE),0)","v":114149},null,-13991,-0.12256787181666068,277,0,null,"5307830","SEQUIM"]
[{"$f":"VLOOKUP(B243,CCDDD!$A$3:$B$319,2,FALSE)","v":"28010"},"5307860","SHAW ISLAND",0,0,{"$f":"VLOOKUP(B243,'24-25 Adjusted Formula counts'!$A$3:$L$320,8,FALSE)","v":22},{"$f":"ROUND((F243/$F$5*Assumptions!$C$22*Assumptions!$C$30),0)","v":118},{"$f":"VLOOKUP(B243,'24-25 Adjusted Formula counts'!$A$3:$L$320,9,FALSE)","v":1},{"$f":"ROUND((H243/$H$5*Assumptions!$C$22*Assumptions!$C$31),0)","v":198},null,316,null,null,316,0,316,null,0,316,null,{"$f":"IFERROR(VLOOKUP($A243, 'Allocation 2023-24 Final'!$A$7:$S$323,19,FALSE),0)","v":708},null,-392,-0.5536723163841808,152,0,null,"5307860","SHAW ISLAND"]
[{"$f":"VLOOKUP(B244,CCDDD!$A$3:$B$319,2,FALSE)","v":"23309"},"5307900","SHELTON",0,0,{"$f":"VLOOKUP(B244,'24-25 Adjusted Formula counts'!$A$3:$L$320,8,FALSE)","v":4122},{"$f":"ROUND((F244/$F$5*Assumptions!$C$22*Assumptions!$C$30),0)","v":22162},{"$f":"VLOOKUP(B244,'24-25 Adjusted Formula counts'!$A$3:$L$320,9,FALSE)","v":663},{"$f":"ROUND((H244/$H$5*Assumptions!$C$22*Assumptions!$C$31),0)","v":131356},null,153518,null,null,153518,0,153518,null,0,153518,null,{"$f":"IFERROR(VLOOKUP($A244, 'Allocation 2023-24 Final'!$A$7:$S$323,19,FALSE),0)","v":178951},null,-25433,-0.14212270398041921,297,0,null,"5307900","SHELTON"]
[{"$f":"VLOOKUP(B245,CCDDD!$A$3:$B$319,2,FALSE)","v":"17412"},"5307920","SHORELINE",0,0,{"$f":"VLOOKUP(B245,'24-25 Adjusted Formula counts'!$A$3:$L$320,8,FALSE)","v":10315},{"$f":"ROUND((F245/$F$5*Assumptions!$C$22*Assumptions!$C$30),0)","v":55458},{"$f":"VLOOKUP(B245,'24-25 Adjusted Formula counts'!$A$3:$L$320,9,FALSE)","v":608},{"$f":"ROUND((H245/$H$5*Assumptions!$C$22*Assumptions!$C$31),0)","v":120460},null,175918,null,null,175918,0,175918,null,0,175918,null,{"$f":"IFERROR(VLOOKUP($A245, 'Allocation 2023-24 Final'!$A$7:$S$323,19,FALSE),0)","v":212710},null,-36792,-0.17296789055521603,305,0,null,"5307920","SHORELINE"]
[{"$f":"VLOOKUP(B246,CCDDD!$A$3:$B$319,2,FALSE)","v":"30002"},"5307950","SKAMANIA",0,0,{"$f":"VLOOKUP(B246,'24-25 Adjusted Formula counts'!$A$3:$L$320,8,FALSE)","v":127},{"$f":"ROUND((F246/$F$5*Assumptions!$C$22*Assumptions!$C$30),0)","v":683},{"$f":"VLOOKUP(B246,'24-25 Adjusted Formula counts'!$A$3:$L$320,9,FALSE)","v":13},{"$f":"ROUND((H246/$H$5*Assumptions!$C$22*Assumptions!$C$31),0)","v":2576},null,3259,null,null,3259,0,3259,null,0,3259,null,{"$f":"IFERROR(VLOOKUP($A246, 'Allocation 2023-24 Final'!$A$7:$S$323,19,FALSE),0)","v":3410},null,-151,-4.4281524926686217E-2,143,0,null,"5307950","SKAMANIA"]
[{"$f":"VLOOKUP(B247,CCDDD!$A$3:$B$319,2,FALSE)","v":"17404"},"5307980","SKYKOMISH",0,0,{"$f":"VLOOKUP(B247,'24-25 Adjusted Formula counts'!$A$3:$L$320,8,FALSE)","v":68},{"$f":"ROUND((F247/$F$5*Assumptions!$C$22*Assumptions!$C$30),0)","v":366},{"$f":"VLOOKUP(B247,'24-25 Adjusted Formula counts'!$A$3:$L$320,9,FALSE)","v":6},{"$f":"ROUND((H247/$H$5*Assumptions!$C$22*Assumptions!$C$31),0)","v":1189},null,1555,null,null,1555,0,1555,null,0,1555,null,{"$f":"IFERROR(VLOOKUP($A247, 'Allocation 2023-24 Final'!$A$7:$S$323,19,FALSE),0)","v":2324},null,-769,-0.33089500860585197,164,0,null,"5307980","SKYKOMISH"]
[{"$f":"VLOOKUP(B248,CCDDD!$A$3:$B$319,2,FALSE)","v":"31201"},"5308020","SNOHOMISH",0,0,{"$f":"VLOOKUP(B248,'24-25 Adjusted Formula counts'!$A$3:$L$320,8,FALSE)","v":10714},{"$f":"ROUND((F248/$F$5*Assumptions!$C$22*Assumptions!$C$30),0)","v":57603},{"$f":"VLOOKUP(B248,'24-25 Adjusted Formula counts'!$A$3:$L$320,9,FALSE)","v":542},{"$f":"ROUND((H248/$H$5*Assumptions!$C$22*Assumptions!$C$31),0)","v":107383},null,164986,null,null,164986,0,164986,null,0,164986,null,{"$f":"IFERROR(VLOOKUP($A248, 'Allocation 2023-24 Final'!$A$7:$S$323,19,FALSE),0)","v":155723},null,9263,5.9483827051880586E-2,32,0,null,"5308020","SNOHOMISH"]
[{"$f":"VLOOKUP(B249,CCDDD!$A$3:$B$319,2,FALSE)","v":"17410"},"5308040","SNOQUALMIE VALLEY",0,0,{"$f":"VLOOKUP(B249,'24-25 Adjusted Formula counts'!$A$3:$L$320,8,FALSE)","v":7736},{"$f":"ROUND((F249/$F$5*Assumptions!$C$22*Assumptions!$C$30),0)","v":41592},{"$f":"VLOOKUP(B249,'24-25 Adjusted Formula counts'!$A$3:$L$320,9,FALSE)","v":263},{"$f":"ROUND((H249/$H$5*Assumptions!$C$22*Assumptions!$C$31),0)","v":52107},null,93699,null,null,93699,0,93699,null,0,93699,null,{"$f":"IFERROR(VLOOKUP($A249, 'Allocation 2023-24 Final'!$A$7:$S$323,19,FALSE),0)","v":117108},null,-23409,-0.19989240700891484,295,0,null,"5308040","SNOQUALMIE VALLEY"]
[{"$f":"VLOOKUP(B250,CCDDD!$A$3:$B$319,2,FALSE)","v":"13156"},"5308070","SOAP LAKE",0,0,{"$f":"VLOOKUP(B250,'24-25 Adjusted Formula counts'!$A$3:$L$320,8,FALSE)","v":609},{"$f":"ROUND((F250/$F$5*Assumptions!$C$22*Assumptions!$C$30),0)","v":3274},{"$f":"VLOOKUP(B250,'24-25 Adjusted Formula counts'!$A$3:$L$320,9,FALSE)","v":156},{"$f":"ROUND((H250/$H$5*Assumptions!$C$22*Assumptions!$C$31),0)","v":30907},null,34181,null,null,34181,0,34181,null,0,34181,null,{"$f":"IFERROR(VLOOKUP($A250, 'Allocation 2023-24 Final'!$A$7:$S$323,19,FALSE),0)","v":25728},null,8453,0.32855254975124376,35,0,null,"5308070","SOAP LAKE"]
[{"$f":"VLOOKUP(B251,CCDDD!$A$3:$B$319,2,FALSE)","v":"25118"},"5308100","SOUTH BEND",0,0,{"$f":"VLOOKUP(B251,'24-25 Adjusted Formula counts'!$A$3:$L$320,8,FALSE)","v":384},{"$f":"ROUND((F251/$F$5*Assumptions!$C$22*Assumptions!$C$30),0)","v":2065},{"$f":"VLOOKUP(B251,'24-25 Adjusted Formula counts'!$A$3:$L$320,9,FALSE)","v":92},{"$f":"ROUND((H251/$H$5*Assumptions!$C$22*Assumptions!$C$31),0)","v":18227},null,20292,null,null,20292,0,20292,null,0,20292,null,{"$f":"IFERROR(VLOOKUP($A251, 'Allocation 2023-24 Final'!$A$7:$S$323,19,FALSE),0)","v":17295},null,2997,0.1732870771899393,62,0,null,"5308100","SOUTH BEND"]
[{"$f":"VLOOKUP(B252,CCDDD!$A$3:$B$319,2,FALSE)","v":"18402"},"5308160","SOUTH KITSAP",0,0,{"$f":"VLOOKUP(B252,'24-25 Adjusted Formula counts'!$A$3:$L$320,8,FALSE)","v":11672},{"$f":"ROUND((F252/$F$5*Assumptions!$C$22*Assumptions!$C$30),0)","v":62753},{"$f":"VLOOKUP(B252,'24-25 Adjusted Formula counts'!$A$3:$L$320,9,FALSE)","v":1121},{"$f":"ROUND((H252/$H$5*Assumptions!$C$22*Assumptions!$C$31),0)","v":222097},null,284850,null,null,284850,0,284850,null,0,284850,null,{"$f":"IFERROR(VLOOKUP($A252, 'Allocation 2023-24 Final'!$A$7:$S$323,19,FALSE),0)","v":264895},null,19955,7.5331735215840245E-2,18,0,null,"5308160","SOUTH KITSAP"]
[{"$f":"VLOOKUP(B253,CCDDD!$A$3:$B$319,2,FALSE)","v":"15206"},"5308190","SOUTH WHIDBEY",0,0,{"$f":"VLOOKUP(B253,'24-25 Adjusted Formula counts'!$A$3:$L$320,8,FALSE)","v":1757},{"$f":"ROUND((F253/$F$5*Assumptions!$C$22*Assumptions!$C$30),0)","v":9446},{"$f":"VLOOKUP(B253,'24-25 Adjusted Formula counts'!$A$3:$L$320,9,FALSE)","v":119},{"$f":"ROUND((H253/$H$5*Assumptions!$C$22*Assumptions!$C$31),0)","v":23577},null,33023,null,null,33023,0,33023,null,0,33023,null,{"$f":"IFERROR(VLOOKUP($A253, 'Allocation 2023-24 Final'!$A$7:$S$323,19,FALSE),0)","v":43323},null,-10300,-0.2377490016850172,269,0,null,"5308190","SOUTH WHIDBEY"]
[{"$f":"VLOOKUP(B254,CCDDD!$A$3:$B$319,2,FALSE)","v":"23042"},"5308220","SOUTHSIDE",0,0,{"$f":"VLOOKUP(B254,'24-25 Adjusted Formula counts'!$A$3:$L$320,8,FALSE)","v":352},{"$f":"ROUND((F254/$F$5*Assumptions!$C$22*Assumptions!$C$30),0)","v":1892},{"$f":"VLOOKUP(B254,'24-25 Adjusted Formula counts'!$A$3:$L$320,9,FALSE)","v":56},{"$f":"ROUND((H254/$H$5*Assumptions!$C$22*Assumptions!$C$31),0)","v":11095},null,12987,null,null,12987,0,12987,null,0,12987,null,{"$f":"IFERROR(VLOOKUP($A254, 'Allocation 2023-24 Final'!$A$7:$S$323,19,FALSE),0)","v":10868},null,2119,0.19497607655502391,78,0,null,"5308220","SOUTHSIDE"]
[{"$f":"VLOOKUP(B255,CCDDD!$A$3:$B$319,2,FALSE)","v":"32901"},"5308260","SPOKANE INTERNATIONAL ACADEMY CHARTER",0,0,{"$f":"VLOOKUP(B255,'24-25 Adjusted Formula counts'!$A$3:$L$320,8,FALSE)","v":972.3118318476354},{"$f":"ROUND((F255/$F$5*Assumptions!$C$22*Assumptions!$C$30),0)","v":5228},{"$f":"VLOOKUP(B255,'24-25 Adjusted Formula counts'!$A$3:$L$320,9,FALSE)","v":132.00998391480414},{"$f":"ROUND((H255/$H$5*Assumptions!$C$22*Assumptions!$C$31),0)","v":26154},null,31382,null,null,31382,0,31382,null,0,31382,null,{"$f":"IFERROR(VLOOKUP($A255, 'Allocation 2023-24 Final'!$A$7:$S$323,19,FALSE),0)","v":23761},null,7621,0.32073565927359959,38,0,null,"5308260","SPOKANE INTERNATIONAL ACADEMY CHARTER"]
[{"$f":"VLOOKUP(B256,CCDDD!$A$3:$B$319,2,FALSE)","v":"32081"},"5308250","SPOKANE",0,0,{"$f":"VLOOKUP(B256,'24-25 Adjusted Formula counts'!$A$3:$L$320,8,FALSE)","v":33580.555902766355},{"$f":"ROUND((F256/$F$5*Assumptions!$C$22*Assumptions!$C$30),0)","v":180543},{"$f":"VLOOKUP(B256,'24-25 Adjusted Formula counts'!$A$3:$L$320,9,FALSE)","v":5851.4349104221001},{"$f":"ROUND((H256/$H$5*Assumptions!$C$22*Assumptions!$C$31),0)","v":1159312},null,1339855,null,null,1339855,0,1339855,null,0,1339855,null,{"$f":"IFERROR(VLOOKUP($A256, 'Allocation 2023-24 Final'!$A$7:$S$323,19,FALSE),0)","v":1107094},null,232761,0.21024501984474669,1,0,null,"5308250","SPOKANE"]
[{"$f":"VLOOKUP(B257,CCDDD!$A$3:$B$319,2,FALSE)","v":"22008"},"5308280","SPRAGUE",0,0,{"$f":"VLOOKUP(B257,'24-25 Adjusted Formula counts'!$A$3:$L$320,8,FALSE)","v":129},{"$f":"ROUND((F257/$F$5*Assumptions!$C$22*Assumptions!$C$30),0)","v":694},{"$f":"VLOOKUP(B257,'24-25 Adjusted Formula counts'!$A$3:$L$320,9,FALSE)","v":22},{"$f":"ROUND((H257/$H$5*Assumptions!$C$22*Assumptions!$C$31),0)","v":4359},null,5053,null,null,5053,0,5053,null,0,5053,null,{"$f":"IFERROR(VLOOKUP($A257, 'Allocation 2023-24 Final'!$A$7:$S$323,19,FALSE),0)","v":4962},null,91,1.833937928254736E-2,127,0,null,"5308280","SPRAGUE"]
[{"$f":"VLOOKUP(B258,CCDDD!$A$3:$B$319,2,FALSE)","v":"38322"},"5308310","ST JOHN",0,0,{"$f":"VLOOKUP(B258,'24-25 Adjusted Formula counts'!$A$3:$L$320,8,FALSE)","v":155},{"$f":"ROUND((F258/$F$5*Assumptions!$C$22*Assumptions!$C$30),0)","v":833},{"$f":"VLOOKUP(B258,'24-25 Adjusted Formula counts'!$A$3:$L$320,9,FALSE)","v":18},{"$f":"ROUND((H258/$H$5*Assumptions!$C$22*Assumptions!$C$31),0)","v":3566},null,4399,null,null,4399,0,4399,null,0,4399,null,{"$f":"IFERROR(VLOOKUP($A258, 'Allocation 2023-24 Final'!$A$7:$S$323,19,FALSE),0)","v":4160},null,239,5.7451923076923074E-2,122,0,null,"5308310","ST JOHN"]
[{"$f":"VLOOKUP(B259,CCDDD!$A$3:$B$319,2,FALSE)","v":"31401"},"5308340","STANWOOD",0,0,{"$f":"VLOOKUP(B259,'24-25 Adjusted Formula counts'!$A$3:$L$320,8,FALSE)","v":5413},{"$f":"ROUND((F259/$F$5*Assumptions!$C$22*Assumptions!$C$30),0)","v":29103},{"$f":"VLOOKUP(B259,'24-25 Adjusted Formula counts'!$A$3:$L$320,9,FALSE)","v":399},{"$f":"ROUND((H259/$H$5*Assumptions!$C$22*Assumptions!$C$31),0)","v":79052},null,108155,null,null,108155,0,108155,null,0,108155,null,{"$f":"IFERROR(VLOOKUP($A259, 'Allocation 2023-24 Final'!$A$7:$S$323,19,FALSE),0)","v":107070},null,1085,1.0133557485756981E-2,99,0,null,"5308340","STANWOOD"]
[{"$f":"VLOOKUP(B260,CCDDD!$A$3:$B$319,2,FALSE)","v":"11054"},"5308370","STAR",0,0,{"$f":"VLOOKUP(B260,'24-25 Adjusted Formula counts'!$A$3:$L$320,8,FALSE)","v":25},{"$f":"ROUND((F260/$F$5*Assumptions!$C$22*Assumptions!$C$30),0)","v":134},{"$f":"VLOOKUP(B260,'24-25 Adjusted Formula counts'!$A$3:$L$320,9,FALSE)","v":4},{"$f":"ROUND((H260/$H$5*Assumptions!$C$22*Assumptions!$C$31),0)","v":792},null,926,null,null,926,0,926,null,0,926,null,{"$f":"IFERROR(VLOOKUP($A260, 'Allocation 2023-24 Final'!$A$7:$S$323,19,FALSE),0)","v":1114},null,-188,-0.16876122082585279,146,0,null,"5308370","STAR"]
[{"$f":"VLOOKUP(B261,CCDDD!$A$3:$B$319,2,FALSE)","v":"07035"},"5308400","STARBUCK",0,0,{"$f":"VLOOKUP(B261,'24-25 Adjusted Formula counts'!$A$3:$L$320,8,FALSE)","v":15},{"$f":"ROUND((F261/$F$5*Assumptions!$C$22*Assumptions!$C$30),0)","v":81},{"$f":"VLOOKUP(B261,'24-25 Adjusted Formula counts'!$A$3:$L$320,9,FALSE)","v":15},{"$f":"ROUND((H261/$H$5*Assumptions!$C$22*Assumptions!$C$31),0)","v":2972},null,3053,null,null,3053,0,3053,null,0,3053,null,{"$f":"IFERROR(VLOOKUP($A261, 'Allocation 2023-24 Final'!$A$7:$S$323,19,FALSE),0)","v":1060},null,1993,1.8801886792452831,79,0,null,"5308400","STARBUCK"]
[{"$f":"VLOOKUP(B262,CCDDD!$A$3:$B$319,2,FALSE)","v":"04069"},"5308430","STEHEKIN",0,0,{"$f":"VLOOKUP(B262,'24-25 Adjusted Formula counts'!$A$3:$L$320,8,FALSE)","v":15},{"$f":"ROUND((F262/$F$5*Assumptions!$C$22*Assumptions!$C$30),0)","v":81},{"$f":"VLOOKUP(B262,'24-25 Adjusted Formula counts'!$A$3:$L$320,9,FALSE)","v":3},{"$f":"ROUND((H262/$H$5*Assumptions!$C$22*Assumptions!$C$31),0)","v":594},null,675,null,null,675,0,675,null,0,675,null,{"$f":"IFERROR(VLOOKUP($A262, 'Allocation 2023-24 Final'!$A$7:$S$323,19,FALSE),0)","v":470},null,205,0.43617021276595747,124,0,null,{"$f":"+B262","v":"5308430"},"STEHEKIN"]
[{"$f":"VLOOKUP(B263,CCDDD!$A$3:$B$319,2,FALSE)","v":"27001"},"5308460","STEILACOOM",0,0,{"$f":"VLOOKUP(B263,'24-25 Adjusted Formula counts'!$A$3:$L$320,8,FALSE)","v":3953},{"$f":"ROUND((F263/$F$5*Assumptions!$C$22*Assumptions!$C$30),0)","v":21253},{"$f":"VLOOKUP(B263,'24-25 Adjusted Formula counts'!$A$3:$L$320,9,FALSE)","v":255},{"$f":"ROUND((H263/$H$5*Assumptions!$C$22*Assumptions!$C$31),0)","v":50522},null,71775,null,null,{"$f":"K263","v":71775},{"$f":"-ROUND(N263/$N$5*$M$5,0)","v":0},{"$f":"+K263+O263+M263","v":71775},null,0,{"$f":"+P263+R263","v":71775},null,{"$f":"IFERROR(VLOOKUP($A263, 'Allocation 2023-24 Final'!$A$7:$S$323,19,FALSE),0)","v":68328},null,{"$f":"+S263-U263","v":3447},{"$f":"IF(U263>0,W263/U263,0)","v":5.0447839831401477E-2},58,{"$f":"(SUM(D263:E263)/S263)","v":0},null,"5308460","STEILACOOM"]
[{"$f":"VLOOKUP(B264,CCDDD!$A$3:$B$319,2,FALSE)","v":"38304"},"5308490","STEPTOE",0,0,{"$f":"VLOOKUP(B264,'24-25 Adjusted Formula counts'!$A$3:$L$320,8,FALSE)","v":51},{"$f":"ROUND((F264/$F$5*Assumptions!$C$22*Assumptions!$C$30),0)","v":274},{"$f":"VLOOKUP(B264,'24-25 Adjusted Formula counts'!$A$3:$L$320,9,FALSE)","v":2},{"$f":"ROUND((H264/$H$5*Assumptions!$C$22*Assumptions!$C$31),0)","v":396},null,670,null,null,670,0,670,null,0,670,null,{"$f":"IFERROR(VLOOKUP($A264, 'Allocation 2023-24 Final'!$A$7:$S$323,19,FALSE),0)","v":2028},null,-1358,-0.66962524654832345,{"$f":"RANK(W264,$W$7:$W$322,0)","v":184},0,null,"5308490","STEPTOE"]
[{"$f":"VLOOKUP(B265,CCDDD!$A$3:$B$319,2,FALSE)","v":"30303"},"5308520","STEVENSON-CARSON",0,0,{"$f":"VLOOKUP(B265,'24-25 Adjusted Formula counts'!$A$3:$L$320,8,FALSE)","v":920},{"$f":"ROUND((F265/$F$5*Assumptions!$C$22*Assumptions!$C$30),0)","v":4946},{"$f":"VLOOKUP(B265,'24-25 Adjusted Formula counts'!$A$3:$L$320,9,FALSE)","v":125},{"$f":"ROUND((H265/$H$5*Assumptions!$C$22*Assumptions!$C$31),0)","v":24766},null,29712,null,null,29712,0,29712,null,0,29712,null,{"$f":"IFERROR(VLOOKUP($A265, 'Allocation 2023-24 Final'!$A$7:$S$323,19,FALSE),0)","v":27543},null,2169,7.8749591547761677E-2,76,0,null,"5308520","STEVENSON-CARSON"]
[{"$f":"VLOOKUP(B266,CCDDD!$A$3:$B$319,2,FALSE)","v":"31311"},"5308550","SULTAN",0,0,{"$f":"VLOOKUP(B266,'24-25 Adjusted Formula counts'!$A$3:$L$320,8,FALSE)","v":2497},{"$f":"ROUND((F266/$F$5*Assumptions!$C$22*Assumptions!$C$30),0)","v":13425},{"$f":"VLOOKUP(B266,'24-25 Adjusted Formula counts'!$A$3:$L$320,9,FALSE)","v":212},{"$f":"ROUND((H266/$H$5*Assumptions!$C$22*Assumptions!$C$31),0)","v":42002},null,55427,null,null,55427,0,55427,null,0,55427,null,{"$f":"IFERROR(VLOOKUP($A266, 'Allocation 2023-24 Final'!$A$7:$S$323,19,FALSE),0)","v":60543},null,-5116,-8.4501924252184404E-2,235,0,null,"5308550","SULTAN"]
[{"$f":"VLOOKUP(B267,CCDDD!$A$3:$B$319,2,FALSE)","v":"17905"},"5308290","SUMMIT ATLAS CHARTER",0,0,{"$f":"VLOOKUP(B267,'24-25 Adjusted Formula counts'!$A$3:$L$320,8,FALSE)","v":741.77740106389422},{"$f":"ROUND((F267/$F$5*Assumptions!$C$22*Assumptions!$C$30),0)","v":3988},{"$f":"VLOOKUP(B267,'24-25 Adjusted Formula counts'!$A$3:$L$320,9,FALSE)","v":111.58435020052876},{"$f":"ROUND((H267/$H$5*Assumptions!$C$22*Assumptions!$C$31),0)","v":22108},null,26096,null,null,26096,0,26096,null,0,26096,null,{"$f":"IFERROR(VLOOKUP($A267, 'Allocation 2023-24 Final'!$A$7:$S$323,19,FALSE),0)","v":19722},null,6374,0.32319237399858025,42,0,null,"5308290","SUMMIT ATLAS CHARTER"]
[{"$f":"VLOOKUP(B268,CCDDD!$A$3:$B$319,2,FALSE)","v":"27905"},"5308230","SUMMIT OLYMPUS CHARTER",0,0,{"$f":"VLOOKUP(B268,'24-25 Adjusted Formula counts'!$A$3:$L$320,8,FALSE)","v":175.64614016364291},{"$f":"ROUND((F268/$F$5*Assumptions!$C$22*Assumptions!$C$30),0)","v":944},{"$f":"VLOOKUP(B268,'24-25 Adjusted Formula counts'!$A$3:$L$320,9,FALSE)","v":23.088142442227554},{"$f":"ROUND((H268/$H$5*Assumptions!$C$22*Assumptions!$C$31),0)","v":4574},null,5518,null,null,5518,0,5518,null,0,5518,null,{"$f":"IFERROR(VLOOKUP($A268, 'Allocation 2023-24 Final'!$A$7:$S$323,19,FALSE),0)","v":5218},null,300,5.7493292449214257E-2,118,0,null,"5308230","SUMMIT OLYMPUS CHARTER"]
[{"$f":"VLOOKUP(B269,CCDDD!$A$3:$B$319,2,FALSE)","v":"17902"},"5308240","SUMMIT SIERRA CHARTER",0,0,{"$f":"VLOOKUP(B269,'24-25 Adjusted Formula counts'!$A$3:$L$320,8,FALSE)","v":299.95370316244794},{"$f":"ROUND((F269/$F$5*Assumptions!$C$22*Assumptions!$C$30),0)","v":1613},{"$f":"VLOOKUP(B269,'24-25 Adjusted Formula counts'!$A$3:$L$320,9,FALSE)","v":42.917057769434265},{"$f":"ROUND((H269/$H$5*Assumptions!$C$22*Assumptions!$C$31),0)","v":8503},null,10116,null,null,10116,0,10116,null,0,10116,null,{"$f":"IFERROR(VLOOKUP($A269, 'Allocation 2023-24 Final'!$A$7:$S$323,19,FALSE),0)","v":8289},null,1827,0.22041259500542887,81,0,null,"5308240","SUMMIT SIERRA CHARTER"]
[{"$f":"VLOOKUP(B270,CCDDD!$A$3:$B$319,2,FALSE)","v":"33202"},"5308580","SUMMIT VALLEY",0,0,{"$f":"VLOOKUP(B270,'24-25 Adjusted Formula counts'!$A$3:$L$320,8,FALSE)","v":114},{"$f":"ROUND((F270/$F$5*Assumptions!$C$22*Assumptions!$C$30),0)","v":613},{"$f":"VLOOKUP(B270,'24-25 Adjusted Formula counts'!$A$3:$L$320,9,FALSE)","v":22},{"$f":"ROUND((H270/$H$5*Assumptions!$C$22*Assumptions!$C$31),0)","v":4359},null,4972,null,null,4972,0,4972,null,0,4972,null,{"$f":"IFERROR(VLOOKUP($A270, 'Allocation 2023-24 Final'!$A$7:$S$323,19,FALSE),0)","v":5878},null,-906,-0.15413405920381082,171,0,null,"5308580","SUMMIT VALLEY"]
[{"$f":"VLOOKUP(B271,CCDDD!$A$3:$B$319,2,FALSE)","v":"27320"},"5308610","SUMNER",0,0,{"$f":"VLOOKUP(B271,'24-25 Adjusted Formula counts'!$A$3:$L$320,8,FALSE)","v":10613},{"$f":"ROUND((F271/$F$5*Assumptions!$C$22*Assumptions!$C$30),0)","v":57060},{"$f":"VLOOKUP(B271,'24-25 Adjusted Formula counts'!$A$3:$L$320,9,FALSE)","v":524},{"$f":"ROUND((H271/$H$5*Assumptions!$C$22*Assumptions!$C$31),0)","v":103817},null,160877,null,null,160877,0,160877,null,0,160877,null,{"$f":"IFERROR(VLOOKUP($A271, 'Allocation 2023-24 Final'!$A$7:$S$323,19,FALSE),0)","v":177347},null,-16470,-9.2868782669004835E-2,285,0,null,"5308610","SUMNER"]
[{"$f":"VLOOKUP(B272,CCDDD!$A$3:$B$319,2,FALSE)","v":"39201"},"5308670","SUNNYSIDE",0,0,{"$f":"VLOOKUP(B272,'24-25 Adjusted Formula counts'!$A$3:$L$320,8,FALSE)","v":6200},{"$f":"ROUND((F272/$F$5*Assumptions!$C$22*Assumptions!$C$30),0)","v":33334},{"$f":"VLOOKUP(B272,'24-25 Adjusted Formula counts'!$A$3:$L$320,9,FALSE)","v":1182},{"$f":"ROUND((H272/$H$5*Assumptions!$C$22*Assumptions!$C$31),0)","v":234183},null,267517,null,null,267517,0,267517,null,0,267517,null,{"$f":"IFERROR(VLOOKUP($A272, 'Allocation 2023-24 Final'!$A$7:$S$323,19,FALSE),0)","v":283810},null,-16293,-5.7408125154152424E-2,284,0,null,"5308670","SUNNYSIDE"]
[{"$f":"VLOOKUP(B273,CCDDD!$A$3:$B$319,2,FALSE)","v":"18902"},"5308690","SUQUAMISH",0,0,{"$f":"VLOOKUP(B273,'24-25 Adjusted Formula counts'!$A$3:$L$320,8,FALSE)","v":85.977924944812486},{"$f":"ROUND((F273/$F$5*Assumptions!$C$22*Assumptions!$C$30),0)","v":462},{"$f":"VLOOKUP(B273,'24-25 Adjusted Formula counts'!$A$3:$L$320,9,FALSE)","v":18.010820895522368},{"$f":"ROUND((H273/$H$5*Assumptions!$C$22*Assumptions!$C$31),0)","v":3568},null,4030,null,null,4030,0,4030,null,0,4030,null,{"$f":"IFERROR(VLOOKUP($A273, 'Allocation 2023-24 Final'!$A$7:$S$323,19,FALSE),0)","v":3939},null,91,2.3102310231023101E-2,127,0,null,"5308690","SUQUAMISH"]
[{"$f":"VLOOKUP(B274,CCDDD!$A$3:$B$319,2,FALSE)","v":"27010"},"5308700","TACOMA",0,0,{"$f":"VLOOKUP(B274,'24-25 Adjusted Formula counts'!$A$3:$L$320,8,FALSE)","v":32594.736748488082},{"$f":"ROUND((F274/$F$5*Assumptions!$C$22*Assumptions!$C$30),0)","v":175243},{"$f":"VLOOKUP(B274,'24-25 Adjusted Formula counts'!$A$3:$L$320,9,FALSE)","v":4223.7719409016281},{"$f":"ROUND((H274/$H$5*Assumptions!$C$22*Assumptions!$C$31),0)","v":836832},null,1012075,null,null,1012075,0,1012075,null,0,1012075,null,{"$f":"IFERROR(VLOOKUP($A274, 'Allocation 2023-24 Final'!$A$7:$S$323,19,FALSE),0)","v":971947},null,40128,4.1286201819646547E-2,9,0,null,"5308700","TACOMA"]
[{"$f":"VLOOKUP(B275,CCDDD!$A$3:$B$319,2,FALSE)","v":"14077"},"5308730","TAHOLAH",0,0,{"$f":"VLOOKUP(B275,'24-25 Adjusted Formula counts'!$A$3:$L$320,8,FALSE)","v":346},{"$f":"ROUND((F275/$F$5*Assumptions!$C$22*Assumptions!$C$30),0)","v":1860},{"$f":"VLOOKUP(B275,'24-25 Adjusted Formula counts'!$A$3:$L$320,9,FALSE)","v":87},{"$f":"ROUND((H275/$H$5*Assumptions!$C$22*Assumptions!$C$31),0)","v":17237},null,19097,null,null,19097,0,19097,null,0,19097,null,{"$f":"IFERROR(VLOOKUP($A275, 'Allocation 2023-24 Final'!$A$7:$S$323,19,FALSE),0)","v":16302},null,2795,0.17145135566188197,67,0,null,"5308730","TAHOLAH"]
[{"$f":"VLOOKUP(B276,CCDDD!$A$3:$B$319,2,FALSE)","v":"17409"},"5308760","TAHOMA",0,0,{"$f":"VLOOKUP(B276,'24-25 Adjusted Formula counts'!$A$3:$L$320,8,FALSE)","v":9053},{"$f":"ROUND((F276/$F$5*Assumptions!$C$22*Assumptions!$C$30),0)","v":48673},{"$f":"VLOOKUP(B276,'24-25 Adjusted Formula counts'!$A$3:$L$320,9,FALSE)","v":378},{"$f":"ROUND((H276/$H$5*Assumptions!$C$22*Assumptions!$C$31),0)","v":74891},null,123564,null,null,123564,0,123564,null,0,123564,null,{"$f":"IFERROR(VLOOKUP($A276, 'Allocation 2023-24 Final'!$A$7:$S$323,19,FALSE),0)","v":136610},null,-13046,-9.5498133372373908E-2,276,0,null,"5308760","TAHOMA"]
[{"$f":"VLOOKUP(B277,CCDDD!$A$3:$B$319,2,FALSE)","v":"38265"},"5308790","TEKOA",0,0,{"$f":"VLOOKUP(B277,'24-25 Adjusted Formula counts'!$A$3:$L$320,8,FALSE)","v":163},{"$f":"ROUND((F277/$F$5*Assumptions!$C$22*Assumptions!$C$30),0)","v":876},{"$f":"VLOOKUP(B277,'24-25 Adjusted Formula counts'!$A$3:$L$320,9,FALSE)","v":28},{"$f":"ROUND((H277/$H$5*Assumptions!$C$22*Assumptions!$C$31),0)","v":5547},null,6423,null,null,6423,0,6423,null,0,6423,null,{"$f":"IFERROR(VLOOKUP($A277, 'Allocation 2023-24 Final'!$A$7:$S$323,19,FALSE),0)","v":6141},null,282,4.5920859794821689E-2,120,0,null,"5308790","TEKOA"]
[{"$f":"VLOOKUP(B278,CCDDD!$A$3:$B$319,2,FALSE)","v":"34402"},"5308820","TENINO",0,0,{"$f":"VLOOKUP(B278,'24-25 Adjusted Formula counts'!$A$3:$L$320,8,FALSE)","v":1509},{"$f":"ROUND((F278/$F$5*Assumptions!$C$22*Assumptions!$C$30),0)","v":8113},{"$f":"VLOOKUP(B278,'24-25 Adjusted Formula counts'!$A$3:$L$320,9,FALSE)","v":191},{"$f":"ROUND((H278/$H$5*Assumptions!$C$22*Assumptions!$C$31),0)","v":37842},null,45955,null,null,45955,0,45955,null,0,45955,null,{"$f":"IFERROR(VLOOKUP($A278, 'Allocation 2023-24 Final'!$A$7:$S$323,19,FALSE),0)","v":49753},null,-3798,-7.6337105300182909E-2,220,0,null,"5308820","TENINO"]
[{"$f":"VLOOKUP(B279,CCDDD!$A$3:$B$319,2,FALSE)","v":"19400"},"5308850","THORP",0,0,{"$f":"VLOOKUP(B279,'24-25 Adjusted Formula counts'!$A$3:$L$320,8,FALSE)","v":205},{"$f":"ROUND((F279/$F$5*Assumptions!$C$22*Assumptions!$C$30),0)","v":1102},{"$f":"VLOOKUP(B279,'24-25 Adjusted Formula counts'!$A$3:$L$320,9,FALSE)","v":24},{"$f":"ROUND((H279/$H$5*Assumptions!$C$22*Assumptions!$C$31),0)","v":4755},null,5857,null,null,5857,0,5857,null,0,5857,null,{"$f":"IFERROR(VLOOKUP($A279, 'Allocation 2023-24 Final'!$A$7:$S$323,19,FALSE),0)","v":6924},null,-1067,-0.15410167533217795,179,0,null,"5308850","THORP"]
[{"$f":"VLOOKUP(B280,CCDDD!$A$3:$B$319,2,FALSE)","v":"21237"},"5308910","TOLEDO",0,0,{"$f":"VLOOKUP(B280,'24-25 Adjusted Formula counts'!$A$3:$L$320,8,FALSE)","v":852},{"$f":"ROUND((F280/$F$5*Assumptions!$C$22*Assumptions!$C$30),0)","v":4581},{"$f":"VLOOKUP(B280,'24-25 Adjusted Formula counts'!$A$3:$L$320,9,FALSE)","v":87},{"$f":"ROUND((H280/$H$5*Assumptions!$C$22*Assumptions!$C$31),0)","v":17237},null,21818,null,null,21818,0,21818,null,0,21818,null,{"$f":"IFERROR(VLOOKUP($A280, 'Allocation 2023-24 Final'!$A$7:$S$323,19,FALSE),0)","v":23271},null,-1453,-6.243822783722229E-2,186,0,null,"5308910","TOLEDO"]
[{"$f":"VLOOKUP(B281,CCDDD!$A$3:$B$319,2,FALSE)","v":"24404"},"5308940","TONASKET",0,0,{"$f":"VLOOKUP(B281,'24-25 Adjusted Formula counts'!$A$3:$L$320,8,FALSE)","v":1130},{"$f":"ROUND((F281/$F$5*Assumptions!$C$22*Assumptions!$C$30),0)","v":6075},{"$f":"VLOOKUP(B281,'24-25 Adjusted Formula counts'!$A$3:$L$320,9,FALSE)","v":281},{"$f":"ROUND((H281/$H$5*Assumptions!$C$22*Assumptions!$C$31),0)","v":55673},null,61748,null,null,61748,0,61748,null,{"$f":"-1*(P281*Q281)","v":0},61748,null,{"$f":"IFERROR(VLOOKUP($A281, 'Allocation 2023-24 Final'!$A$7:$S$323,19,FALSE),0)","v":60435},null,1313,2.1725821130139818E-2,93,0,null,"5308940","TONASKET"]
[{"$f":"VLOOKUP(B282,CCDDD!$A$3:$B$319,2,FALSE)","v":"39202"},"5308970","TOPPENISH",0,0,{"$f":"VLOOKUP(B282,'24-25 Adjusted Formula counts'!$A$3:$L$320,8,FALSE)","v":3470},{"$f":"ROUND((F282/$F$5*Assumptions!$C$22*Assumptions!$C$30),0)","v":18656},{"$f":"VLOOKUP(B282,'24-25 Adjusted Formula counts'!$A$3:$L$320,9,FALSE)","v":710},{"$f":"ROUND((H282/$H$5*Assumptions!$C$22*Assumptions!$C$31),0)","v":140668},null,159324,null,null,159324,0,159324,null,0,159324,null,{"$f":"IFERROR(VLOOKUP($A282, 'Allocation 2023-24 Final'!$A$7:$S$323,19,FALSE),0)","v":168962},null,-9638,-5.7042411903268191E-2,262,0,null,"5308970","TOPPENISH"]
[{"$f":"VLOOKUP(B283,CCDDD!$A$3:$B$319,2,FALSE)","v":"36300"},"5309000","TOUCHET",0,0,{"$f":"VLOOKUP(B283,'24-25 Adjusted Formula counts'!$A$3:$L$320,8,FALSE)","v":218},{"$f":"ROUND((F283/$F$5*Assumptions!$C$22*Assumptions!$C$30),0)","v":1172},{"$f":"VLOOKUP(B283,'24-25 Adjusted Formula counts'!$A$3:$L$320,9,FALSE)","v":28},{"$f":"ROUND((H283/$H$5*Assumptions!$C$22*Assumptions!$C$31),0)","v":5547},null,6719,null,null,6719,0,6719,null,0,6719,null,{"$f":"IFERROR(VLOOKUP($A283, 'Allocation 2023-24 Final'!$A$7:$S$323,19,FALSE),0)","v":5110},null,1609,0.31487279843444227,87,0,null,"5309000","TOUCHET"]
[{"$f":"VLOOKUP(B284,CCDDD!$A$3:$B$319,2,FALSE)","v":"08130"},"5309030","TOUTLE LAKE",0,0,{"$f":"VLOOKUP(B284,'24-25 Adjusted Formula counts'!$A$3:$L$320,8,FALSE)","v":768},{"$f":"ROUND((F284/$F$5*Assumptions!$C$22*Assumptions!$C$30),0)","v":4129},{"$f":"VLOOKUP(B284,'24-25 Adjusted Formula counts'!$A$3:$L$320,9,FALSE)","v":75},{"$f":"ROUND((H284/$H$5*Assumptions!$C$22*Assumptions!$C$31),0)","v":14859},null,18988,null,null,18988,0,18988,null,0,18988,null,{"$f":"IFERROR(VLOOKUP($A284, 'Allocation 2023-24 Final'!$A$7:$S$323,19,FALSE),0)","v":20899},null,-1911,-9.1439781807741996E-2,194,0,null,"5309030","TOUTLE LAKE"]
[{"$f":"VLOOKUP(B285,CCDDD!$A$3:$B$319,2,FALSE)","v":"20400"},"5309060","TROUT LAKE",0,0,{"$f":"VLOOKUP(B285,'24-25 Adjusted Formula counts'!$A$3:$L$320,8,FALSE)","v":198},{"$f":"ROUND((F285/$F$5*Assumptions!$C$22*Assumptions!$C$30),0)","v":1065},{"$f":"VLOOKUP(B285,'24-25 Adjusted Formula counts'!$A$3:$L$320,9,FALSE)","v":33},{"$f":"ROUND((H285/$H$5*Assumptions!$C$22*Assumptions!$C$31),0)","v":6538},null,7603,null,null,7603,0,7603,null,0,7603,null,{"$f":"IFERROR(VLOOKUP($A285, 'Allocation 2023-24 Final'!$A$7:$S$323,19,FALSE),0)","v":10241},null,-2638,-0.25759203202812225,205,0,null,"5309060","TROUT LAKE"]
[{"$f":"VLOOKUP(B286,CCDDD!$A$3:$B$319,2,FALSE)","v":"17406"},"5308130","TUKWILA",0,0,{"$f":"VLOOKUP(B286,'24-25 Adjusted Formula counts'!$A$3:$L$320,8,FALSE)","v":2228.7327061427782},{"$f":"ROUND((F286/$F$5*Assumptions!$C$22*Assumptions!$C$30),0)","v":11983},{"$f":"VLOOKUP(B286,'24-25 Adjusted Formula counts'!$A$3:$L$320,9,FALSE)","v":441.71840873634949},{"$f":"ROUND((H286/$H$5*Assumptions!$C$22*Assumptions!$C$31),0)","v":87515},null,99498,null,null,99498,0,99498,null,0,99498,null,{"$f":"IFERROR(VLOOKUP($A286, 'Allocation 2023-24 Final'!$A$7:$S$323,19,FALSE),0)","v":114739},null,-15241,-0.13283190545498916,281,0,null,"5308130","TUKWILA"]
[{"$f":"VLOOKUP(B287,CCDDD!$A$3:$B$319,2,FALSE)","v":"34033"},"5309100","TUMWATER",0,0,{"$f":"VLOOKUP(B287,'24-25 Adjusted Formula counts'!$A$3:$L$320,8,FALSE)","v":6868},{"$f":"ROUND((F287/$F$5*Assumptions!$C$22*Assumptions!$C$30),0)","v":36925},{"$f":"VLOOKUP(B287,'24-25 Adjusted Formula counts'!$A$3:$L$320,9,FALSE)","v":644},{"$f":"ROUND((H287/$H$5*Assumptions!$C$22*Assumptions!$C$31),0)","v":127592},null,164517,null,null,164517,0,164517,null,0,164517,null,{"$f":"IFERROR(VLOOKUP($A287, 'Allocation 2023-24 Final'!$A$7:$S$323,19,FALSE),0)","v":177051},null,-12534,-7.0793161292508941E-2,273,0,null,"5309100","TUMWATER"]
[{"$f":"VLOOKUP(B288,CCDDD!$A$3:$B$319,2,FALSE)","v":"39002"},"5309150","UNION GAP",0,0,{"$f":"VLOOKUP(B288,'24-25 Adjusted Formula counts'!$A$3:$L$320,8,FALSE)","v":810},{"$f":"ROUND((F288/$F$5*Assumptions!$C$22*Assumptions!$C$30),0)","v":4355},{"$f":"VLOOKUP(B288,'24-25 Adjusted Formula counts'!$A$3:$L$320,9,FALSE)","v":202},{"$f":"ROUND((H288/$H$5*Assumptions!$C$22*Assumptions!$C$31),0)","v":40021},null,44376,null,null,44376,0,44376,null,0,44376,null,{"$f":"IFERROR(VLOOKUP($A288, 'Allocation 2023-24 Final'!$A$7:$S$323,19,FALSE),0)","v":35200},null,9176,0.26068181818181818,33,0,null,"5309150","UNION GAP"]
[{"$f":"VLOOKUP(B289,CCDDD!$A$3:$B$319,2,FALSE)","v":"27083"},"5309180","UNIVERSITY PLACE",0,0,{"$f":"VLOOKUP(B289,'24-25 Adjusted Formula counts'!$A$3:$L$320,8,FALSE)","v":5685},{"$f":"ROUND((F289/$F$5*Assumptions!$C$22*Assumptions!$C$30),0)","v":30565},{"$f":"VLOOKUP(B289,'24-25 Adjusted Formula counts'!$A$3:$L$320,9,FALSE)","v":457},{"$f":"ROUND((H289/$H$5*Assumptions!$C$22*Assumptions!$C$31),0)","v":90543},null,121108,null,null,121108,0,121108,null,0,121108,null,{"$f":"IFERROR(VLOOKUP($A289, 'Allocation 2023-24 Final'!$A$7:$S$323,19,FALSE),0)","v":120257},null,851,7.0765111386447361E-3,105,0,null,"5309180","UNIVERSITY PLACE"]
[{"$f":"VLOOKUP(B290,CCDDD!$A$3:$B$319,2,FALSE)","v":"33070"},"5309240","VALLEY",0,0,{"$f":"VLOOKUP(B290,'24-25 Adjusted Formula counts'!$A$3:$L$320,8,FALSE)","v":288},{"$f":"ROUND((F290/$F$5*Assumptions!$C$22*Assumptions!$C$30),0)","v":1548},{"$f":"VLOOKUP(B290,'24-25 Adjusted Formula counts'!$A$3:$L$320,9,FALSE)","v":66},{"$f":"ROUND((H290/$H$5*Assumptions!$C$22*Assumptions!$C$31),0)","v":13076},null,14624,null,null,14624,0,14624,null,0,14624,null,{"$f":"IFERROR(VLOOKUP($A290, 'Allocation 2023-24 Final'!$A$7:$S$323,19,FALSE),0)","v":15395},null,-771,-5.0081195193244561E-2,165,0,null,"5309240","VALLEY"]
[{"$f":"VLOOKUP(B291,CCDDD!$A$3:$B$319,2,FALSE)","v":"06037"},"5309270","VANCOUVER",0,0,{"$f":"VLOOKUP(B291,'24-25 Adjusted Formula counts'!$A$3:$L$320,8,FALSE)","v":24520.728864025979},{"$f":"ROUND((F291/$F$5*Assumptions!$C$22*Assumptions!$C$30),0)","v":131834},{"$f":"VLOOKUP(B291,'24-25 Adjusted Formula counts'!$A$3:$L$320,9,FALSE)","v":2705.9525839104963},{"$f":"ROUND((H291/$H$5*Assumptions!$C$22*Assumptions!$C$31),0)","v":536115},null,667949,null,null,667949,0,667949,null,0,667949,null,{"$f":"IFERROR(VLOOKUP($A291, 'Allocation 2023-24 Final'!$A$7:$S$323,19,FALSE),0)","v":745964},null,-78015,-0.10458279488018188,314,0,null,"5309270","VANCOUVER"]
[{"$f":"VLOOKUP(B292,CCDDD!$A$3:$B$319,2,FALSE)","v":"17402"},"5309300","VASHON ISLAND",0,0,{"$f":"VLOOKUP(B292,'24-25 Adjusted Formula counts'!$A$3:$L$320,8,FALSE)","v":1410},{"$f":"ROUND((F292/$F$5*Assumptions!$C$22*Assumptions!$C$30),0)","v":7581},{"$f":"VLOOKUP(B292,'24-25 Adjusted Formula counts'!$A$3:$L$320,9,FALSE)","v":117},{"$f":"ROUND((H292/$H$5*Assumptions!$C$22*Assumptions!$C$31),0)","v":23181},null,30762,null,null,30762,0,30762,null,0,30762,null,{"$f":"IFERROR(VLOOKUP($A292, 'Allocation 2023-24 Final'!$A$7:$S$323,19,FALSE),0)","v":37163},null,-6401,-0.17224120765277293,247,0,null,"5309300","VASHON ISLAND"]
[{"$f":"VLOOKUP(B293,CCDDD!$A$3:$B$319,2,FALSE)","v":"35200"},"5309330","WAHKIAKUM",0,0,{"$f":"VLOOKUP(B293,'24-25 Adjusted Formula counts'!$A$3:$L$320,8,FALSE)","v":495},{"$f":"ROUND((F293/$F$5*Assumptions!$C$22*Assumptions!$C$30),0)","v":2661},{"$f":"VLOOKUP(B293,'24-25 Adjusted Formula counts'!$A$3:$L$320,9,FALSE)","v":109},{"$f":"ROUND((H293/$H$5*Assumptions!$C$22*Assumptions!$C$31),0)","v":21596},null,24257,null,null,24257,0,24257,null,0,24257,null,{"$f":"IFERROR(VLOOKUP($A293, 'Allocation 2023-24 Final'!$A$7:$S$323,19,FALSE),0)","v":20170},null,4087,0.20262766484878533,51,0,null,"5309330","WAHKIAKUM"]
[{"$f":"VLOOKUP(B294,CCDDD!$A$3:$B$319,2,FALSE)","v":"13073"},"5309360","WAHLUKE",0,0,{"$f":"VLOOKUP(B294,'24-25 Adjusted Formula counts'!$A$3:$L$320,8,FALSE)","v":2012},{"$f":"ROUND((F294/$F$5*Assumptions!$C$22*Assumptions!$C$30),0)","v":10817},{"$f":"VLOOKUP(B294,'24-25 Adjusted Formula counts'!$A$3:$L$320,9,FALSE)","v":351},{"$f":"ROUND((H294/$H$5*Assumptions!$C$22*Assumptions!$C$31),0)","v":69542},null,80359,null,null,80359,0,80359,null,0,80359,null,{"$f":"IFERROR(VLOOKUP($A294, 'Allocation 2023-24 Final'!$A$7:$S$323,19,FALSE),0)","v":59688},null,20671,0.34631751775901354,17,0,null,"5309360","WAHLUKE"]
[{"$f":"VLOOKUP(B295,CCDDD!$A$3:$B$319,2,FALSE)","v":"36401"},"5309390","WAITSBURG",0,0,{"$f":"VLOOKUP(B295,'24-25 Adjusted Formula counts'!$A$3:$L$320,8,FALSE)","v":274},{"$f":"ROUND((F295/$F$5*Assumptions!$C$22*Assumptions!$C$30),0)","v":1473},{"$f":"VLOOKUP(B295,'24-25 Adjusted Formula counts'!$A$3:$L$320,9,FALSE)","v":28},{"$f":"ROUND((H295/$H$5*Assumptions!$C$22*Assumptions!$C$31),0)","v":5547},null,7020,null,null,7020,0,7020,null,0,7020,null,{"$f":"IFERROR(VLOOKUP($A295, 'Allocation 2023-24 Final'!$A$7:$S$323,19,FALSE),0)","v":8923},null,-1903,-0.21326907990586125,193,0,null,"5309390","WAITSBURG"]
[{"$f":"VLOOKUP(B296,CCDDD!$A$3:$B$319,2,FALSE)","v":"36140"},"5309450","WALLA WALLA",0,0,{"$f":"VLOOKUP(B296,'24-25 Adjusted Formula counts'!$A$3:$L$320,8,FALSE)","v":5918},{"$f":"ROUND((F296/$F$5*Assumptions!$C$22*Assumptions!$C$30),0)","v":31818},{"$f":"VLOOKUP(B296,'24-25 Adjusted Formula counts'!$A$3:$L$320,9,FALSE)","v":796},{"$f":"ROUND((H296/$H$5*Assumptions!$C$22*Assumptions!$C$31),0)","v":157707},null,189525,null,null,189525,0,189525,null,0,189525,null,{"$f":"IFERROR(VLOOKUP($A296, 'Allocation 2023-24 Final'!$A$7:$S$323,19,FALSE),0)","v":193588},null,-4063,-2.0987871149038162E-2,222,0,null,"5309450","WALLA WALLA"]
[{"$f":"VLOOKUP(B297,CCDDD!$A$3:$B$319,2,FALSE)","v":"39207"},"5309480","WAPATO",0,0,{"$f":"VLOOKUP(B297,'24-25 Adjusted Formula counts'!$A$3:$L$320,8,FALSE)","v":3490},{"$f":"ROUND((F297/$F$5*Assumptions!$C$22*Assumptions!$C$30),0)","v":18764},{"$f":"VLOOKUP(B297,'24-25 Adjusted Formula counts'!$A$3:$L$320,9,FALSE)","v":828},{"$f":"ROUND((H297/$H$5*Assumptions!$C$22*Assumptions!$C$31),0)","v":164047},null,182811,null,null,182811,0,182811,null,0,182811,null,{"$f":"IFERROR(VLOOKUP($A297, 'Allocation 2023-24 Final'!$A$7:$S$323,19,FALSE),0)","v":183487},null,-676,-3.684184710633451E-3,161,0,null,"5309480","WAPATO"]
[{"$f":"VLOOKUP(B298,CCDDD!$A$3:$B$319,2,FALSE)","v":"13146"},"5309510","WARDEN",0,0,{"$f":"VLOOKUP(B298,'24-25 Adjusted Formula counts'!$A$3:$L$320,8,FALSE)","v":865},{"$f":"ROUND((F298/$F$5*Assumptions!$C$22*Assumptions!$C$30),0)","v":4651},{"$f":"VLOOKUP(B298,'24-25 Adjusted Formula counts'!$A$3:$L$320,9,FALSE)","v":175},{"$f":"ROUND((H298/$H$5*Assumptions!$C$22*Assumptions!$C$31),0)","v":34672},null,39323,null,null,39323,0,39323,null,0,39323,null,{"$f":"IFERROR(VLOOKUP($A298, 'Allocation 2023-24 Final'!$A$7:$S$323,19,FALSE),0)","v":28297},null,11026,0.38965261335123863,28,0,null,"5309510","WARDEN"]
[{"$f":"VLOOKUP(B299,CCDDD!$A$3:$B$319,2,FALSE)","v":"06112"},"5309540","WASHOUGAL",0,0,{"$f":"VLOOKUP(B299,'24-25 Adjusted Formula counts'!$A$3:$L$320,8,FALSE)","v":3739},{"$f":"ROUND((F299/$F$5*Assumptions!$C$22*Assumptions!$C$30),0)","v":20102},{"$f":"VLOOKUP(B299,'24-25 Adjusted Formula counts'!$A$3:$L$320,9,FALSE)","v":266},{"$f":"ROUND((H299/$H$5*Assumptions!$C$22*Assumptions!$C$31),0)","v":52701},null,72803,null,null,72803,0,72803,null,0,72803,null,{"$f":"IFERROR(VLOOKUP($A299, 'Allocation 2023-24 Final'!$A$7:$S$323,19,FALSE),0)","v":79886},null,-7083,-8.8663845980522238E-2,251,0,null,"5309540","WASHOUGAL"]
[{"$f":"VLOOKUP(B300,CCDDD!$A$3:$B$319,2,FALSE)","v":"01109"},"5309570","WASHTUCNA",0,0,{"$f":"VLOOKUP(B300,'24-25 Adjusted Formula counts'!$A$3:$L$320,8,FALSE)","v":67},{"$f":"ROUND((F300/$F$5*Assumptions!$C$22*Assumptions!$C$30),0)","v":360},{"$f":"VLOOKUP(B300,'24-25 Adjusted Formula counts'!$A$3:$L$320,9,FALSE)","v":7},{"$f":"ROUND((H300/$H$5*Assumptions!$C$22*Assumptions!$C$31),0)","v":1387},null,1747,null,null,1747,0,1747,null,0,1747,null,{"$f":"IFERROR(VLOOKUP($A300, 'Allocation 2023-24 Final'!$A$7:$S$323,19,FALSE),0)","v":2114},null,-367,-0.17360454115421003,151,0,null,"5309570","WASHTUCNA"]
[{"$f":"VLOOKUP(B301,CCDDD!$A$3:$B$319,2,FALSE)","v":"09209"},"5309600","WATERVILLE",0,0,{"$f":"VLOOKUP(B301,'24-25 Adjusted Formula counts'!$A$3:$L$320,8,FALSE)","v":328},{"$f":"ROUND((F301/$F$5*Assumptions!$C$22*Assumptions!$C$30),0)","v":1763},{"$f":"VLOOKUP(B301,'24-25 Adjusted Formula counts'!$A$3:$L$320,9,FALSE)","v":42},{"$f":"ROUND((H301/$H$5*Assumptions!$C$22*Assumptions!$C$31),0)","v":8321},null,{"$f":"ROUNDDOWN(+I301+G301+E301+D301+J301,0)","v":10084},null,null,10084,0,10084,null,0,10084,null,{"$f":"IFERROR(VLOOKUP($A301, 'Allocation 2023-24 Final'!$A$7:$S$323,19,FALSE),0)","v":11957},null,-1873,-0.15664464330517688,192,0,null,"5309600","WATERVILLE"]
[{"$f":"VLOOKUP(B302,CCDDD!$A$3:$B$319,2,FALSE)","v":"33049"},"5309630","WELLPINIT",0,0,{"$f":"VLOOKUP(B302,'24-25 Adjusted Formula counts'!$A$3:$L$320,8,FALSE)","v":315},{"$f":"ROUND((F302/$F$5*Assumptions!$C$22*Assumptions!$C$30),0)","v":1694},{"$f":"VLOOKUP(B302,'24-25 Adjusted Formula counts'!$A$3:$L$320,9,FALSE)","v":63},{"$f":"ROUND((H302/$H$5*Assumptions!$C$22*Assumptions!$C$31),0)","v":12482},null,14176,null,null,14176,0,14176,null,0,14176,null,{"$f":"IFERROR(VLOOKUP($A302, 'Allocation 2023-24 Final'!$A$7:$S$323,19,FALSE),0)","v":15150},null,-974,-6.4290429042904287E-2,177,0,null,"5309630","WELLPINIT"]
[{"$f":"VLOOKUP(B303,CCDDD!$A$3:$B$319,2,FALSE)","v":"04246"},"5309660","WENATCHEE",0,0,{"$f":"VLOOKUP(B303,'24-25 Adjusted Formula counts'!$A$3:$L$320,8,FALSE)","v":7924.8460388639733},{"$f":"ROUND((F303/$F$5*Assumptions!$C$22*Assumptions!$C$30),0)","v":42607},{"$f":"VLOOKUP(B303,'24-25 Adjusted Formula counts'!$A$3:$L$320,9,FALSE)","v":844.41265474552949},{"$f":"ROUND((H303/$H$5*Assumptions!$C$22*Assumptions!$C$31),0)","v":167299},null,209906,null,null,209906,0,209906,null,0,209906,null,{"$f":"IFERROR(VLOOKUP($A303, 'Allocation 2023-24 Final'!$A$7:$S$323,19,FALSE),0)","v":250947},null,-41041,-0.16354449345877814,306,0,null,"5309660","WENATCHEE"]
[{"$f":"VLOOKUP(B304,CCDDD!$A$3:$B$319,2,FALSE)","v":"32363"},"5309690","WEST VALLEY (SPK)",0,0,{"$f":"VLOOKUP(B304,'24-25 Adjusted Formula counts'!$A$3:$L$320,8,FALSE)","v":3207},{"$f":"ROUND((F304/$F$5*Assumptions!$C$22*Assumptions!$C$30),0)","v":17242},{"$f":"VLOOKUP(B304,'24-25 Adjusted Formula counts'!$A$3:$L$320,9,FALSE)","v":396},{"$f":"ROUND((H304/$H$5*Assumptions!$C$22*Assumptions!$C$31),0)","v":78457},null,95699,null,null,95699,0,95699,null,0,95699,null,{"$f":"IFERROR(VLOOKUP($A304, 'Allocation 2023-24 Final'!$A$7:$S$323,19,FALSE),0)","v":81969},null,13730,0.16750234844880382,25,0,null,"5309690","WEST VALLEY (SPK)"]
[{"$f":"VLOOKUP(B305,CCDDD!$A$3:$B$319,2,FALSE)","v":"39208"},"5309720","WEST VALLEY (YAK)",0,0,{"$f":"VLOOKUP(B305,'24-25 Adjusted Formula counts'!$A$3:$L$320,8,FALSE)","v":6288},{"$f":"ROUND((F305/$F$5*Assumptions!$C$22*Assumptions!$C$30),0)","v":33807},{"$f":"VLOOKUP(B305,'24-25 Adjusted Formula counts'!$A$3:$L$320,9,FALSE)","v":713},{"$f":"ROUND((H305/$H$5*Assumptions!$C$22*Assumptions!$C$31),0)","v":141263},null,175070,null,null,175070,0,175070,null,0,175070,null,{"$f":"IFERROR(VLOOKUP($A305, 'Allocation 2023-24 Final'!$A$7:$S$323,19,FALSE),0)","v":176938},null,-1868,-1.0557370378324611E-2,191,0,null,"5309720","WEST VALLEY (YAK)"]
[{"$f":"VLOOKUP(B306,CCDDD!$A$3:$B$319,2,FALSE)","v":"37902"},"5309740","WHATCOM INTERGENERATIONAL CHARTER",0,0,{"$f":"VLOOKUP(B306,'24-25 Adjusted Formula counts'!$A$3:$L$320,8,FALSE)","v":74.901315789473657},{"$f":"ROUND((F306/$F$5*Assumptions!$C$22*Assumptions!$C$30),0)","v":403},{"$f":"VLOOKUP(B306,'24-25 Adjusted Formula counts'!$A$3:$L$320,9,FALSE)","v":7.9857569492304208},{"$f":"ROUND((H306/$H$5*Assumptions!$C$22*Assumptions!$C$31),0)","v":1582},null,1985,null,null,1985,0,1985,null,0,1985,null,{"$f":"IFERROR(VLOOKUP($A306, 'Allocation 2023-24 Final'!$A$7:$S$323,19,FALSE),0)","v":3331},null,-1346,-0.4040828580006004,183,0,null,"5309740","WHATCOM INTERGENERATIONAL CHARTER"]
[{"$f":"VLOOKUP(B307,CCDDD!$A$3:$B$319,2,FALSE)","v":"21303"},"5309750","WHITE PASS",0,0,{"$f":"VLOOKUP(B307,'24-25 Adjusted Formula counts'!$A$3:$L$320,8,FALSE)","v":468},{"$f":"ROUND((F307/$F$5*Assumptions!$C$22*Assumptions!$C$30),0)","v":2516},{"$f":"VLOOKUP(B307,'24-25 Adjusted Formula counts'!$A$3:$L$320,9,FALSE)","v":60},{"$f":"ROUND((H307/$H$5*Assumptions!$C$22*Assumptions!$C$31),0)","v":11887},null,14403,null,null,14403,0,14403,null,0,14403,null,{"$f":"IFERROR(VLOOKUP($A307, 'Allocation 2023-24 Final'!$A$7:$S$323,19,FALSE),0)","v":23748},null,-9345,-0.39350682162708439,261,0,null,"5309750","WHITE PASS"]
[{"$f":"VLOOKUP(B308,CCDDD!$A$3:$B$319,2,FALSE)","v":"27416"},"5309780","WHITE RIVER",0,0,{"$f":"VLOOKUP(B308,'24-25 Adjusted Formula counts'!$A$3:$L$320,8,FALSE)","v":4695},{"$f":"ROUND((F308/$F$5*Assumptions!$C$22*Assumptions!$C$30),0)","v":25242},{"$f":"VLOOKUP(B308,'24-25 Adjusted Formula counts'!$A$3:$L$320,9,FALSE)","v":226},{"$f":"ROUND((H308/$H$5*Assumptions!$C$22*Assumptions!$C$31),0)","v":44776},null,70018,null,null,70018,0,70018,null,0,70018,null,{"$f":"IFERROR(VLOOKUP($A308, 'Allocation 2023-24 Final'!$A$7:$S$323,19,FALSE),0)","v":81147},null,-11129,-0.13714616683303141,271,0,null,"5309780","WHITE RIVER"]
[{"$f":"VLOOKUP(B309,CCDDD!$A$3:$B$319,2,FALSE)","v":"20405"},"5309810","WHITE SALMON",0,0,{"$f":"VLOOKUP(B309,'24-25 Adjusted Formula counts'!$A$3:$L$320,8,FALSE)","v":1210},{"$f":"ROUND((F309/$F$5*Assumptions!$C$22*Assumptions!$C$30),0)","v":6505},{"$f":"VLOOKUP(B309,'24-25 Adjusted Formula counts'!$A$3:$L$320,9,FALSE)","v":148},{"$f":"ROUND((H309/$H$5*Assumptions!$C$22*Assumptions!$C$31),0)","v":29322},null,35827,null,null,35827,0,35827,null,0,35827,null,{"$f":"IFERROR(VLOOKUP($A309, 'Allocation 2023-24 Final'!$A$7:$S$323,19,FALSE),0)","v":38575},null,-2748,-7.1237848347375246E-2,207,0,null,"5309810","WHITE SALMON"]
[{"$f":"VLOOKUP(B310,CCDDD!$A$3:$B$319,2,FALSE)","v":"17917"},"5300955","WHY NOT YOU ACADEMY CHARTER",0,0,{"$f":"VLOOKUP(B310,'24-25 Adjusted Formula counts'!$A$3:$L$320,8,FALSE)","v":280.44801240172728},{"$f":"ROUND((F310/$F$5*Assumptions!$C$22*Assumptions!$C$30),0)","v":1508},{"$f":"VLOOKUP(B310,'24-25 Adjusted Formula counts'!$A$3:$L$320,9,FALSE)","v":45.651880511067233},{"$f":"ROUND((H310/$H$5*Assumptions!$C$22*Assumptions!$C$31),0)","v":9045},null,10553,null,null,10553,0,10553,null,0,10553,null,{"$f":"IFERROR(VLOOKUP($A310, 'Allocation 2023-24 Final'!$A$7:$S$323,19,FALSE),0)","v":5527},null,5026,0.90935407997105122,46,0,null,"5300955","WHY NOT YOU ACADEMY CHARTER"]
[{"$f":"VLOOKUP(B311,CCDDD!$A$3:$B$319,2,FALSE)","v":"22200"},"5309840","WILBUR",0,0,{"$f":"VLOOKUP(B311,'24-25 Adjusted Formula counts'!$A$3:$L$320,8,FALSE)","v":226},{"$f":"ROUND((F311/$F$5*Assumptions!$C$22*Assumptions!$C$30),0)","v":1215},{"$f":"VLOOKUP(B311,'24-25 Adjusted Formula counts'!$A$3:$L$320,9,FALSE)","v":33},{"$f":"ROUND((H311/$H$5*Assumptions!$C$22*Assumptions!$C$31),0)","v":6538},null,7753,null,null,7753,0,7753,null,0,7753,null,{"$f":"IFERROR(VLOOKUP($A311, 'Allocation 2023-24 Final'!$A$7:$S$323,19,FALSE),0)","v":7015},null,738,0.1052031361368496,109,0,null,"5309840","WILBUR"]
[{"$f":"VLOOKUP(B312,CCDDD!$A$3:$B$319,2,FALSE)","v":"25160"},"5309870","WILLAPA VALLEY",0,0,{"$f":"VLOOKUP(B312,'24-25 Adjusted Formula counts'!$A$3:$L$320,8,FALSE)","v":327},{"$f":"ROUND((F312/$F$5*Assumptions!$C$22*Assumptions!$C$30),0)","v":1758},{"$f":"VLOOKUP(B312,'24-25 Adjusted Formula counts'!$A$3:$L$320,9,FALSE)","v":34},{"$f":"ROUND((H312/$H$5*Assumptions!$C$22*Assumptions!$C$31),0)","v":6736},null,8494,null,null,8494,0,8494,null,0,8494,null,{"$f":"IFERROR(VLOOKUP($A312, 'Allocation 2023-24 Final'!$A$7:$S$323,19,FALSE),0)","v":11134},null,-2640,-0.23711155020657446,206,0,null,"5309870","WILLAPA VALLEY"]
[{"$f":"VLOOKUP(B313,CCDDD!$A$3:$B$319,2,FALSE)","v":"13167"},"5309900","WILSON CREEK",0,0,{"$f":"VLOOKUP(B313,'24-25 Adjusted Formula counts'!$A$3:$L$320,8,FALSE)","v":112},{"$f":"ROUND((F313/$F$5*Assumptions!$C$22*Assumptions!$C$30),0)","v":602},{"$f":"VLOOKUP(B313,'24-25 Adjusted Formula counts'!$A$3:$L$320,9,FALSE)","v":15},{"$f":"ROUND((H313/$H$5*Assumptions!$C$22*Assumptions!$C$31),0)","v":2972},null,3574,null,null,3574,0,3574,null,0,3574,null,{"$f":"IFERROR(VLOOKUP($A313, 'Allocation 2023-24 Final'!$A$7:$S$323,19,FALSE),0)","v":2944},null,630,0.2139945652173913,110,0,null,"5309900","WILSON CREEK"]
[{"$f":"VLOOKUP(B314,CCDDD!$A$3:$B$319,2,FALSE)","v":"21232"},"5309930","WINLOCK",0,0,{"$f":"VLOOKUP(B314,'24-25 Adjusted Formula counts'!$A$3:$L$320,8,FALSE)","v":810},{"$f":"ROUND((F314/$F$5*Assumptions!$C$22*Assumptions!$C$30),0)","v":4355},{"$f":"VLOOKUP(B314,'24-25 Adjusted Formula counts'!$A$3:$L$320,9,FALSE)","v":102},{"$f":"ROUND((H314/$H$5*Assumptions!$C$22*Assumptions!$C$31),0)","v":20209},null,24564,null,null,24564,0,24564,null,0,24564,null,{"$f":"IFERROR(VLOOKUP($A314, 'Allocation 2023-24 Final'!$A$7:$S$323,19,FALSE),0)","v":27527},null,-2963,-0.10763977186035528,209,0,null,"5309930","WINLOCK"]
[{"$f":"VLOOKUP(B315,CCDDD!$A$3:$B$319,2,FALSE)","v":"14117"},"5309990","WISHKAH VALLEY",0,0,{"$f":"VLOOKUP(B315,'24-25 Adjusted Formula counts'!$A$3:$L$320,8,FALSE)","v":146},{"$f":"ROUND((F315/$F$5*Assumptions!$C$22*Assumptions!$C$30),0)","v":785},{"$f":"VLOOKUP(B315,'24-25 Adjusted Formula counts'!$A$3:$L$320,9,FALSE)","v":21},{"$f":"ROUND((H315/$H$5*Assumptions!$C$22*Assumptions!$C$31),0)","v":4161},null,4946,null,null,4946,0,4946,null,0,4946,null,{"$f":"IFERROR(VLOOKUP($A315, 'Allocation 2023-24 Final'!$A$7:$S$323,19,FALSE),0)","v":4886},null,60,1.2279983626688497E-2,132,0,null,"5309990","WISHKAH VALLEY"]
[{"$f":"VLOOKUP(B316,CCDDD!$A$3:$B$319,2,FALSE)","v":"20094"},"5310020","WISHRAM",0,0,{"$f":"VLOOKUP(B316,'24-25 Adjusted Formula counts'!$A$3:$L$320,8,FALSE)","v":43},{"$f":"ROUND((F316/$F$5*Assumptions!$C$22*Assumptions!$C$30),0)","v":231},{"$f":"VLOOKUP(B316,'24-25 Adjusted Formula counts'!$A$3:$L$320,9,FALSE)","v":16},{"$f":"ROUND((H316/$H$5*Assumptions!$C$22*Assumptions!$C$31),0)","v":3170},null,3401,null,null,3401,0,3401,null,0,3401,null,{"$f":"IFERROR(VLOOKUP($A316, 'Allocation 2023-24 Final'!$A$7:$S$323,19,FALSE),0)","v":3159},null,242,7.6606521050965493E-2,121,0,null,"5310020","WISHRAM"]
[{"$f":"VLOOKUP(B317,CCDDD!$A$3:$B$319,2,FALSE)","v":"08404"},"5310050","WOODLAND",0,0,{"$f":"VLOOKUP(B317,'24-25 Adjusted Formula counts'!$A$3:$L$320,8,FALSE)","v":2649},{"$f":"ROUND((F317/$F$5*Assumptions!$C$22*Assumptions!$C$30),0)","v":14242},{"$f":"VLOOKUP(B317,'24-25 Adjusted Formula counts'!$A$3:$L$320,9,FALSE)","v":239},{"$f":"ROUND((H317/$H$5*Assumptions!$C$22*Assumptions!$C$31),0)","v":47352},null,61594,null,null,61594,0,61594,null,0,61594,null,{"$f":"IFERROR(VLOOKUP($A317, 'Allocation 2023-24 Final'!$A$7:$S$323,19,FALSE),0)","v":64769},null,-3175,-4.9020364680634254E-2,213,0,null,"5310050","WOODLAND"]
[{"$f":"VLOOKUP(B318,CCDDD!$A$3:$B$319,2,FALSE)","v":"39007"},"5310110","YAKIMA",0,0,{"$f":"VLOOKUP(B318,'24-25 Adjusted Formula counts'!$A$3:$L$320,8,FALSE)","v":16521},{"$f":"ROUND((F318/$F$5*Assumptions!$C$22*Assumptions!$C$30),0)","v":88824},{"$f":"VLOOKUP(B318,'24-25 Adjusted Formula counts'!$A$3:$L$320,9,FALSE)","v":4230},{"$f":"ROUND((H318/$H$5*Assumptions!$C$22*Assumptions!$C$31),0)","v":838066},null,926890,null,null,926890,0,926890,null,0,926890,null,{"$f":"IFERROR(VLOOKUP($A318, 'Allocation 2023-24 Final'!$A$7:$S$323,19,FALSE),0)","v":776374},null,150516,0.1938704799490967,2,0,null,"5310110","YAKIMA"]
[{"$f":"VLOOKUP(B319,CCDDD!$A$3:$B$319,2,FALSE)","v":"34002"},"5310140","YELM",0,0,{"$f":"VLOOKUP(B319,'24-25 Adjusted Formula counts'!$A$3:$L$320,8,FALSE)","v":6528},{"$f":"ROUND((F319/$F$5*Assumptions!$C$22*Assumptions!$C$30),0)","v":35097},{"$f":"VLOOKUP(B319,'24-25 Adjusted Formula counts'!$A$3:$L$320,9,FALSE)","v":575},{"$f":"ROUND((H319/$H$5*Assumptions!$C$22*Assumptions!$C$31),0)","v":113922},null,149019,null,null,149019,0,149019,null,0,149019,null,{"$f":"IFERROR(VLOOKUP($A319, 'Allocation 2023-24 Final'!$A$7:$S$323,19,FALSE),0)","v":175183},null,-26164,-0.14935239149917515,298,0,null,"5310140","YELM"]
[{"$f":"VLOOKUP(B320,CCDDD!$A$3:$B$319,2,FALSE)","v":"39205"},"5310170","ZILLAH",0,0,{"$f":"VLOOKUP(B320,'24-25 Adjusted Formula counts'!$A$3:$L$320,8,FALSE)","v":1203},{"$f":"ROUND((F320/$F$5*Assumptions!$C$22*Assumptions!$C$30),0)","v":6468},{"$f":"VLOOKUP(B320,'24-25 Adjusted Formula counts'!$A$3:$L$320,9,FALSE)","v":136},{"$f":"ROUND((H320/$H$5*Assumptions!$C$22*Assumptions!$C$31),0)","v":26945},null,33413,null,null,33413,0,33413,null,0,33413,null,{"$f":"IFERROR(VLOOKUP($A320, 'Allocation 2023-24 Final'!$A$7:$S$323,19,FALSE),0)","v":37542},null,-4129,-0.1099834851632838,225,0,null,"5310170","ZILLAH"]
[{"$f":"VLOOKUP(B321,CCDDD!$A$3:$B$319,2,FALSE)","v":"17919"},"5307790","IMPACRT RENTON CHARTER",0,0,{"$f":"VLOOKUP(B321,'24-25 Adjusted Formula counts'!$A$3:$L$320,8,FALSE)","v":302.51690659524684},{"$f":"ROUND((F321/$F$5*Assumptions!$C$22*Assumptions!$C$30),0)","v":1626},{"$f":"VLOOKUP(B321,'24-25 Adjusted Formula counts'!$A$3:$L$320,9,FALSE)","v":45.320585599043945},{"$f":"ROUND((H321/$H$5*Assumptions!$C$22*Assumptions!$C$31),0)","v":8979},null,10605,null,null,10605,0,10605,null,0,10605,null,{"$f":"IFERROR(VLOOKUP($A321, 'Allocation 2023-24 Final'!$A$7:$S$323,19,FALSE),0)","v":6999},null,3606,0.51521645949421346,55,0]
[{"$f":"VLOOKUP(B322,CCDDD!$A$3:$B$319,2,FALSE)","v":"06901"},"5307795","ROOTED CARTER",null,0,{"$f":"VLOOKUP(B322,'24-25 Adjusted Formula counts'!$A$3:$L$320,8,FALSE)","v":71.570513398899337},{"$f":"ROUND((F322/$F$5*Assumptions!$C$22*Assumptions!$C$30),0)","v":385},{"$f":"VLOOKUP(B322,'24-25 Adjusted Formula counts'!$A$3:$L$320,9,FALSE)","v":9.3459776238678725},{"$f":"ROUND((H322/$H$5*Assumptions!$C$22*Assumptions!$C$31),0)","v":1852},null,2237,null,null,2237,0,2237,null,0,2237,null,{"$f":"IFERROR(VLOOKUP($A322, 'Allocation 2023-24 Final'!$A$7:$S$323,19,FALSE),0)","v":1739},null,498,0.28637147786083955,113,0]

{"sheet":"24-25 Adjusted Formula counts","index":2,"n_rows":319,"n_cols":12,"rows_kept":319,"cut":false,"hidden":true,"merged":[]}
["Source: S:\\Apportionment_NEW\\Federal Funding & Allocations\\Federal progran allocation\\24-25\\Title I-A prelim\\Title IA 24-25-preliminary.xlsx, initial adjusted formula counts"]
["LEAID","LEANAME","SendingLEAid","NEG. adj","Adj DEL.","Adj Foster","Adj TANF","Adj - 5-17 pop","Adj poverty","Adj Total formula count","Total Formula Count DOE","Adj poverty percentage"]
["5300030","Aberdeen School District",null,0,null,25,0,3494,804,829,829,0.237263880938752]
["5300060","Adna School District",null,0,null,1,0,737,38,39,39,5.2917232021709601E-2]
["5300090","Almira School District",null,0,null,0,0,98,6,6,6,6.1224489795918401E-2]
["5300150","Anacortes School District",null,0,null,7,0,2828,255,262,262,9.2644978783592596E-2]
["5300240","Arlington School District",null,0,null,21,0,5915,554,575,575,9.7210481825866404E-2]
["5300280","Asotin-Anatone School District",null,0,null,0,0,493,48,48,48,9.7363083164300201E-2]
["5300300","Auburn School District",null,0,null,51,0,18293,2918,2969,2969,0.16230252008965201]
["5300330","Bainbridge Island School District",null,0,null,1,0,3975,141,142,142,3.57232704402516E-2]
["5300380","Battle Ground School District",null,0,null,30,0,15822,788,818,818,5.1700164328150701E-2]
["5300390","Bellevue School District",null,0,null,12,0,22393,1339,1351,1351,6.0331353547983801E-2]
["5300420","Bellingham","5300420",0,null,35,0,12465.098684210523,1329.0142430507692,1364.0142430507692,1372,0.109426670225929]
["5300450","Benge School District",null,0,null,0,0,16,1,1,1,6.25E-2]
["5300480","Bethel School District",null,0,null,91,0,24134,2228,2319,2319,9.6088505842380004E-2]
["5300510","Bickleton School District",null,0,null,0,0,78,12,12,12,0.15384615384615399]
["5300570","Blaine School District",null,0,null,4,0,2473,265,269,269,0.10877476748888]
["5300630","Boistfort School District",null,0,null,2,0,215,28,30,30,0.13953488372093001]
["5300660","Bremerton","5300660",0,null,25,0,4867.243829018661,923.91679104477635,948.91679104477635,1052,0.19495978101349801]
["5300690","Brewster School District",null,0,null,12,0,968,178,190,190,0.19628099173553701]
["5300720","Bridgeport School District",null,0,null,0,0,677,163,163,163,0.24076809453471201]
["5300750","Brinnon School District",null,0,null,0,0,116,27,27,27,0.232758620689655]
["5300780","Burlington-Edison School District",null,0,null,10,0,3721,390,400,400,0.107497984412792]
["5300810","Camas School District",null,0,null,8,0,7408,246,254,254,3.4287257019438397E-2]
["5300840","Cape Flattery School District",null,0,null,3,0,550,112,115,115,0.20909090909090899]
["5300870","Carbonado School District",null,0,null,0,0,208,7,7,7,3.3653846153846201E-2]
["5300950","Cascade School District",null,0,null,1,0,1554,176,177,177,0.11389961389961401]
["5300960","Cashmere School District",null,0,null,8,0,1496,161,169,169,0.112967914438503]
["5300990","Castle Rock School District",null,0,null,2,0,1636,181,183,183,0.111858190709046]
["5301000","Catalyst Public Schools","5300660",0,0,0,0,610.77824603652425,85.072388059701495,85.072388059701495,0,0.13928522931482101]
["5301050","Centerville School District",null,0,null,0,0,93,27,27,27,0.29032258064516098]
["5301080","Central Kitsap School District",null,0,null,33,0,11148,853,886,886,7.9476139217796907E-2]
["5301110","Central Valley School District",null,0,null,78,0,17019,1806,1884,1884,0.110699806099066]
["5301140","Centralia School District",null,0,null,19,0,4274,748,767,767,0.17945718296677601]
["5301170","Chehalis School District",null,0,null,15,0,2864,249,264,264,9.2178770949720698E-2]
["5301230","Cheney School District",null,0,null,24,0,6241,860,884,884,0.141643967312931]
["5301260","Chewelah School District",null,0,null,1,0,938,160,161,161,0.171641791044776]
["5301290","Chimacum School District",null,0,null,5,0,1152,170,175,175,0.15190972222222199]
["5301320","Clarkston School District",null,0,null,12,0,2795,584,596,596,0.21323792486583201]
["5301350","Cle Elum-Roslyn School District",null,0,null,7,0,1062,148,155,155,0.145951035781544]
["5301410","Clover Park School District",null,0,null,36,0,13680,1961,1997,1997,0.14597953216374299]
["5301440","Colfax School District",null,0,null,0,0,597,45,45,45,7.5376884422110602E-2]
["5301470","College Place School District",null,0,null,6,0,2035,208,214,214,0.10515970515970501]
["5301500","Colton School District",null,0,null,0,0,240,17,17,17,7.0833333333333304E-2]
["5301560","Columbia (Stevens) School District",null,0,null,0,0,205,42,42,42,0.20487804878048799]
["5301590","Columbia (Walla Walla) School District",null,0,null,4,0,756,98,102,102,0.134920634920635]
["5301630","Colville School District",null,0,null,5,0,1998,318,323,323,0.16166166166166199]
["5301660","Concrete School District",null,0,null,0,0,716,140,140,140,0.19553072625698301]
["5301680","Conway School District",null,0,null,1,0,542,58,59,59,0.10885608856088599]
["5301710","Cosmopolis School District",null,0,null,2,0,315,48,50,50,0.158730158730159]
["5303440","Coulee-Hartline School District",null,0,null,0,0,247,40,40,40,0.16194331983805699]
["5301800","Coupeville School District",null,0,null,1,0,1094,95,96,96,8.7751371115173699E-2]
["5301830","Crescent School District",null,0,null,9,0,345,62,71,71,0.20579710144927499]
["5301860","Creston School District",null,0,null,0,0,114,13,13,13,0.114035087719298]
["5301890","Curlew School District",null,0,null,0,0,158,41,41,41,0.259493670886076]
["5301920","Cusick School District",null,0,null,5,0,316,70,75,75,0.237341772151899]
["5301950","Damman School District",null,0,null,0,0,111,2,2,2,1.8018018018018001E-2]
["5301980","Darrington School District",null,0,null,4,0,504,61,65,65,0.12896825396825401]
["5302010","Davenport School District",null,0,null,1,0,588,80,81,81,0.13775510204081601]
["5302040","Dayton School District",null,0,null,4,0,505,72,76,76,0.15049504950494999]
["5302070","Deer Park School District",null,0,null,12,0,2369,329,341,341,0.143942591810891]
["5302130","Dieringer School District",null,0,null,5,0,2275,87,92,92,4.0439560439560401E-2]
["5302160","Dixie School District",null,0,null,0,0,74,2,2,2,2.7027027027027001E-2]
["5302280","East Valley School District (Spokane)",null,0,null,54,0,4679,772,826,826,0.17653344731780299]
["5305370","East Valley School District (Yakima)",null,0,null,6,0,3556,411,417,417,0.11726659167604001]
["5302310","Eastmont School District",null,0,null,13,0,6325,597,610,610,9.6442687747035599E-2]
["5302340","Easton School District",null,0,null,0,0,150,7,7,7,4.6666666666666697E-2]
["5302370","Eatonville School District",null,0,null,7,0,2204,180,187,187,8.4845735027223201E-2]
["5302400","Edmonds School District",null,0,null,23,0,24249,2088,2111,2111,8.7055136294280203E-2]
["5302460","Ellensburg School District",null,0,null,21,0,3543,377,398,398,0.112334180073384]
["5302490","Elma School District",null,0,null,8,0,1588,325,333,333,0.20969773299748101]
["5302520","Endicott School District",null,0,null,0,0,87,17,17,17,0.195402298850575]
["5302550","Entiat School District",null,0,null,6,0,406,66,72,72,0.17733990147783299]
["5300001","Enumclaw School District",null,0,null,15,0,4662,282,297,297,6.3706563706563704E-2]
["5302610","Ephrata School District",null,0,null,11,0,2905,461,472,472,0.16247848537005199]
["5302640","Evaline School District",null,0,null,0,0,128,22,22,22,0.171875]
["5302670","Everett School District",null,0,null,36,0,22803,2315,2351,2351,0.103100469236504]
["5302700","Evergreen School District (Clark)",null,0,null,58,0,26645,2599,2657,2657,9.9718521298555102E-2]
["5302730","Evergreen School District (Stevens)",null,0,null,0,0,56,14,14,14,0.25]
["5302820","Federal Way School District",null,0,null,58,0,24062,4207,4265,4265,0.17725043637270399]
["5302850","Ferndale School District",null,0,null,21,0,6171,768,789,789,0.127856101118133]
["5302880","Fife Public Schools",null,0,null,4,0,4064,357,361,361,8.8828740157480296E-2]
["5302910","Finley School District",null,0,null,10,0,905,118,128,128,0.141436464088398]
["5302940","Franklin Pierce School District",null,0,null,43,0,9266,1208,1251,1251,0.135009712928988]
["5302970","Freeman School District",null,0,null,1,0,994,49,50,50,5.0301810865191199E-2]
["5303000","Garfield School District",null,0,null,0,0,127,35,35,35,0.27559055118110198]
["5303030","Glenwood School District",null,0,null,0,0,60,13,13,13,0.21666666666666701]
["5303090","Goldendale School District",null,0,null,9,0,1055,216,225,225,0.21327014218009499]
["5303130","Grand Coulee Dam School District",null,0,null,5,0,679,101,106,106,0.15611192930780601]
["5303150","Grandview School District",null,0,null,10,0,3732,651,661,661,0.17711682743837101]
["5303180","Granger School District",null,0,null,4,0,1587,368,372,372,0.23440453686200399]
["5303210","Granite Falls School District",null,0,null,6,0,2798,214,220,220,7.8627591136526107E-2]
["5303240","Grapeview School District",null,0,null,2,0,338,26,28,28,8.2840236686390595E-2]
["5303270","Great Northern School District",null,0,null,0,0,187,43,43,43,0.22994652406417099]
["5303300","Green Mountain School District",null,0,null,0,0,205,16,16,16,7.8048780487804906E-2]
["5303330","Griffin School District",null,0,null,5,0,897,42,47,47,5.2396878483835001E-2]
["5303360","Harrington School District",null,0,null,0,0,145,12,12,12,8.2758620689655199E-2]
["5303510","Highland School District",null,0,null,2,0,1272,234,236,236,0.18553459119496901]
["5303540","Highline","5303540",0,null,46,0,19449.959971210283,2972.0757603023208,3018.0757603023208,3121,0.155171309594964]
["5303570","Hockinson School District",null,0,null,5,0,2170,92,97,97,4.4700460829493097E-2]
["5303600","Hood Canal School District",null,0,null,3,0,695,114,117,117,0.168345323741007]
["5303660","Hoquiam School District",null,0,null,12,0,1816,484,496,496,0.27312775330396499]
["5303700","Impact Puget Sound (Public Schools)","5308130",0,0,0,0,398.57498616491523,72.405616224648881,72.405616224648881,0,0.181661214923031]
["5307790","Impact Renton","5307230",0,0,0,0,302.51690659524684,45.320585599043945,45.320585599043945,0,0.14981174476863399]
["5303710","Impact Salish Sea","5308130",0,0,0,0,342.69230769230654,51.875975039001581,51.875975039001581,0,0.15137770493984801]
["5303705","Impact Tacoma (Commencement Bay)","5308700",0,0,0,0,366.61711134827408,55.139916656143292,55.139916656143292,0,0.150401917830186]
["5300002","Inchelium School District",null,0,null,1,0,189,44,45,45,0.238095238095238]
["5303720","Index School District",null,0,null,0,0,54,9,9,9,0.16666666666666699]
["5303750","Issaquah School District",null,0,null,9,0,22715,847,856,856,3.7684349548756303E-2]
["5303780","Kahlotus School District",null,0,null,0,0,60,22,22,22,0.36666666666666697]
["5303810","Kalama School District",null,0,null,4,0,1354,111,115,115,8.4933530280649899E-2]
["5303870","Keller School District",null,0,null,1,0,103,31,32,32,0.31067961165048502]
["5300003","Kelso School District",null,0,null,37,0,5470,899,936,936,0.17111517367458901]
["5303930","Kennewick School District",null,0,null,70,0,20412,2775,2845,2845,0.13937879678620399]
["5303960","Kent School District",null,0,null,52,0,29989,4261,4313,4313,0.14381940044683]
["5303990","Kettle Falls School District",null,0,null,4,0,936,144,148,148,0.158119658119658]
["5304020","Kiona-Benton City School District",null,0,null,8,0,1729,241,249,249,0.14401388085598599]
["5304050","Kittitas School District",null,0,null,0,0,736,57,57,57,7.7445652173912999E-2]
["5304080","Klickitat School District",null,0,null,4,0,80,13,17,17,0.21249999999999999]
["5304170","La Center School District",null,0,null,16,0,1926,98,114,114,5.9190031152648002E-2]
["5304110","La Conner School District",null,0,null,3,0,595,91,94,94,0.157983193277311]
["5304150","LaCrosse School District",null,0,null,0,0,87,18,18,18,0.20689655172413801]
["5301200","Lake Chelan School District",null,0,null,1,0,1236,163,164,164,0.13268608414239499]
["5307050","Lake Quinault School District",null,0,null,0,0,174,40,40,40,0.229885057471264]
["5304200","Lake Stevens School District",null,0,null,15,0,10259,567,582,582,5.6730675504435099E-2]
["5304230","Lake Washington School District",null,0,null,23,0,35606,1390,1413,1413,3.9684322866932499E-2]
["5304260","Lakewood School District",null,0,null,12,0,2643,351,363,363,0.13734392735527801]
["5304290","Lamont School District",null,0,null,0,0,27,9,9,9,0.33333333333333298]
["5304380","Liberty School District",null,0,null,1,0,827,77,78,78,9.4316807738814998E-2]
["5304410","Lind School District",null,0,null,1,0,307,81,82,82,0.26710097719869702]
["5304470","Longview Public Schools",null,0,null,28,0,7214,1316,1344,1344,0.18630440809536999]
["5304500","Loon Lake School District",null,0,null,9,0,255,50,59,59,0.23137254901960799]
["5304530","Lopez School District",null,0,null,0,0,286,47,47,47,0.16433566433566399]
["5304550","Lumen High School","5308250",0,0,0,0,35.79770402289406,8.7334849409284985,8.7334849409284985,0,0.243967739812114]
["5304590","Lyle School District",null,0,null,0,0,410,72,72,72,0.17560975609756099]
["5304620","Lynden School District",null,0,null,5,0,4352,303,308,308,7.0772058823529396E-2]
["5304650","Mabton School District",null,0,null,0,0,770,191,191,191,0.248051948051948]
["5304710","Mansfield School District",null,0,null,0,0,85,16,16,16,0.188235294117647]
["5304740","Manson School District",null,0,null,2,0,609,120,122,122,0.20032840722495901]
["5304800","Mary M. Knight School District",null,0,null,0,0,206,33,33,33,0.16019417475728201]
["5304830","Mary Walker School District",null,0,null,8,0,640,146,154,154,0.24062500000000001]
["5304860","Marysville School District",null,0,null,26,0,12544,1469,1495,1495,0.119180484693878]
["5304890","McCleary School District",null,0,null,2,0,572,72,74,74,0.12937062937062899]
["5304920","Mead School District",null,0,null,31,0,12016,1000,1031,1031,8.5802263648468699E-2]
["5304950","Medical Lake School District",null,0,null,3,0,1801,208,211,211,0.117157134925042]
["5304980","Mercer Island School District",null,0,null,0,0,4878,118,118,118,2.4190241902418998E-2]
["5305010","Meridian School District",null,0,null,1,0,1705,204,205,205,0.120234604105572]
["5305020","Methow Valley School District",null,0,null,0,0,859,70,70,70,8.1490104772991803E-2]
["5305040","Mill A School District",null,0,null,0,0,74,18,18,18,0.24324324324324301]
["5305130","Monroe School District",null,0,null,10,0,6648,430,440,440,6.6185318892900094E-2]
["5305160","Montesano School District",null,0,null,7,0,1334,206,213,213,0.15967016491754099]
["5305190","Morton School District",null,0,null,0,0,333,44,44,44,0.13213213213213201]
["5305220","Moses Lake School District",null,0,null,37,0,9756,1341,1378,1378,0.141246412464125]
["5305250","Mossyrock School District",null,0,null,2,0,699,124,126,126,0.18025751072961399]
["5305280","Mount Adams School District",null,0,null,14,0,998,259,273,273,0.27354709418837703]
["5305310","Mount Baker School District",null,0,null,8,0,2435,278,286,286,0.11745379876796699]
["5305340","Mount Pleasant School District",null,0,null,0,0,41,3,3,3,7.3170731707317097E-2]
["5305400","Mount Vernon School District",null,0,null,7,0,6839,917,924,924,0.13510747185260999]
["5305430","Mukilteo School District",null,0,null,19,0,16936,2310,2329,2329,0.13751771374586699]
["5305460","Naches Valley School District",null,0,null,5,0,1613,218,223,223,0.138251704897706]
["5305490","Napavine School District",null,0,null,1,0,774,65,66,66,8.5271317829457405E-2]
["5305520","Naselle-Grays River Valley School District",null,0,null,0,0,340,35,35,35,0.10294117647058799]
["5305550","Nespelem School District",null,0,null,2,0,253,68,70,70,0.27667984189723299]
["5305610","Newport School District",null,0,null,4,0,1399,268,272,272,0.19442458899213699]
["5305640","Nine Mile Falls School District",null,0,null,3,0,1563,104,107,107,6.8458093410108806E-2]
["5305670","Nooksack Valley School District",null,0,null,8,0,2210,200,208,208,9.41176470588235E-2]
["5305700","North Beach School District",null,0,null,9,0,703,157,166,166,0.23613086770981501]
["5305730","North Franklin School District",null,0,null,0,0,2211,414,414,414,0.187245590230665]
["5305760","North Kitsap School District",null,0,null,29,0,7166,548,577,577,8.0519118057493705E-2]
["5305790","North Mason School District",null,0,null,8,0,2444,339,347,347,0.14198036006546599]
["5305820","North River School District",null,0,null,0,0,52,7,7,7,0.134615384615385]
["5305850","North Thurston Public Schools",null,0,null,37,0,17009,1459,1496,1496,8.7953436416014996E-2]
["5305880","Northport School District",null,0,null,3,0,225,70,73,73,0.32444444444444398]
["5305910","Northshore School District",null,0,null,17,0,26236,974,991,991,3.7772526299740802E-2]
["5305940","Oak Harbor School District",null,0,null,6,0,6006,409,415,415,6.9097569097569103E-2]
["5305970","Oakesdale School District",null,0,null,0,0,126,17,17,17,0.134920634920635]
["5306000","Oakville School District",null,0,null,6,0,450,108,114,114,0.25333333333333302]
["5306060","Ocean Beach School District",null,0,null,2,0,1047,189,191,191,0.182425978987584]
["5306090","Ocosta School District",null,0,null,4,0,660,195,199,199,0.30151515151515201]
["5306120","Odessa School District",null,0,null,1,0,310,32,33,33,0.106451612903226]
["5306150","Okanogan School District",null,0,null,5,0,980,172,177,177,0.18061224489795899]
["5306180","Olympia School District",null,0,null,31,0,10394,1070,1101,1101,0.105926496055417]
["5306220","Omak School District",null,0,null,8,0,1930,371,379,379,0.196373056994819]
["5306240","Onalaska School District",null,0,null,4,0,933,127,131,131,0.14040728831725599]
["5306270","Onion Creek School District",null,0,null,0,0,62,19,19,19,0.30645161290322598]
["5306300","Orcas Island School District",null,0,null,0,0,587,79,79,79,0.13458262350937]
["5306330","Orchard Prairie School District",null,0,null,2,0,177,22,24,24,0.13559322033898299]
["5306360","Orient School District",null,0,null,0,0,128,36,36,36,0.28125]
["5306390","Orondo School District",null,0,null,0,0,261,34,34,34,0.13026819923371599]
["5306420","Oroville School District",null,0,null,7,0,710,178,185,185,0.26056338028169002]
["5306450","Orting School District",null,0,null,9,0,3249,168,177,177,5.4478301015697103E-2]
["5306480","Othello School District",null,0,null,15,0,4618,735,750,750,0.16240796881767]
["5306510","Palisades School District",null,0,null,0,0,46,10,10,10,0.217391304347826]
["5306540","Palouse School District",null,0,null,0,0,237,11,11,11,4.6413502109704602E-2]
["5399999","PART D SUBPART 2",null,0,720,0,0,720,0,720,720,1]
["5306570","Pasco School District",null,0,null,42,0,20405,2379,2421,2421,0.11864739034550401]
["5306600","Pateros School District",null,0,null,6,0,294,33,39,39,0.13265306122449]
["5306630","Paterson School District",null,0,null,0,0,87,7,7,7,8.04597701149425E-2]
["5306660","Pe Ell School District",null,0,null,0,0,249,30,30,30,0.120481927710843]
["5306690","Peninsula School District",null,0,null,17,0,11683,517,534,534,4.5707438158007402E-2]
["5306770","Pinnacles Prep Wenatchee","5309660",0,0,0,0,282.1539611360239,27.587345254470446,27.587345254470446,0,9.7774084557936902E-2]
["5306750","Pioneer School District",null,0,null,7,0,1491,179,186,186,0.124748490945674]
["5306780","Pomeroy School District",null,0,null,0,0,377,65,65,65,0.17241379310344801]
["5306820","Port Angeles School District",null,0,null,37,0,4288,566,603,603,0.140625]
["5306840","Port Townsend School District",null,0,null,8,0,1344,178,186,186,0.13839285714285701]
["5306870","Prescott School District",null,0,null,3,0,345,46,49,49,0.14202898550724599]
["5306890","PRIDE Prep","5308250",0,0,0,0,517.33456136311304,63.82162072216979,63.82162072216979,0,0.123366242058152]
["5306900","Prosser School District",null,0,null,11,0,2901,331,342,342,0.11789038262668]
["5306930","Pullman","5306930",0,null,9,0,3075.7453130527056,306.03564356435623,315.03564356435623,333,0.10242579001174899]
["5306940","Pullman Community Montessori","5306930",0,0,0,0,160.25468694729383,17.964356435643548,17.964356435643548,0,0.11209878960701999]
["5306960","Puyallup School District",null,0,null,51,0,25544,1798,1849,1849,7.2384904478546799E-2]
["5301380","Queets-Clearwater School District",null,0,null,0,0,32,11,11,11,0.34375]
["5306990","Quilcene School District",null,0,null,0,0,199,29,29,29,0.14572864321608001]
["5307020","Quillayute Valley School District",null,0,null,11,0,1172,264,275,275,0.23464163822525599]
["5307080","Quincy School District",null,0,null,16,0,3136,461,477,477,0.152104591836735]
["5307120","Rainier Prep","5303540",0,0,0,0,370.59201638799743,57.27235918661134,57.27235918661134,0,0.154542884503613]
["5307110","Rainier School District",null,0,null,6,0,1025,103,109,109,0.106341463414634]
["5303280","Rainier Valley Leadership Academy (Green Dot: RV)","5307710",0,0,0,0,308.06056000467635,76.240890860995222,76.240890860995222,0,0.24748669826425601]
["5307140","Raymond School District",null,0,null,7,0,629,106,113,113,0.17965023847376799]
["5307210","Reardan-Edwall School District",null,0,null,2,0,994,124,126,126,0.12676056338028199]
["5307230","Renton","5307230",0,null,49,0,17415.483093404746,2218.6794144009573,2267.6794144009573,2313,0.13021053749922801]
["5307260","Republic School District",null,0,null,0,0,359,89,89,89,0.247910863509749]
["5307320","Richland School District",null,0,null,30,0,15487,1312,1342,1342,8.6653322141150596E-2]
["5307350","Ridgefield School District",null,0,null,18,0,4134,160,178,178,4.3057571359458202E-2]
["5307380","Ritzville School District",null,0,null,2,0,421,58,60,60,0.142517814726841]
["5307440","Riverside School District",null,0,null,22,0,2040,247,269,269,0.131862745098039]
["5304560","Riverview School District",null,0,null,3,0,3807,130,133,133,3.4935644864722899E-2]
["5307470","Rochester School District",null,0,null,15,0,2477,244,259,259,0.104561970125151]
["5307530","Roosevelt School District",null,0,null,0,0,42,5,5,5,0.119047619047619]
["5307795","Rooted","5309270",0,0,0,0,71.570513398899337,9.3459776238678725,9.3459776238678725,0,0.13058419145015701]
["5307560","Rosalia School District",null,0,null,0,0,237,33,33,33,0.139240506329114]
["5307620","Royal School District",null,0,null,3,0,1645,261,264,264,0.16048632218844999]
["5307650","San Juan Island School District",null,0,null,0,0,890,79,79,79,8.8764044943820203E-2]
["5307680","Satsop School District",null,0,null,0,0,110,18,18,18,0.163636363636364]
["5307700","School for the Deaf","5309270",0,0,0,0,135.31300189479373,21.904635055940339,21.904635055940339,0,0.161881229070443]
["5307690","School of the Blind","5309270",0,0,0,0,60.387620680321298,3.7968034096963308,3.7968034096963308,0,6.2873869957482995E-2]
["5307710","Seattle","5307710",0,null,104,0,67992.208335769014,5686.2577011690419,5790.2577011690419,6021,8.5160606529718103E-2]
["5307740","Sedro-Woolley School District",null,0,null,14,0,5146,607,621,621,0.1206762534007]
["5307770","Selah School District",null,0,null,18,0,4177,459,477,477,0.11419679195594901]
["5307800","Selkirk School District",null,0,null,0,0,312,86,86,86,0.27564102564102599]
["5307830","Sequim School District",null,0,null,3,0,3152,420,423,423,0.13420050761421301]
["5307860","Shaw Island School District",null,0,null,0,0,22,1,1,1,4.5454545454545497E-2]
["5307900","Shelton School District",null,0,null,33,0,4122,663,696,696,0.168850072780204]
["5307920","Shoreline School District",null,0,null,9,0,10315,608,617,617,5.9815802229762502E-2]
["5307950","Skamania School District",null,0,null,0,0,127,13,13,13,0.102362204724409]
["5307980","Skykomish School District",null,0,null,0,0,68,6,6,6,8.8235294117647106E-2]
["5308020","Snohomish School District",null,0,null,21,0,10714,542,563,563,5.2548067948478598E-2]
["5308040","Snoqualmie Valley School District",null,0,null,13,0,7736,263,276,276,3.5677352637021702E-2]
["5308070","Soap Lake School District",null,0,null,2,0,609,156,158,158,0.25944170771757002]
["5308100","South Bend School District",null,0,null,4,0,384,92,96,96,0.25]
["5308160","South Kitsap School District",null,0,null,40,0,11672,1121,1161,1161,9.9468814256339994E-2]
["5308190","South Whidbey School District",null,0,null,6,0,1757,119,125,125,7.1143995446784306E-2]
["5308220","Southside School District",null,0,null,2,0,352,56,58,58,0.16477272727272699]
["5308250","Spokane","5308250",0,null,164,0,33580.555902766355,5851.4349104221001,6015.4349104221001,6220,0.17913446483256601]
["5308260","Spokane International","5308250",0,0,0,0,972.3118318476354,132.00998391480414,132.00998391480414,0,0.13576918390878001]
["5308280","Sprague School District",null,0,null,1,0,129,22,23,23,0.178294573643411]
["5308310","St. John School District",null,0,null,5,0,155,18,23,23,0.14838709677419401]
["5308340","Stanwood-Camano School District",null,0,null,6,0,5413,399,405,405,7.4819878071309798E-2]
["5308370","Star School District",null,0,null,0,0,25,4,4,4,0.16]
["5308400","Starbuck School District",null,0,null,1,0,15,15,16,16,1.06666666666667]
["5308430","Stehekin School District",null,0,null,0,0,15,3,3,3,0.2]
["5308460","Steilacoom Historical School District",null,0,null,23,0,3953,255,278,278,7.0326334429547194E-2]
["5308490","Steptoe School District",null,0,null,0,0,51,2,2,2,3.9215686274509803E-2]
["5308520","Stevenson-Carson School District",null,0,null,14,0,920,125,139,139,0.15108695652173901]
["5308550","Sultan School District",null,0,null,12,0,2497,212,224,224,8.9707649179014803E-2]
["5308580","Summit Valley School District",null,0,null,0,0,114,22,22,22,0.19298245614035101]
["5308290","Summit: Atlas","5307710",0,0,0,0,741.77740106389422,111.58435020052876,111.58435020052876,0,0.15042834958370099]
["5308230","Summit: Olympus","5308700",0,0,0,0,175.64614016364291,23.088142442227554,23.088142442227554,0,0.13144691036601899]
["5308240","Summit: Sierra","5307710",0,0,0,0,299.95370316244794,42.917057769434265,42.917057769434265,0,0.143078939572856]
["5308610","Sumner School District",null,0,null,39,0,10613,524,563,563,5.3048148497126198E-2]
["5308670","Sunnyside School District",null,0,null,17,0,6200,1182,1199,1199,0.193387096774194]
["5308690","Suquamish","5300660",0,0,0,0,85.977924944812486,18.010820895522368,18.010820895522368,0,0.20948192116852299]
["5308700","Tacoma","5308700",0,null,113,0,32594.736748488082,4223.7719409016281,4336.7719409016281,4415,0.13305129519424]
["5308730","Taholah School District",null,0,null,0,0,346,87,87,87,0.25144508670520199]
["5308760","Tahoma School District",null,0,null,4,0,9053,378,382,382,4.2195957141279099E-2]
["5308790","Tekoa School District",null,0,null,0,0,163,28,28,28,0.17177914110429399]
["5308820","Tenino School District",null,0,null,2,0,1509,191,193,193,0.12789927104042401]
["5308850","Thorp School District",null,0,null,1,0,205,24,25,25,0.12195121951219499]
["5308910","Toledo School District",null,0,null,3,0,852,87,90,90,0.105633802816901]
["5308940","Tonasket School District",null,0,null,2,0,1130,281,283,283,0.25044247787610602]
["5308970","Toppenish School District",null,0,null,15,0,3470,710,725,725,0.208933717579251]
["5309000","Touchet School District",null,0,null,0,0,218,28,28,28,0.12844036697247699]
["5309030","Toutle Lake School District",null,0,null,1,0,768,75,76,76,9.8958333333333301E-2]
["5309060","Trout Lake School District",null,0,null,1,0,198,33,34,34,0.17171717171717199]
["5308130","Tukwila","5308130",0,null,6,0,2228.7327061427782,441.71840873634949,447.71840873634949,572,0.20088474831565001]
["5309100","Tumwater School District",null,0,null,22,0,6868,644,666,666,9.6971461852067606E-2]
["5309150","Union Gap School District",null,0,null,0,0,810,202,202,202,0.249382716049383]
["5309180","University Place School District",null,0,null,10,0,5685,457,467,467,8.2145998240984994E-2]
["5309240","Valley School District",null,0,null,1,0,288,66,67,67,0.23263888888888901]
["5309270","Vancouver","5309270",0,null,106,0,24520.728864025979,2705.9525839104963,2811.9525839104963,2847,0.11467654976748599]
["5309300","Vashon Island School District",null,0,null,0,0,1410,117,117,117,8.29787234042553E-2]
["5309330","Wahkiakum School District",null,0,null,2,0,495,109,111,111,0.22424242424242399]
["5309360","Wahluke School District",null,0,null,1,0,2012,351,352,352,0.17495029821073599]
["5309390","Waitsburg School District",null,0,null,0,0,274,28,28,28,0.102189781021898]
["5309450","Walla Walla Public Schools",null,0,null,22,0,5918,796,818,818,0.138222372423116]
["5309480","Wapato School District",null,0,null,25,0,3490,828,853,853,0.24441260744985699]
["5309510","Warden School District",null,0,null,4,0,865,175,179,179,0.20693641618497099]
["5309540","Washougal School District",null,0,null,8,0,3739,266,274,274,7.32816261032362E-2]
["5309570","Washtucna School District",null,0,null,0,0,67,7,7,7,0.104477611940298]
["5309600","Waterville School District",null,0,null,0,0,328,42,42,42,0.12804878048780499]
["5309630","Wellpinit School District",null,0,null,12,0,315,63,75,75,0.238095238095238]
["5309660","Wenatchee","5309660",0,null,42,0,7924.8460388639733,844.41265474552949,886.41265474552949,914,0.111852350241065]
["5309690","West Valley School District (Spokane)",null,0,null,34,0,3207,396,430,430,0.134081696289367]
["5309720","West Valley School District (Yakima)",null,0,null,28,0,6288,713,741,741,0.11784351145038199]
["5309740","Whatcom Intergenerational","5300420",0,0,0,0,74.901315789473657,7.9857569492304208,7.9857569492304208,0,0.106617044908478]
["5309750","White Pass School District",null,0,null,3,0,468,60,63,63,0.134615384615385]
["5309780","White River School District",null,0,null,3,0,4695,226,229,229,4.87752928647497E-2]
["5309810","White Salmon Valley School District",null,0,null,0,0,1210,148,148,148,0.122314049586777]
["5300955","Why Not You (Cascade Midway)","5303540",0,0,0,0,280.44801240172728,45.651880511067233,45.651880511067233,0,0.162781972031498]
["5309840","Wilbur School District",null,0,null,0,0,226,33,33,33,0.146017699115044]
["5309870","Willapa Valley School District",null,0,null,3,0,327,34,37,37,0.113149847094801]
["5309900","Wilson Creek School District",null,0,null,0,0,112,15,15,15,0.13392857142857101]
["5309930","Winlock School District",null,0,null,0,0,810,102,102,102,0.125925925925926]
["5309990","Wishkah Valley School District",null,0,null,0,0,146,21,21,21,0.14383561643835599]
["5310020","Wishram School District",null,0,null,0,0,43,16,16,16,0.372093023255814]
["5310050","Woodland School District",null,0,null,7,0,2649,239,246,246,9.2865232163080402E-2]
["5310110","Yakima School District",null,0,null,66,0,16521,4230,4296,4296,0.26003268567277998]
["5310140","Yelm Community Schools",null,0,null,27,0,6528,575,602,602,9.2218137254901994E-2]
["5310170","Zillah School District",null,0,null,13,0,1203,136,149,149,0.123857024106401]

{"sheet":"Assumptions","index":3,"n_rows":55,"n_cols":39,"rows_kept":55,"cut":false,"hidden":true,"merged":[[0,0,0,17],[29,25,29,26],[30,25,30,26],[45,1,45,25]]}
["Assumptions and Factors — Title II Part A 2021-22 Final"]
[null,"Caution: Yellow Cells below are inputs into the calculations in this model"]
[null,"Section 2121","Preliminary","Final","Preliminary","Final","Preliminary","Final","Preliminary","Final","Preliminary","Final","Preliminary","Final","Preliminary","2nd Revised Final","Revised Final","Final","Preliminary","2nd Revised Final","Revised Final","Final","Preliminary","Final","Preliminary","Final","Preliminary","Final","Final","Re-Revised 012312","Revised","Final"]
[null,"Funding","2024-2025","2023-2024","2023-2024","2022-23","2022-23","2021-22","2021-22","2020-21","2020-21","2019-20","2019-20","2018-19","2018-19","2017-18","2017-18","2017-18","2017-18","2016-17","2016-17","2016-17","2016-17","2015-16","2015-16","2014-15","2014-15","2013-14","2012-13","2011-12","2011-12","2011-12","2010-11","2009-10","2008-09","2007-08","2006-07"]
[null,"Total State Allocation",35590627,35045173,35061559,34114260,33959443,34561891,34516008,33915395,33876016,34072983,34010371,33288630,33249165,33521152,33328186,33521152,33504996,36716833,36578861,36716833,36710950,37458839,36365865,37535132,37524189,37529639,39717936,39836692,39465046,39890148,47747805,48045249,48000430,47422445,47044832]
[null,"State Admin - Higher Ed",0,0,0,0,0,0,0,0,0,0,0,0,0,0,0,0,0,-57834,-57834,-57834,-57834,-57834,-57834,-57834,null,-57834,{"$f":"Z51","v":-57834},-57834,-57834,-57834,{"$f":"ROUNDDOWN(AG8*AD54*-1,0)","v":-59087},{"$f":"ROUNDDOWN(AH8*AE54*-1,0)","v":-59456}]
[null,"State Admin - OSPI",0,0,0,0,0,0,0,0,0,0,0,0,0,0,0,0,0,-309334,-307954,-309334,{"$f":"W8-W6","v":-309276},{"$f":"X8-X6","v":-316754},-317373,-317517,null,-317462,-339345,-340532,-336816,-341067,{"$f":"ROUNDUP(AG8*AD55*-1,0)","v":-418391},{"$f":"ROUNDUP(AH8*AE55*-1,0)","v":-420996}]
["Note below","Total reserve for State Admin 1%",{"$f":"ROUND(-C5*0.01,0)","v":-355906},-350452,-350616,{"$f":"ROUND(-F5*0.01,0)","v":-341143},-339594,-345619,-345160,-339154,-338760,-340730,-340104,-332886,-332492,-335212,-333282,-335212,-335050,-367168,-365789,-367168,-367110,-374588,-363659,-375351,-375242,-375296,-397179,{"$f":"ROUND(-AD5*0.01,0)+1","v":-398366},{"$f":"ROUND(-AE5*0.01,0)","v":-394650},{"$f":"ROUND(-AF5*0.01,0)","v":-398901},{"$f":"ROUND(-AG5*0.01,0)","v":-477478},{"$f":"ROUND(-AH5*0.01,0)","v":-480452},{"$f":"ROUND(-AI5*0.01,0)","v":-480004},-474224,-470448]
[null,"       Subtotal",{"$f":"+C8+C5","v":35234721},34694721,34710943,{"$f":"+F8+F5","v":33773117},33619849,34216272,34170848,33576241,33537256,33732253,33670267,32955744,32916673,33185940,32994904,33185940,33169946,36349665,36213072,36349665,36343840,37084251,36002206,37159781,37148947,37154343,39320757,39438326,39070396,39491247,47270327,47564797,47520426,46948221,46574384]
[2.5000000000000001E-2,"Reserve for SAHE (Subgrants)",null,null,null,null,null,null,null,null,null,null,null,null,0,0,0,0,0,{"$f":"ROUND(-T9*$A10,0)","v":-908742},{"$f":"ROUND(-U9*$A10,0)","v":-905327},{"$f":"ROUND(-V9*$A10,0)","v":-908742},{"$f":"ROUND(-W9*$A10,0)","v":-908596},-927106,{"$f":"ROUND(-Y9*$A10,0)","v":-900055},{"$f":"ROUND(-Z9*$A10,0)","v":-928995},{"$f":"ROUND(-AA9*$A10,0)","v":-928724},{"$f":"ROUND(-AB9*$A10,0)","v":-928859},-983019,{"$f":"ROUND(-AD9*$A10,0)","v":-985958},-976760,-987281,-1181758,-1189120,-1188011,-1173706,-1164360]
[null,"Total OSPI Allocation (w/ Admin)",{"$f":"C5+C6+C10+C8","v":35234721},34694721,34710943,33773117,33619849,34216272,34170848,33576241,33537256,33732253,33670267,32955744,32916673,33185940,32994904,33185940,{"$f":"S5+S6+S10","v":33504996},35750257,35615700,35750257,35744520,36473899,35407976,36548303,36595465,36542946,38677083]
[]
[0.04,"Reserve for State Activities",{"$f":"-C5*$A13","v":-1423625.08},{"$f":"ROUND(-D5*$A13,0)","v":-1401807},-1402462,-1364570,-1358378,-1382476,-1380640,-1356616,-1355041,-1362919,-1360415,-1331545,-1329967,-1340846,-1333127,-1340846,-1340200,{"$f":"ROUND(-T9*$A13,0)","v":-1453987},-1448523,-1453987,-1453754,-1483370,-1440088,-1486391,-1485958,-1486174,-983019,{"$f":"ROUND(-AD9*$A13,0)","v":-1577533},-1562816,-1579650,-1890813,-1902592,-1900817,-1173706,-1164360]
[null,"95% for LEA's",{"$f":"SUM(C9,C10,C13)","v":33811095.920000002},{"$f":"SUM(D9,D10,D13)","v":33292914},33308481,32408547,32261471,32833796,32790208,32219625,32182215,32369334,32309852,31624199,31586706,31845094,31661777,31845094,31829746,33986936,33859222,33986936,33981490,34673775,33662063,34744395,34734265,34739310,37354719,{"$f":"SUM(AD9:AD13)","v":36874835},36530820,36924316,44197756,44473085,44431598,44600809,44245664,null,{"$f":"X13+X6","v":-1541204}]
[null,"Less: Hold harmless",null,null,null,null,null,null,null,null,null,null,null,null,null,null,null,null,null,null,null,null,null,null,null,null,null,null,null,null,null,null,null,null,null,null,null,null,{"$f":"X6/AM14","v":3.7525207564994639E-2}]
[null,"    Eisenhower allocation 2001-02",null,null,null,null,null,null,null,null,null,null,null,null,null,0,0,0,0,0,{"$f":"-'[1]Allocation 2009-10'!$C5","v":-5465310},{"$f":"-'[1]Allocation 2009-10'!$C5","v":-5465310},{"$f":"-'[1]Allocation 2009-10'!$C5","v":-5465310},{"$f":"-'[1]Allocation 2009-10'!$C5","v":-5465310},{"$f":"-'[1]Allocation 2009-10'!$C5","v":-5465310},{"$f":"-'[1]Allocation 2009-10'!$C5","v":-5465310},{"$f":"-'[1]Allocation 2009-10'!$C5","v":-5465310},{"$f":"-'[1]Allocation 2009-10'!$C5","v":-5465310},{"$f":"-'[1]Allocation 2009-10'!$C5","v":-5465310},{"$f":"-'[1]Allocation 2009-10'!$C5","v":-5465310},{"$f":"-'[1]Allocation 2009-10'!$C5","v":-5465310},{"$f":"-'[1]Allocation 2009-10'!$C5","v":-5465310},{"$f":"-'[1]Allocation 2009-10'!$C5","v":-5465310},{"$f":"-'[1]Allocation 2009-10'!$C5","v":-5465310},{"$f":"-'[1]Allocation 2008-09'!$C5","v":-5465310},-5465310,-5465310]
[null,"    Classsize reduction 2001-02",null,null,null,null,null,null,null,null,null,null,null,null,null,0,0,0,0,0,{"$f":"-'[1]Allocation 2009-10'!$D5","v":-26536963},{"$f":"-'[1]Allocation 2009-10'!$D5","v":-26536963},{"$f":"-'[1]Allocation 2009-10'!$D5","v":-26536963},{"$f":"-'[1]Allocation 2009-10'!$D5","v":-26536963},{"$f":"-'[1]Allocation 2009-10'!$D5","v":-26536963},{"$f":"-'[1]Allocation 2009-10'!$D5","v":-26536963},{"$f":"-'[1]Allocation 2009-10'!$D5","v":-26536963},{"$f":"-'[1]Allocation 2009-10'!$D5","v":-26536963},{"$f":"-'[1]Allocation 2009-10'!$D5","v":-26536963},{"$f":"-'[1]Allocation 2009-10'!$D5","v":-26536963},{"$f":"-'[1]Allocation 2009-10'!$D5","v":-26536963},{"$f":"-'[1]Allocation 2009-10'!$D5","v":-26536963},{"$f":"-'[1]Allocation 2009-10'!$D5","v":-26536963},{"$f":"-'[1]Allocation 2009-10'!$D5","v":-26536963},{"$f":"-'[1]Allocation 2008-09'!$D5","v":-26536963},-26536963,-26536963]
[null,"3% for for Principal Support ",{"$f":"C14*0.03*-1","v":-1014332.8776}]
[]
[null,"MOE"]
[null,"MOE Reduction",null,{"$f":"'Allocation 2023-24 Final'!R5","v":-682.51},null,null,0,{"$f":"'[1]Allocation 2021-22 Preliminary'!S5","v":0},{"$f":"'[1]Allocation 2021-22 Preliminary'!S5","v":0},{"$f":"'[1]Allocation 2020-21 Preliminary'!S5","v":0},{"$f":"'[1]Allocation 2020-21 Preliminary'!T5","v":0},{"$f":"'[1]Allocation 2019-20 Final'!T5","v":-64},{"$f":"'[1]Allocation 2019-20 Preliminary'!T5","v":-64},-8893,-9395,-1050,-1030,-1037]
[null,{"$f":"+\"Amt avail for allocation- \"&A28","v":"Amt avail for allocation- Allocation sec. 2121 (a)(3)"},{"$f":"ROUNDUP(SUM(C14,C16:C18,C21),0)","v":32796764},{"$f":"SUM(D14,D16:D17,D21)","v":33292231.489999998},33308481,32408547,32261471,32833796,32790208,32219625,32182215,32369270,32309788,31615306,31577311,31844044,31660747,31844057,{"$f":"ROUND(SUM(S14,S16:S17),0)","v":31829746},33986936,1856949,1984663,1979217,2671502,1659790,2742122,2731992,2737037,5352446,{"$f":"ROUND(SUM(AD14:AD17),0)","v":4872562},{"$f":"ROUND(SUM(AE14:AE17),0)","v":4528547},{"$f":"ROUND(SUM(AF14:AF17),0)","v":4922043},{"$f":"ROUND(SUM(AG14:AG17),0)","v":12195483},{"$f":"SUM(AH14:AH17)","v":12470812},{"$f":"SUM(AI14:AI17)","v":12429325},12598536,12243391]
[]
[null,"Per Allocation Calculation Sheet",null,null,null,null,null,null,null,null,null,null,null,null,null,null,null,null,null,null,null,{"$f":"'[1]Allocation 2015-16 Preliminary'!R5","v":0},{"$f":"'[1]Allocation 2015-16 Preliminary'!S5","v":0},{"$f":"'[1]Allocation 2015-16 Final'!U5","v":35230039},{"$f":"'[1]Allocation 2015-16 Preliminary'!U5","v":34202096},{"$f":"'[1]Allocation 2014-15 Final'!U5","v":35301419},null,{"$f":"'[1]Allocation 2013-14 Prelim'!U5","v":35289403},{"$f":"'[1]Allocation 2012-13'!R5","v":37354719},{"$f":"+'[1]Allocation 2011-12 Rev 012312'!$J$5","v":37466410},{"$f":"+'[1]Allocation 2011-12 Revised'!$J$5","v":37116876},{"$f":"+'[1]Allocation 2011-12'!$J$5","v":37516685},{"$f":"+'[1]Allocation 2010-11'!$J$5","v":44905961},{"$f":"+'[1]Allocation 2009-10'!$J$5","v":45186557},{"$f":"+'[1]Allocation 2008-09'!$J$5","v":45144404},44600809,44245664]
[null,null,null,null,null,null,null,null,null,null,null,null,null,null,null,null,null,null,null,null,null,null,null,null,null,null,null,null,{"$f":"AC24-AC14","v":0},591575,586056,592369,708205,713472,712806,0,0]
[null,"Direct Grant Award to SAHE",0,0,0,0,0,0,0,0,0,0,0,0,0,0,0,0,0,{"$f":"(T10+T6)*-1","v":966576},{"$f":"(U10+U6)*-1","v":963161},{"$f":"(V10+V6)*-1","v":966576},null,null,null,null,null,{"$f":"+AB5-AC5","v":-2188297},{"$f":"AC5-AD5","v":-118756},null,{"$f":"AE5-AF5","v":-425102},{"$f":"AF5-AG5","v":-7857657},{"$f":"AG5-AH5","v":-297444}]
[null,"Direct Grant Award to OSPI",{"$f":"C11","v":35234721},{"$f":"D11","v":34694721},34710943,33773117,33619849,34216272,34170848,33576241,33537256,33732253,33670267,32955744,32916673,33185940,32994904,33185940,33504996,35750257,35615700,35750257,null,null,{"$f":"IF(V27=V11,\" \",\"not balanced\")","v":" "},null,null,{"$f":"+AB24-AC24","v":-2065316},{"$f":"AC24-AD24","v":-111691},null,{"$f":"AE24-AF24","v":-399809},{"$f":"AF24-AG24","v":-7389276},{"$f":"AG24-AH24","v":-280596}]
["Allocation sec. 2121 (a)(3)"]
["The amount exceeding the hold harmles is allocated as follows:"]
["20% based upon the 5-17 population in the area  (Census data)",null,0.2,0.2,0.2,0.2,0.2,0.2,0.2,0.2,0.2,0.2,0.2,0.2,0.2,0.2,0.2,0.2,0.2,0.2,0.2,0.2,0.2,0.2,0.2,0.2]
["80% based upon the 5-17 poverty population in the area (Census data)",null,0.8,0.8,0.8,0.8,0.8,0.8,0.8,0.8,0.8,0.8,0.8,0.8,0.8,0.8,0.8,0.8,0.8,0.8,0.8,0.8,0.8,0.8,0.8,0.8]
[]
["Hold harmless thresehold  sec. 2121(a) (2)"]
[null,"An Amount equal to what the district received in Eisenhower and Classsize Reduction for 2001-02"]
[null,null,null,null,null,null,null,null,null,null,null,null,null,null,null,null,null,null,null,null,null,null,null,"Signature","Date"]
[null,"Allocations Complete (Michelle Matakas)"]
[null,"Program Supervisor (Maria Flores)"]
[null,"Calculations Reviewed"]
[]
[null,"Preliminary"]
[null,"Final"]
[]
[]
["NOTES:"]
[null,"Revised per E-mail from Mary Jo Johnson dated 3/18/02:",null,null,null,null,null,null,null,null,null,null,null,null,null,null,null,null,null,null,null,null,null,"See Section 2113"]
[null,"The allocation will  need to be re-calculated in the following manner.  The 1% admin comes off the top of the state allocation.  Thus, the 95% for LEAs is calculated using 99% of the total funds.  The 2.5% for state admin and SAHE is then calculated from the remaining funds.  This is guidance that will be coming from the Dept. of Ed.  Also, it appears that the admin for SAHE will be at hold harmless level as last year.  Census data is the data to calculate 80/20.  "]
[]
[null,"The P105 public and private are without pre-kindergarten per Mary Jo and Gayle Pauley 7/17/06."]
[]
[null,"The State Administration amount is broken down as follows:",null,null,null,null,null,null,null,null,null,null,null,null,null,null,null,null,null,null,null,null,null,"2013-14 Final",null,"2012-13 Final","2011-12 Re-Revised","2011-12 Revised","2011-12","2010-11","2009-10","2008-09"]
[null,"Higher Education",null,null,null,null,null,null,null,null,null,null,null,null,null,null,null,null,null,null,null,null,null,-57834,null,-57834,-57834,-57834,-57834,{"$f":"AG8*AD54","v":59087.967097649715},59456,59401]
[null,"State Administration",null,null,null,null,null,null,null,null,null,null,null,null,null,null,null,null,null,null,null,null,null,-317462,null,-339345,-340532,-336816,-341067,{"$f":"AG8*AD55","v":418390.0329023503},420996,420603]
[]
[null,null,null,null,null,null,null,null,null,null,null,null,null,null,null,null,null,null,null,null,null,null,null,{"$f":"X51/SUM(X51:X52)","v":0.15410236186903137},null,{"$f":"Z51/SUM(Z51:Z52)","v":0.14561192812308807},{"$f":"AA51/SUM(AA51:AA52)","v":0.14517805234382453},{"$f":"AB51/SUM(AB51:AB52)","v":0.14654503990877993},{"$f":"AC51/SUM(AC51:AC52)","v":0.14498334173140703},{"$f":"AE54","v":-0.12375013528926927},{"$f":"AE51/AH8","v":-0.12375013528926927},{"$f":"AF51/AI8","v":-0.12375105207456605}]
[null,null,null,null,null,null,null,null,null,null,null,null,null,null,null,null,null,null,null,null,null,null,null,{"$f":"X52/SUM(X51:X52)","v":0.84589763813096863},null,{"$f":"Z52/SUM(Z51:Z52)","v":0.8543880718769119},{"$f":"AA52/SUM(AA51:AA52)","v":0.85482194765617547},{"$f":"AB52/SUM(AB51:AB52)","v":0.85345496009122002},{"$f":"AC52/SUM(AC51:AC52)","v":0.85501665826859297},{"$f":"AE55","v":-0.87624986471073074},{"$f":"AE52/AH8","v":-0.87624986471073074},{"$f":"AF52/AI8","v":-0.87624894792543395}]

{"sheet":"Allocation 2023-24 Final","index":4,"n_rows":322,"n_cols":29,"rows_kept":322,"cut":false,"hidden":true,"merged":[[0,1,0,2],[1,10,1,11],[3,27,3,28]]}
[null,"2023-24",null,null,null,null,null,null,null,null,{"$f":"IF(K5=Assumptions!$D$14+J5,\"Rounding OK\",\"Rounding Error = \"&FIXED(K5-Assumptions!$D$14-J5,TRUE))","v":"Rounding OK"},null,null,null,null,null,null,{"$f":"R5","v":-682.51},{"$f":"IF(S5=Assumptions!$D14+R5,\"Rounding OK\",\"Rounding Error = \"&FIXED(S5-(Assumptions!$D14+R5),TRUE))","v":"Rounding OK"}]
[null,"ESEA -- Title 2 Distributions ",null,null,null,null,null,null,null,null,"Allocation including private participation",null,null,null,null,null,null,null,"\\"]
[1,2,3,4,5,6,7,8,9,10,null,12,13,14,15,16,17,18,19,null,18]
["CCDDD","LEAID","District Name","Eisenhower 2001-02 Allocations","Class Size Reduction Allocations 2001-02","Census Population Ages 5-17","20%  based on Total Pop","Census Poverty Ages 5-17","80% based on Low Inc Pop","MOE","Total Final Allocation",null,"Alloc to non-Census LEA","Realloc Pool","Realloc","Final Alloc Before MOE","MOE","MOE Reduction","Final Alloc",null,"Prior Year Allocation",null,null,null,"Rank Order",null,null,"do not delete Y & Z"]
[null,null,"State Totals",{"$f":"SUM(D7:D308)","v":0},{"$f":"SUM(E7:E308)","v":0},{"$f":"SUM(F7:F322)","v":1240828.0900243395},{"$f":"SUM(G7:G322)","v":6658588},{"$f":"SUM(H7:H322)","v":136700.56195772006},{"$f":"SUM(I7:I322)","v":26634335},null,{"$f":"SUM(K7:K322)","v":33292914},null,{"$f":"SUM(M7:M322)","v":0},{"$f":"SUM(N7:N322)","v":33292914},{"$f":"SUM(O7:O322)","v":0},{"$f":"SUM(P7:P322)","v":33292914},null,{"$f":"SUM(R7:R322)","v":-682.51},{"$f":"SUM(S7:S322)","v":33292231.489999998},null,{"$f":"SUM(U7:U322)","v":0},null,{"$f":"SUM(W7:W320)","v":33283493.489999998},{"$f":"MIN(X7:X316)","v":0},{"$f":"\"Lose =  \"& PROPER(VLOOKUP(X5,$X$7:$AC$316,6,FALSE))","v":"Lose =  Aberdeen"},null,null,{"$f":"+B5","v":0},{"$f":"+C5","v":"State Totals"}]
[null,null,null,null,null,null,null,null,null,null,null,null,null,null,null,null,null,null,null,null,null,null,null,{"$f":"MAX(X7:X309)","v":0},{"$f":"\"Win =  \"&PROPER(VLOOKUP(X6,$X$7:$AC$309,6,FALSE))","v":"Win =  Aberdeen"}]
[{"$f":"VLOOKUP(B7,CCDDD!$A$3:$B$319,2,FALSE)","v":"14005"},"5300030","ABERDEEN",0,0,{"$f":"VLOOKUP(B7,'23-24 Adjusted Formula counts'!$A$2:$L$319,8,FALSE)","v":3541},{"$f":"ROUND((F7/$F$5*Assumptions!$D$14*Assumptions!$D$30),0)","v":19002},{"$f":"VLOOKUP(B7,'23-24 Adjusted Formula counts'!$A$2:$L$319,9,FALSE)","v":728},{"$f":"ROUND((H7/$H$5*Assumptions!$D$14*Assumptions!$D$31),0)","v":141841},null,{"$f":"ROUNDDOWN(+I7+G7+E7+D7+J7,0)","v":160843},null,null,{"$f":"K7","v":160843},{"$f":"-ROUND(N7/$N$5*$M$5,0)","v":0},{"$f":"+K7+O7+M7","v":160843},null,{"$f":"-1*(P7*Q7)","v":0},{"$f":"+P7+R7","v":160843},null,{"$f":"IFERROR(VLOOKUP($A7,#REF!, 21,FALSE),0)","v":0},null,{"$f":"+S7-U7","v":160843},{"$f":"IF(U7>0,W7/U7,0)","v":0},{"$f":"RANK(W7,$W$7:$W$322,0)","v":57},{"$f":"(SUM(D7:E7)/S7)","v":0},null,{"$f":"+B7","v":"5300030"},{"$f":"+C7","v":"ABERDEEN"}]
[{"$f":"VLOOKUP(B8,CCDDD!$A$3:$B$319,2,FALSE)","v":"21226"},"5300060","ADNA",0,0,{"$f":"VLOOKUP(B8,'23-24 Adjusted Formula counts'!$A$2:$L$319,8,FALSE)","v":736},{"$f":"ROUND((F8/$F$5*Assumptions!$D$14*Assumptions!$D$30),0)","v":3950},{"$f":"VLOOKUP(B8,'23-24 Adjusted Formula counts'!$A$2:$L$319,9,FALSE)","v":43},{"$f":"ROUND((H8/$H$5*Assumptions!$D$14*Assumptions!$D$31),0)","v":8378},null,12328,null,null,12328,0,{"$f":"+K8+O8+M9","v":12328},null,0,12328,null,{"$f":"IFERROR(VLOOKUP($A8,#REF!, 21,FALSE),0)","v":0},null,12328,0,{"$f":"RANK(W8,$W$7:$W$322,0)","v":221},0,null,"5300060","ADNA"]
[{"$f":"VLOOKUP(B9,CCDDD!$A$3:$B$319,2,FALSE)","v":"22017"},"5300090","ALMIRA",0,0,{"$f":"VLOOKUP(B9,'23-24 Adjusted Formula counts'!$A$2:$L$319,8,FALSE)","v":95},{"$f":"ROUND((F9/$F$5*Assumptions!$D$14*Assumptions!$D$30),0)","v":510},{"$f":"VLOOKUP(B9,'23-24 Adjusted Formula counts'!$A$2:$L$319,9,FALSE)","v":8},{"$f":"ROUND((H9/$H$5*Assumptions!$D$14*Assumptions!$D$31),0)","v":1559},null,2069,null,null,2069,0,{"$f":"+K9+O9+M10","v":2069},null,0,2069,null,{"$f":"IFERROR(VLOOKUP($A9,#REF!, 21,FALSE),0)","v":0},null,2069,0,300,0,null,"5300090","ALMIRA"]
[{"$f":"VLOOKUP(B10,CCDDD!$A$3:$B$319,2,FALSE)","v":"29103"},"5300150","ANACORTES",0,0,{"$f":"VLOOKUP(B10,'23-24 Adjusted Formula counts'!$A$2:$L$319,8,FALSE)","v":2866},{"$f":"ROUND((F10/$F$5*Assumptions!$D$14*Assumptions!$D$30),0)","v":15380},{"$f":"VLOOKUP(B10,'23-24 Adjusted Formula counts'!$A$2:$L$319,9,FALSE)","v":281},{"$f":"ROUND((H10/$H$5*Assumptions!$D$14*Assumptions!$D$31),0)","v":54749},null,70129,null,null,70129,0,{"$f":"+K10+O10+M11","v":70129},null,0,70129,null,{"$f":"IFERROR(VLOOKUP($A10,#REF!, 21,FALSE),0)","v":0},null,70129,0,103,0,null,"5300150","ANACORTES"]
[{"$f":"VLOOKUP(B11,CCDDD!$A$3:$B$319,2,FALSE)","v":"31016"},"5300240","ARLINGTON",0,0,{"$f":"VLOOKUP(B11,'23-24 Adjusted Formula counts'!$A$2:$L$319,8,FALSE)","v":5998},{"$f":"ROUND((F11/$F$5*Assumptions!$D$14*Assumptions!$D$30),0)","v":32187},{"$f":"VLOOKUP(B11,'23-24 Adjusted Formula counts'!$A$2:$L$319,9,FALSE)","v":465},{"$f":"ROUND((H11/$H$5*Assumptions!$D$14*Assumptions!$D$31),0)","v":90599},null,122786,null,null,122786,0,122786,null,0,122786,null,{"$f":"IFERROR(VLOOKUP($A11,#REF!, 21,FALSE),0)","v":0},null,122786,0,68,0,null,"5300240","ARLINGTON"]
[{"$f":"VLOOKUP(B12,CCDDD!$A$3:$B$319,2,FALSE)","v":"02420"},"5300280","ASOTIN-ANATONE",0,0,{"$f":"VLOOKUP(B12,'23-24 Adjusted Formula counts'!$A$2:$L$319,8,FALSE)","v":508},{"$f":"ROUND((F12/$F$5*Assumptions!$D$14*Assumptions!$D$30),0)","v":2726},{"$f":"VLOOKUP(B12,'23-24 Adjusted Formula counts'!$A$2:$L$319,9,FALSE)","v":64},{"$f":"ROUND((H12/$H$5*Assumptions!$D$14*Assumptions!$D$31),0)","v":12470},null,15196,null,null,15196,0,15196,null,0,15196,null,{"$f":"IFERROR(VLOOKUP($A12,#REF!, 21,FALSE),0)","v":0},null,15196,0,205,0,null,"5300280","ASOTIN-ANATONE"]
[{"$f":"VLOOKUP(B13,CCDDD!$A$3:$B$319,2,FALSE)","v":"17408"},"5300300","AUBURN",0,0,{"$f":"VLOOKUP(B13,'23-24 Adjusted Formula counts'!$A$2:$L$319,8,FALSE)","v":18711},{"$f":"ROUND((F13/$F$5*Assumptions!$D$14*Assumptions!$D$30),0)","v":100408},{"$f":"VLOOKUP(B13,'23-24 Adjusted Formula counts'!$A$2:$L$319,9,FALSE)","v":2786},{"$f":"ROUND((H13/$H$5*Assumptions!$D$14*Assumptions!$D$31),0)","v":542816},null,643224,null,null,643224,0,643224,null,0,643224,null,{"$f":"IFERROR(VLOOKUP($A13,#REF!, 21,FALSE),0)","v":0},null,643224,0,11,0,null,"5300300","AUBURN"]
[{"$f":"VLOOKUP(B14,CCDDD!$A$3:$B$319,2,FALSE)","v":"18303"},"5300330","BAINBRIDGE ISLAND",0,0,{"$f":"VLOOKUP(B14,'23-24 Adjusted Formula counts'!$A$2:$L$319,8,FALSE)","v":4038},{"$f":"ROUND((F14/$F$5*Assumptions!$D$14*Assumptions!$D$30),0)","v":21669},{"$f":"VLOOKUP(B14,'23-24 Adjusted Formula counts'!$A$2:$L$319,9,FALSE)","v":159},{"$f":"ROUND((H14/$H$5*Assumptions!$D$14*Assumptions!$D$31),0)","v":30979},null,52648,null,null,52648,0,52648,null,0,52648,null,{"$f":"IFERROR(VLOOKUP($A14,#REF!, 21,FALSE),0)","v":0},null,52648,0,126,0,null,"5300330","BAINBRIDGE ISLAND"]
[{"$f":"VLOOKUP(B15,CCDDD!$A$3:$B$319,2,FALSE)","v":"06119"},"5300380","BATTLE GROUND",0,0,{"$f":"VLOOKUP(B15,'23-24 Adjusted Formula counts'!$A$2:$L$319,8,FALSE)","v":16174},{"$f":"ROUND((F15/$F$5*Assumptions!$D$14*Assumptions!$D$30),0)","v":86794},{"$f":"VLOOKUP(B15,'23-24 Adjusted Formula counts'!$A$2:$L$319,9,FALSE)","v":1098},{"$f":"ROUND((H15/$H$5*Assumptions!$D$14*Assumptions!$D$31),0)","v":213931},null,300725,null,null,300725,0,300725,null,0,300725,null,{"$f":"IFERROR(VLOOKUP($A15,#REF!, 21,FALSE),0)","v":0},null,300725,0,29,0,null,"5300380","BATTLE GROUND"]
[{"$f":"VLOOKUP(B16,CCDDD!$A$3:$B$319,2,FALSE)","v":"17405"},"5300390","BELLEVUE",0,0,{"$f":"VLOOKUP(B16,'23-24 Adjusted Formula counts'!$A$2:$L$319,8,FALSE)","v":22916},{"$f":"ROUND((F16/$F$5*Assumptions!$D$14*Assumptions!$D$30),0)","v":122973},{"$f":"VLOOKUP(B16,'23-24 Adjusted Formula counts'!$A$2:$L$319,9,FALSE)","v":1597},{"$f":"ROUND((H16/$H$5*Assumptions!$D$14*Assumptions!$D$31),0)","v":311155},null,434128,null,null,434128,0,434128,null,0,434128,null,{"$f":"IFERROR(VLOOKUP($A16,#REF!, 21,FALSE),0)","v":0},null,434128,0,22,0,null,"5300390","BELLEVUE"]
[{"$f":"VLOOKUP(B17,CCDDD!$A$3:$B$319,2,FALSE)","v":"37501"},"5300420","BELLINGHAM",0,0,{"$f":"VLOOKUP(B17,'23-24 Adjusted Formula counts'!$A$2:$L$319,8,FALSE)","v":12668.720939999999},{"$f":"ROUND((F17/$F$5*Assumptions!$D$14*Assumptions!$D$30),0)","v":67983},{"$f":"VLOOKUP(B17,'23-24 Adjusted Formula counts'!$A$2:$L$319,9,FALSE)","v":1753.1538459999999},{"$f":"ROUND((H17/$H$5*Assumptions!$D$14*Assumptions!$D$31),0)","v":341579},null,409562,null,null,409562,0,409562,null,0,409562,null,{"$f":"IFERROR(VLOOKUP($A17,#REF!, 21,FALSE),0)","v":0},null,409562,0,23,0,null,"5300420","BELLINGHAM"]
[{"$f":"VLOOKUP(B18,CCDDD!$A$3:$B$319,2,FALSE)","v":"01122"},"5300450","BENGE",0,0,{"$f":"VLOOKUP(B18,'23-24 Adjusted Formula counts'!$A$2:$L$319,8,FALSE)","v":16},{"$f":"ROUND((F18/$F$5*Assumptions!$D$14*Assumptions!$D$30),0)","v":86},{"$f":"VLOOKUP(B18,'23-24 Adjusted Formula counts'!$A$2:$L$319,9,FALSE)","v":1},{"$f":"ROUND((H18/$H$5*Assumptions!$D$14*Assumptions!$D$31),0)","v":195},null,281,null,null,281,0,281,null,0,281,null,{"$f":"IFERROR(VLOOKUP($A18,#REF!, 21,FALSE),0)","v":0},null,281,0,316,0,null,"5300450","BENGE"]
[{"$f":"VLOOKUP(B19,CCDDD!$A$3:$B$319,2,FALSE)","v":"27403"},"5300480","BETHEL",0,0,{"$f":"VLOOKUP(B19,'23-24 Adjusted Formula counts'!$A$2:$L$319,8,FALSE)","v":24535},{"$f":"ROUND((F19/$F$5*Assumptions!$D$14*Assumptions!$D$30),0)","v":131661},{"$f":"VLOOKUP(B19,'23-24 Adjusted Formula counts'!$A$2:$L$319,9,FALSE)","v":2251},{"$f":"ROUND((H19/$H$5*Assumptions!$D$14*Assumptions!$D$31),0)","v":438578},null,570239,null,null,570239,0,570239,null,0,570239,null,{"$f":"IFERROR(VLOOKUP($A19,#REF!, 21,FALSE),0)","v":0},null,570239,0,13,0,null,"5300480","BETHEL"]
[{"$f":"VLOOKUP(B20,CCDDD!$A$3:$B$319,2,FALSE)","v":"20203"},"5300510","BICKLETON",0,0,{"$f":"VLOOKUP(B20,'23-24 Adjusted Formula counts'!$A$2:$L$319,8,FALSE)","v":79},{"$f":"ROUND((F20/$F$5*Assumptions!$D$14*Assumptions!$D$30),0)","v":424},{"$f":"VLOOKUP(B20,'23-24 Adjusted Formula counts'!$A$2:$L$319,9,FALSE)","v":15},{"$f":"ROUND((H20/$H$5*Assumptions!$D$14*Assumptions!$D$31),0)","v":2923},null,3347,null,null,3347,0,3347,null,0,3347,null,{"$f":"IFERROR(VLOOKUP($A20,#REF!, 21,FALSE),0)","v":0},null,3347,0,280,0,null,"5300510","BICKLETON"]
[{"$f":"VLOOKUP(B21,CCDDD!$A$3:$B$319,2,FALSE)","v":"37503"},"5300570","BLAINE",0,0,{"$f":"VLOOKUP(B21,'23-24 Adjusted Formula counts'!$A$2:$L$319,8,FALSE)","v":2520},{"$f":"ROUND((F21/$F$5*Assumptions!$D$14*Assumptions!$D$30),0)","v":13523},{"$f":"VLOOKUP(B21,'23-24 Adjusted Formula counts'!$A$2:$L$319,9,FALSE)","v":385},{"$f":"ROUND((H21/$H$5*Assumptions!$D$14*Assumptions!$D$31),0)","v":75012},null,88535,null,null,88535,0,88535,null,0,88535,null,{"$f":"IFERROR(VLOOKUP($A21,#REF!, 21,FALSE),0)","v":0},null,88535,0,87,0,null,"5300570","BLAINE"]
[{"$f":"VLOOKUP(B22,CCDDD!$A$3:$B$319,2,FALSE)","v":"21234"},"5300630","BOISTFORT",0,0,{"$f":"VLOOKUP(B22,'23-24 Adjusted Formula counts'!$A$2:$L$319,8,FALSE)","v":215},{"$f":"ROUND((F22/$F$5*Assumptions!$D$14*Assumptions!$D$30),0)","v":1154},{"$f":"VLOOKUP(B22,'23-24 Adjusted Formula counts'!$A$2:$L$319,9,FALSE)","v":27},{"$f":"ROUND((H22/$H$5*Assumptions!$D$14*Assumptions!$D$31),0)","v":5261},null,6415,null,null,6415,0,6415,null,0,6415,null,{"$f":"IFERROR(VLOOKUP($A22,#REF!, 21,FALSE),0)","v":0},null,6415,0,253,0,null,"5300630","BOISTFORT"]
[{"$f":"VLOOKUP(B23,CCDDD!$A$3:$B$319,2,FALSE)","v":"18100"},"5300660","BREMERTON",0,0,{"$f":"VLOOKUP(B23,'23-24 Adjusted Formula counts'!$A$2:$L$319,8,FALSE)","v":5044.8083969999998},{"$f":"ROUND((F23/$F$5*Assumptions!$D$14*Assumptions!$D$30),0)","v":27072},{"$f":"VLOOKUP(B23,'23-24 Adjusted Formula counts'!$A$2:$L$319,9,FALSE)","v":809.14502760000005},{"$f":"ROUND((H23/$H$5*Assumptions!$D$14*Assumptions!$D$31),0)","v":157651},null,184723,null,null,184723,0,184723,null,0,184723,null,{"$f":"IFERROR(VLOOKUP($A23,#REF!, 21,FALSE),0)","v":0},null,184723,0,47,0,null,"5300660","BREMERTON"]
[{"$f":"VLOOKUP(B24,CCDDD!$A$3:$B$319,2,FALSE)","v":"24111"},"5300690","BREWSTER",0,0,{"$f":"VLOOKUP(B24,'23-24 Adjusted Formula counts'!$A$2:$L$319,8,FALSE)","v":975},{"$f":"ROUND((F24/$F$5*Assumptions!$D$14*Assumptions!$D$30),0)","v":5232},{"$f":"VLOOKUP(B24,'23-24 Adjusted Formula counts'!$A$2:$L$319,9,FALSE)","v":185},{"$f":"ROUND((H24/$H$5*Assumptions!$D$14*Assumptions!$D$31),0)","v":36045},null,41277,null,null,41277,0,41277,null,0,41277,null,{"$f":"IFERROR(VLOOKUP($A24,#REF!, 21,FALSE),0)","v":0},null,41277,0,141,0,null,"5300690","BREWSTER"]
[{"$f":"VLOOKUP(B25,CCDDD!$A$3:$B$319,2,FALSE)","v":"09075"},"5300720","BRIDGEPORT",0,0,{"$f":"VLOOKUP(B25,'23-24 Adjusted Formula counts'!$A$2:$L$319,8,FALSE)","v":700},{"$f":"ROUND((F25/$F$5*Assumptions!$D$14*Assumptions!$D$30),0)","v":3756},{"$f":"VLOOKUP(B25,'23-24 Adjusted Formula counts'!$A$2:$L$319,9,FALSE)","v":204},{"$f":"ROUND((H25/$H$5*Assumptions!$D$14*Assumptions!$D$31),0)","v":39747},null,43503,null,null,43503,0,43503,null,0,43503,null,{"$f":"IFERROR(VLOOKUP($A25,#REF!, 21,FALSE),0)","v":0},null,43503,0,137,0,null,"5300720","BRIDGEPORT"]
[{"$f":"VLOOKUP(B26,CCDDD!$A$3:$B$319,2,FALSE)","v":"16046"},"5300750","BRINNON",0,0,{"$f":"VLOOKUP(B26,'23-24 Adjusted Formula counts'!$A$2:$L$319,8,FALSE)","v":118},{"$f":"ROUND((F26/$F$5*Assumptions!$D$14*Assumptions!$D$30),0)","v":633},{"$f":"VLOOKUP(B26,'23-24 Adjusted Formula counts'!$A$2:$L$319,9,FALSE)","v":32},{"$f":"ROUND((H26/$H$5*Assumptions!$D$14*Assumptions!$D$31),0)","v":6235},null,6868,null,null,6868,0,6868,null,0,6868,null,{"$f":"IFERROR(VLOOKUP($A26,#REF!, 21,FALSE),0)","v":0},null,6868,0,251,0,null,"5300750","BRINNON"]
[{"$f":"VLOOKUP(B27,CCDDD!$A$3:$B$319,2,FALSE)","v":"29100"},"5300780","BURLINGTON-EDISON",0,0,{"$f":"VLOOKUP(B27,'23-24 Adjusted Formula counts'!$A$2:$L$319,8,FALSE)","v":3771},{"$f":"ROUND((F27/$F$5*Assumptions!$D$14*Assumptions!$D$30),0)","v":20236},{"$f":"VLOOKUP(B27,'23-24 Adjusted Formula counts'!$A$2:$L$319,9,FALSE)","v":496},{"$f":"ROUND((H27/$H$5*Assumptions!$D$14*Assumptions!$D$31),0)","v":96639},null,116875,null,null,116875,0,116875,null,0,116875,null,{"$f":"IFERROR(VLOOKUP($A27,#REF!, 21,FALSE),0)","v":0},null,116875,0,71,0,null,"5300780","BURLINGTON-EDISON"]
[{"$f":"VLOOKUP(B28,CCDDD!$A$3:$B$319,2,FALSE)","v":"06117"},"5300810","CAMAS",0,0,{"$f":"VLOOKUP(B28,'23-24 Adjusted Formula counts'!$A$2:$L$319,8,FALSE)","v":7573},{"$f":"ROUND((F28/$F$5*Assumptions!$D$14*Assumptions!$D$30),0)","v":40639},{"$f":"VLOOKUP(B28,'23-24 Adjusted Formula counts'!$A$2:$L$319,9,FALSE)","v":322},{"$f":"ROUND((H28/$H$5*Assumptions!$D$14*Assumptions!$D$31),0)","v":62738},null,103377,null,null,103377,0,103377,null,0,103377,null,{"$f":"IFERROR(VLOOKUP($A28,#REF!, 21,FALSE),0)","v":0},null,103377,0,79,0,null,"5300810","CAMAS"]
[{"$f":"VLOOKUP(B29,CCDDD!$A$3:$B$319,2,FALSE)","v":"05401"},"5300840","CAPE FLATTERY",0,0,{"$f":"VLOOKUP(B29,'23-24 Adjusted Formula counts'!$A$2:$L$319,8,FALSE)","v":569},{"$f":"ROUND((F29/$F$5*Assumptions!$D$14*Assumptions!$D$30),0)","v":3053},{"$f":"VLOOKUP(B29,'23-24 Adjusted Formula counts'!$A$2:$L$319,9,FALSE)","v":129},{"$f":"ROUND((H29/$H$5*Assumptions!$D$14*Assumptions!$D$31),0)","v":25134},null,28187,null,null,28187,0,28187,null,0,28187,null,{"$f":"IFERROR(VLOOKUP($A29,#REF!, 21,FALSE),0)","v":0},null,28187,0,169,0,null,"5300840","CAPE FLATTERY"]
[{"$f":"VLOOKUP(B30,CCDDD!$A$3:$B$319,2,FALSE)","v":"27019"},"5300870","CARBONADO",0,0,{"$f":"VLOOKUP(B30,'23-24 Adjusted Formula counts'!$A$2:$L$319,8,FALSE)","v":212},{"$f":"ROUND((F30/$F$5*Assumptions!$D$14*Assumptions!$D$30),0)","v":1138},{"$f":"VLOOKUP(B30,'23-24 Adjusted Formula counts'!$A$2:$L$319,9,FALSE)","v":19},{"$f":"ROUND((H30/$H$5*Assumptions!$D$14*Assumptions!$D$31),0)","v":3702},null,4840,null,null,4840,0,4840,null,0,4840,null,{"$f":"IFERROR(VLOOKUP($A30,#REF!, 21,FALSE),0)","v":0},null,4840,0,268,0,null,"5300870","CARBONADO"]
[{"$f":"VLOOKUP(B31,CCDDD!$A$3:$B$319,2,FALSE)","v":"04228"},"5300950","CASCADE",0,0,{"$f":"VLOOKUP(B31,'23-24 Adjusted Formula counts'!$A$2:$L$319,8,FALSE)","v":1590},{"$f":"ROUND((F31/$F$5*Assumptions!$D$14*Assumptions!$D$30),0)","v":8532},{"$f":"VLOOKUP(B31,'23-24 Adjusted Formula counts'!$A$2:$L$319,9,FALSE)","v":175},{"$f":"ROUND((H31/$H$5*Assumptions!$D$14*Assumptions!$D$31),0)","v":34096},null,42628,null,null,42628,0,42628,null,0,42628,null,{"$f":"IFERROR(VLOOKUP($A31,#REF!, 21,FALSE),0)","v":0},null,42628,0,139,0,null,"5300950","CASCADE"]
[{"$f":"VLOOKUP(B32,CCDDD!$A$3:$B$319,2,FALSE)","v":"04222"},"5300960","CASHMERE",0,0,{"$f":"VLOOKUP(B32,'23-24 Adjusted Formula counts'!$A$2:$L$319,8,FALSE)","v":1530},{"$f":"ROUND((F32/$F$5*Assumptions!$D$14*Assumptions!$D$30),0)","v":8210},{"$f":"VLOOKUP(B32,'23-24 Adjusted Formula counts'!$A$2:$L$319,9,FALSE)","v":193},{"$f":"ROUND((H32/$H$5*Assumptions!$D$14*Assumptions!$D$31),0)","v":37604},null,45814,null,null,45814,0,45814,null,0,45814,null,{"$f":"IFERROR(VLOOKUP($A32,#REF!, 21,FALSE),0)","v":0},null,45814,0,134,0,null,"5300960","CASHMERE"]
[{"$f":"VLOOKUP(B33,CCDDD!$A$3:$B$319,2,FALSE)","v":"08401"},"5300990","CASTLE ROCK",0,0,{"$f":"VLOOKUP(B33,'23-24 Adjusted Formula counts'!$A$2:$L$319,8,FALSE)","v":1643},{"$f":"ROUND((F33/$F$5*Assumptions!$D$14*Assumptions!$D$30),0)","v":8817},{"$f":"VLOOKUP(B33,'23-24 Adjusted Formula counts'!$A$2:$L$319,9,FALSE)","v":195},{"$f":"ROUND((H33/$H$5*Assumptions!$D$14*Assumptions!$D$31),0)","v":37993},null,46810,null,null,46810,0,46810,null,0,46810,null,{"$f":"IFERROR(VLOOKUP($A33,#REF!, 21,FALSE),0)","v":0},null,46810,0,131,0,null,"5300990","CASTLE ROCK"]
[{"$f":"VLOOKUP(B34,CCDDD!$A$3:$B$319,2,FALSE)","v":"18901"},"5301000","CATALYST BREMERTON CHARTER",0,0,{"$f":"VLOOKUP(B34,'23-24 Adjusted Formula counts'!$A$2:$L$319,8,FALSE)","v":510.64581190000001},{"$f":"ROUND((F34/$F$5*Assumptions!$D$14*Assumptions!$D$30),0)","v":2740},{"$f":"VLOOKUP(B34,'23-24 Adjusted Formula counts'!$A$2:$L$319,9,FALSE)","v":65.298342539999993},{"$f":"ROUND((H34/$H$5*Assumptions!$D$14*Assumptions!$D$31),0)","v":12723},null,15463,null,null,15463,0,15463,null,0,15463,null,{"$f":"IFERROR(VLOOKUP($A34,#REF!, 21,FALSE),0)","v":0},null,15463,0,203,0,null,"5301000","CATALYST BREMERTON CHARTER"]
[{"$f":"VLOOKUP(B35,CCDDD!$A$3:$B$319,2,FALSE)","v":"20215"},"5301050","CENTERVILLE",0,0,{"$f":"VLOOKUP(B35,'23-24 Adjusted Formula counts'!$A$2:$L$319,8,FALSE)","v":95},{"$f":"ROUND((F35/$F$5*Assumptions!$D$14*Assumptions!$D$30),0)","v":510},{"$f":"VLOOKUP(B35,'23-24 Adjusted Formula counts'!$A$2:$L$319,9,FALSE)","v":13},{"$f":"ROUND((H35/$H$5*Assumptions!$D$14*Assumptions!$D$31),0)","v":2533},null,3043,null,null,3043,0,3043,null,0,3043,null,{"$f":"IFERROR(VLOOKUP($A35,#REF!, 21,FALSE),0)","v":0},null,3043,0,286,0,null,"5301050","CENTERVILLE"]
[{"$f":"VLOOKUP(B36,CCDDD!$A$3:$B$319,2,FALSE)","v":"18401"},"5301080","CENTRAL KITSAP",0,0,{"$f":"VLOOKUP(B36,'23-24 Adjusted Formula counts'!$A$2:$L$319,8,FALSE)","v":11324},{"$f":"ROUND((F36/$F$5*Assumptions!$D$14*Assumptions!$D$30),0)","v":60767},{"$f":"VLOOKUP(B36,'23-24 Adjusted Formula counts'!$A$2:$L$319,9,FALSE)","v":913},{"$f":"ROUND((H36/$H$5*Assumptions!$D$14*Assumptions!$D$31),0)","v":177886},null,238653,null,null,238653,0,238653,null,0,238653,null,{"$f":"IFERROR(VLOOKUP($A36,#REF!, 21,FALSE),0)","v":0},null,238653,0,38,0,null,"5301080","CENTRAL KITSAP"]
[{"$f":"VLOOKUP(B37,CCDDD!$A$3:$B$319,2,FALSE)","v":"32356"},"5301110","CENTRAL VALLEY",0,0,{"$f":"VLOOKUP(B37,'23-24 Adjusted Formula counts'!$A$2:$L$319,8,FALSE)","v":17283},{"$f":"ROUND((F37/$F$5*Assumptions!$D$14*Assumptions!$D$30),0)","v":92745},{"$f":"VLOOKUP(B37,'23-24 Adjusted Formula counts'!$A$2:$L$319,9,FALSE)","v":1571},{"$f":"ROUND((H37/$H$5*Assumptions!$D$14*Assumptions!$D$31),0)","v":306089},null,398834,null,null,398834,0,398834,null,0,398834,null,{"$f":"IFERROR(VLOOKUP($A37,#REF!, 21,FALSE),0)","v":0},null,398834,0,24,0,null,"5301110","CENTRAL VALLEY"]
[{"$f":"VLOOKUP(B38,CCDDD!$A$3:$B$319,2,FALSE)","v":"21401"},"5301140","CENTRALIA",0,0,{"$f":"VLOOKUP(B38,'23-24 Adjusted Formula counts'!$A$2:$L$319,8,FALSE)","v":4272},{"$f":"ROUND((F38/$F$5*Assumptions!$D$14*Assumptions!$D$30),0)","v":22925},{"$f":"VLOOKUP(B38,'23-24 Adjusted Formula counts'!$A$2:$L$319,9,FALSE)","v":812},{"$f":"ROUND((H38/$H$5*Assumptions!$D$14*Assumptions!$D$31),0)","v":158208},null,181133,null,null,181133,0,181133,null,0,181133,null,{"$f":"IFERROR(VLOOKUP($A38,#REF!, 21,FALSE),0)","v":0},null,181133,0,49,0,null,"5301140","CENTRALIA"]
[{"$f":"VLOOKUP(B39,CCDDD!$A$3:$B$319,2,FALSE)","v":"21302"},"5301170","CHEHALIS",0,0,{"$f":"VLOOKUP(B39,'23-24 Adjusted Formula counts'!$A$2:$L$319,8,FALSE)","v":2861},{"$f":"ROUND((F39/$F$5*Assumptions!$D$14*Assumptions!$D$30),0)","v":15353},{"$f":"VLOOKUP(B39,'23-24 Adjusted Formula counts'!$A$2:$L$319,9,FALSE)","v":345},{"$f":"ROUND((H39/$H$5*Assumptions!$D$14*Assumptions!$D$31),0)","v":67219},null,82572,null,null,82572,0,82572,null,0,82572,null,{"$f":"IFERROR(VLOOKUP($A39,#REF!, 21,FALSE),0)","v":0},null,82572,0,91,0,null,"5301170","CHEHALIS"]
[{"$f":"VLOOKUP(B40,CCDDD!$A$3:$B$319,2,FALSE)","v":"32360"},"5301230","CHENEY",0,0,{"$f":"VLOOKUP(B40,'23-24 Adjusted Formula counts'!$A$2:$L$319,8,FALSE)","v":6337},{"$f":"ROUND((F40/$F$5*Assumptions!$D$14*Assumptions!$D$30),0)","v":34006},{"$f":"VLOOKUP(B40,'23-24 Adjusted Formula counts'!$A$2:$L$319,9,FALSE)","v":783},{"$f":"ROUND((H40/$H$5*Assumptions!$D$14*Assumptions!$D$31),0)","v":152557},null,186563,null,null,186563,0,186563,null,0,186563,null,{"$f":"IFERROR(VLOOKUP($A40,#REF!, 21,FALSE),0)","v":0},null,186563,0,45,0,null,"5301230","CHENEY"]
[{"$f":"VLOOKUP(B41,CCDDD!$A$3:$B$319,2,FALSE)","v":"33036"},"5301260","CHEWELAH",0,0,{"$f":"VLOOKUP(B41,'23-24 Adjusted Formula counts'!$A$2:$L$319,8,FALSE)","v":947},{"$f":"ROUND((F41/$F$5*Assumptions!$D$14*Assumptions!$D$30),0)","v":5082},{"$f":"VLOOKUP(B41,'23-24 Adjusted Formula counts'!$A$2:$L$319,9,FALSE)","v":190},{"$f":"ROUND((H41/$H$5*Assumptions!$D$14*Assumptions!$D$31),0)","v":37019},null,42101,null,null,42101,0,42101,null,0,42101,null,{"$f":"IFERROR(VLOOKUP($A41,#REF!, 21,FALSE),0)","v":0},null,42101,0,140,0,null,"5301260","CHEWELAH"]
[{"$f":"VLOOKUP(B42,CCDDD!$A$3:$B$319,2,FALSE)","v":"16049"},"5301290","CHIMACUM",0,0,{"$f":"VLOOKUP(B42,'23-24 Adjusted Formula counts'!$A$2:$L$319,8,FALSE)","v":1180},{"$f":"ROUND((F42/$F$5*Assumptions!$D$14*Assumptions!$D$30),0)","v":6332},{"$f":"VLOOKUP(B42,'23-24 Adjusted Formula counts'!$A$2:$L$319,9,FALSE)","v":204},{"$f":"ROUND((H42/$H$5*Assumptions!$D$14*Assumptions!$D$31),0)","v":39747},null,46079,null,null,46079,0,46079,null,0,46079,null,{"$f":"IFERROR(VLOOKUP($A42,#REF!, 21,FALSE),0)","v":0},null,46079,0,133,0,null,"5301290","CHIMACUM"]
[{"$f":"VLOOKUP(B43,CCDDD!$A$3:$B$319,2,FALSE)","v":"02250"},"5301320","CLARKSTON",0,0,{"$f":"VLOOKUP(B43,'23-24 Adjusted Formula counts'!$A$2:$L$319,8,FALSE)","v":2878},{"$f":"ROUND((F43/$F$5*Assumptions!$D$14*Assumptions!$D$30),0)","v":15444},{"$f":"VLOOKUP(B43,'23-24 Adjusted Formula counts'!$A$2:$L$319,9,FALSE)","v":578},{"$f":"ROUND((H43/$H$5*Assumptions!$D$14*Assumptions!$D$31),0)","v":112616},null,128060,null,null,128060,0,128060,null,0,128060,null,{"$f":"IFERROR(VLOOKUP($A43,#REF!, 21,FALSE),0)","v":0},null,128060,0,67,0,null,"5301320","CLARKSTON"]
[{"$f":"VLOOKUP(B44,CCDDD!$A$3:$B$319,2,FALSE)","v":"19404"},"5301350","CLE ELUM-ROSLYN",0,0,{"$f":"VLOOKUP(B44,'23-24 Adjusted Formula counts'!$A$2:$L$319,8,FALSE)","v":1041},{"$f":"ROUND((F44/$F$5*Assumptions!$D$14*Assumptions!$D$30),0)","v":5586},{"$f":"VLOOKUP(B44,'23-24 Adjusted Formula counts'!$A$2:$L$319,9,FALSE)","v":128},{"$f":"ROUND((H44/$H$5*Assumptions!$D$14*Assumptions!$D$31),0)","v":24939},null,30525,null,null,30525,0,30525,null,0,30525,null,{"$f":"IFERROR(VLOOKUP($A44,#REF!, 21,FALSE),0)","v":0},null,30525,0,163,0,null,"5301350","CLE ELUM-ROSLYN"]
[{"$f":"VLOOKUP(B45,CCDDD!$A$3:$B$319,2,FALSE)","v":"27400"},"5301410","CLOVER PARK",0,0,{"$f":"VLOOKUP(B45,'23-24 Adjusted Formula counts'!$A$2:$L$319,8,FALSE)","v":13910},{"$f":"ROUND((F45/$F$5*Assumptions!$D$14*Assumptions!$D$30),0)","v":74644},{"$f":"VLOOKUP(B45,'23-24 Adjusted Formula counts'!$A$2:$L$319,9,FALSE)","v":1888},{"$f":"ROUND((H45/$H$5*Assumptions!$D$14*Assumptions!$D$31),0)","v":367852},null,442496,null,null,442496,0,442496,null,0,442496,null,{"$f":"IFERROR(VLOOKUP($A45,#REF!, 21,FALSE),0)","v":0},null,442496,0,20,0,null,"5301410","CLOVER PARK"]
[{"$f":"VLOOKUP(B46,CCDDD!$A$3:$B$319,2,FALSE)","v":"38300"},"5301440","COLFAX",0,0,{"$f":"VLOOKUP(B46,'23-24 Adjusted Formula counts'!$A$2:$L$319,8,FALSE)","v":604},{"$f":"ROUND((F46/$F$5*Assumptions!$D$14*Assumptions!$D$30),0)","v":3241},{"$f":"VLOOKUP(B46,'23-24 Adjusted Formula counts'!$A$2:$L$319,9,FALSE)","v":51},{"$f":"ROUND((H46/$H$5*Assumptions!$D$14*Assumptions!$D$31),0)","v":9937},null,13178,null,null,13178,0,13178,null,0,13178,null,{"$f":"IFERROR(VLOOKUP($A46,#REF!, 21,FALSE),0)","v":0},null,13178,0,213,0,null,"5301440","COLFAX"]
[{"$f":"VLOOKUP(B47,CCDDD!$A$3:$B$319,2,FALSE)","v":"36250"},"5301470","COLLEGE PLACE",0,0,{"$f":"VLOOKUP(B47,'23-24 Adjusted Formula counts'!$A$2:$L$319,8,FALSE)","v":2104},{"$f":"ROUND((F47/$F$5*Assumptions!$D$14*Assumptions!$D$30),0)","v":11291},{"$f":"VLOOKUP(B47,'23-24 Adjusted Formula counts'!$A$2:$L$319,9,FALSE)","v":244},{"$f":"ROUND((H47/$H$5*Assumptions!$D$14*Assumptions!$D$31),0)","v":47540},null,58831,null,null,58831,0,58831,null,0,58831,null,{"$f":"IFERROR(VLOOKUP($A47,#REF!, 21,FALSE),0)","v":0},null,58831,0,117,0,null,"5301470","COLLEGE PLACE"]
[{"$f":"VLOOKUP(B48,CCDDD!$A$3:$B$319,2,FALSE)","v":"38306"},"5301500","COLTON",0,0,{"$f":"VLOOKUP(B48,'23-24 Adjusted Formula counts'!$A$2:$L$319,8,FALSE)","v":243},{"$f":"ROUND((F48/$F$5*Assumptions!$D$14*Assumptions!$D$30),0)","v":1304},{"$f":"VLOOKUP(B48,'23-24 Adjusted Formula counts'!$A$2:$L$319,9,FALSE)","v":20},{"$f":"ROUND((H48/$H$5*Assumptions!$D$14*Assumptions!$D$31),0)","v":3897},null,5201,null,null,5201,0,5201,null,0,5201,null,{"$f":"IFERROR(VLOOKUP($A48,#REF!, 21,FALSE),0)","v":0},null,5201,0,262,0,null,"5301500","COLTON"]
[{"$f":"VLOOKUP(B49,CCDDD!$A$3:$B$319,2,FALSE)","v":"33206"},"5301560","COLUMBIA (STEV)",0,0,{"$f":"VLOOKUP(B49,'23-24 Adjusted Formula counts'!$A$2:$L$319,8,FALSE)","v":207},{"$f":"ROUND((F49/$F$5*Assumptions!$D$14*Assumptions!$D$30),0)","v":1111},{"$f":"VLOOKUP(B49,'23-24 Adjusted Formula counts'!$A$2:$L$319,9,FALSE)","v":43},{"$f":"ROUND((H49/$H$5*Assumptions!$D$14*Assumptions!$D$31),0)","v":8378},null,9489,null,null,9489,0,9489,null,0,9489,null,{"$f":"IFERROR(VLOOKUP($A49,#REF!, 21,FALSE),0)","v":0},null,9489,0,237,0,null,"5301560","COLUMBIA (STEV)"]
[{"$f":"VLOOKUP(B50,CCDDD!$A$3:$B$319,2,FALSE)","v":"36400"},"5301590","COLUMBIA (WALLA)",0,0,{"$f":"VLOOKUP(B50,'23-24 Adjusted Formula counts'!$A$2:$L$319,8,FALSE)","v":781},{"$f":"ROUND((F50/$F$5*Assumptions!$D$14*Assumptions!$D$30),0)","v":4191},{"$f":"VLOOKUP(B50,'23-24 Adjusted Formula counts'!$A$2:$L$319,9,FALSE)","v":90},{"$f":"ROUND((H50/$H$5*Assumptions!$D$14*Assumptions!$D$31),0)","v":17535},null,21726,null,null,21726,0,21726,null,0,21726,null,{"$f":"IFERROR(VLOOKUP($A50,#REF!, 21,FALSE),0)","v":0},null,21726,0,182,0,null,"5301590","COLUMBIA (WALLA)"]
[{"$f":"VLOOKUP(B51,CCDDD!$A$3:$B$319,2,FALSE)","v":"33115"},"5301630","COLVILLE",0,0,{"$f":"VLOOKUP(B51,'23-24 Adjusted Formula counts'!$A$2:$L$319,8,FALSE)","v":2016},{"$f":"ROUND((F51/$F$5*Assumptions!$D$14*Assumptions!$D$30),0)","v":10818},{"$f":"VLOOKUP(B51,'23-24 Adjusted Formula counts'!$A$2:$L$319,9,FALSE)","v":355},{"$f":"ROUND((H51/$H$5*Assumptions!$D$14*Assumptions!$D$31),0)","v":69167},null,79985,null,null,79985,0,79985,null,0,79985,null,{"$f":"IFERROR(VLOOKUP($A51,#REF!, 21,FALSE),0)","v":0},null,79985,0,97,0,null,"5301630","COLVILLE"]
[{"$f":"VLOOKUP(B52,CCDDD!$A$3:$B$319,2,FALSE)","v":"29011"},"5301660","CONCRETE",0,0,{"$f":"VLOOKUP(B52,'23-24 Adjusted Formula counts'!$A$2:$L$319,8,FALSE)","v":726},{"$f":"ROUND((F52/$F$5*Assumptions!$D$14*Assumptions!$D$30),0)","v":3896},{"$f":"VLOOKUP(B52,'23-24 Adjusted Formula counts'!$A$2:$L$319,9,FALSE)","v":147},{"$f":"ROUND((H52/$H$5*Assumptions!$D$14*Assumptions!$D$31),0)","v":28641},null,32537,null,null,32537,0,32537,null,0,32537,null,{"$f":"IFERROR(VLOOKUP($A52,#REF!, 21,FALSE),0)","v":0},null,32537,0,159,0,null,"5301660","CONCRETE"]
[{"$f":"VLOOKUP(B53,CCDDD!$A$3:$B$319,2,FALSE)","v":"29317"},"5301680","CONWAY",0,0,{"$f":"VLOOKUP(B53,'23-24 Adjusted Formula counts'!$A$2:$L$319,8,FALSE)","v":550},{"$f":"ROUND((F53/$F$5*Assumptions!$D$14*Assumptions!$D$30),0)","v":2951},{"$f":"VLOOKUP(B53,'23-24 Adjusted Formula counts'!$A$2:$L$319,9,FALSE)","v":47},{"$f":"ROUND((H53/$H$5*Assumptions!$D$14*Assumptions!$D$31),0)","v":9157},null,12108,null,null,12108,0,12108,null,0,12108,null,{"$f":"IFERROR(VLOOKUP($A53,#REF!, 21,FALSE),0)","v":0},null,12108,0,222,0,null,"5301680","CONWAY"]
[{"$f":"VLOOKUP(B54,CCDDD!$A$3:$B$319,2,FALSE)","v":"14099"},"5301710","COSMOPOLIS",0,0,{"$f":"VLOOKUP(B54,'23-24 Adjusted Formula counts'!$A$2:$L$319,8,FALSE)","v":320},{"$f":"ROUND((F54/$F$5*Assumptions!$D$14*Assumptions!$D$30),0)","v":1717},{"$f":"VLOOKUP(B54,'23-24 Adjusted Formula counts'!$A$2:$L$319,9,FALSE)","v":27},{"$f":"ROUND((H54/$H$5*Assumptions!$D$14*Assumptions!$D$31),0)","v":5261},null,6978,null,null,6978,0,6978,null,0,6978,null,{"$f":"IFERROR(VLOOKUP($A54,#REF!, 21,FALSE),0)","v":0},null,6978,0,249,0,null,"5301710","COSMOPOLIS"]
[{"$f":"VLOOKUP(B55,CCDDD!$A$3:$B$319,2,FALSE)","v":"13151"},"5303440","COULEE-HARTLINE",0,0,{"$f":"VLOOKUP(B55,'23-24 Adjusted Formula counts'!$A$2:$L$319,8,FALSE)","v":253},{"$f":"ROUND((F55/$F$5*Assumptions!$D$14*Assumptions!$D$30),0)","v":1358},{"$f":"VLOOKUP(B55,'23-24 Adjusted Formula counts'!$A$2:$L$319,9,FALSE)","v":32},{"$f":"ROUND((H55/$H$5*Assumptions!$D$14*Assumptions!$D$31),0)","v":6235},null,7593,null,null,7593,0,7593,null,0,7593,null,{"$f":"IFERROR(VLOOKUP($A55,#REF!, 21,FALSE),0)","v":0},null,7593,0,245,0,null,"5303440","COULEE-HARTLINE"]
[{"$f":"VLOOKUP(B56,CCDDD!$A$3:$B$319,2,FALSE)","v":"15204"},"5301800","COUPEVILLE",0,0,{"$f":"VLOOKUP(B56,'23-24 Adjusted Formula counts'!$A$2:$L$319,8,FALSE)","v":1115},{"$f":"ROUND((F56/$F$5*Assumptions!$D$14*Assumptions!$D$30),0)","v":5983},{"$f":"VLOOKUP(B56,'23-24 Adjusted Formula counts'!$A$2:$L$319,9,FALSE)","v":122},{"$f":"ROUND((H56/$H$5*Assumptions!$D$14*Assumptions!$D$31),0)","v":23770},null,29753,null,null,29753,0,29753,null,0,29753,null,{"$f":"IFERROR(VLOOKUP($A56,#REF!, 21,FALSE),0)","v":0},null,29753,0,165,0,null,"5301800","COUPEVILLE"]
[{"$f":"VLOOKUP(B57,CCDDD!$A$3:$B$319,2,FALSE)","v":"05313"},"5301830","CRESCENT",0,0,{"$f":"VLOOKUP(B57,'23-24 Adjusted Formula counts'!$A$2:$L$319,8,FALSE)","v":357},{"$f":"ROUND((F57/$F$5*Assumptions!$D$14*Assumptions!$D$30),0)","v":1916},{"$f":"VLOOKUP(B57,'23-24 Adjusted Formula counts'!$A$2:$L$319,9,FALSE)","v":45},{"$f":"ROUND((H57/$H$5*Assumptions!$D$14*Assumptions!$D$31),0)","v":8768},null,10684,null,null,10684,0,10684,null,0,10684,null,{"$f":"IFERROR(VLOOKUP($A57,#REF!, 21,FALSE),0)","v":0},null,10684,0,231,0,null,"5301830","CRESCENT"]
[{"$f":"VLOOKUP(B58,CCDDD!$A$3:$B$319,2,FALSE)","v":"22073"},"5301860","CRESTON",0,0,{"$f":"VLOOKUP(B58,'23-24 Adjusted Formula counts'!$A$2:$L$319,8,FALSE)","v":110},{"$f":"ROUND((F58/$F$5*Assumptions!$D$14*Assumptions!$D$30),0)","v":590},{"$f":"VLOOKUP(B58,'23-24 Adjusted Formula counts'!$A$2:$L$319,9,FALSE)","v":19},{"$f":"ROUND((H58/$H$5*Assumptions!$D$14*Assumptions!$D$31),0)","v":3702},null,4292,null,null,4292,0,4292,null,0,4292,null,{"$f":"IFERROR(VLOOKUP($A58,#REF!, 21,FALSE),0)","v":0},null,4292,0,271,0,null,"5301860","CRESTON"]
[{"$f":"VLOOKUP(B59,CCDDD!$A$3:$B$319,2,FALSE)","v":"10050"},"5301890","CURLEW",0,0,{"$f":"VLOOKUP(B59,'23-24 Adjusted Formula counts'!$A$2:$L$319,8,FALSE)","v":152},{"$f":"ROUND((F59/$F$5*Assumptions!$D$14*Assumptions!$D$30),0)","v":816},{"$f":"VLOOKUP(B59,'23-24 Adjusted Formula counts'!$A$2:$L$319,9,FALSE)","v":45},{"$f":"ROUND((H59/$H$5*Assumptions!$D$14*Assumptions!$D$31),0)","v":8768},null,9584,null,null,9584,0,9584,null,0,9584,null,{"$f":"IFERROR(VLOOKUP($A59,#REF!, 21,FALSE),0)","v":0},null,9584,0,235,0,null,"5301890","CURLEW"]
[{"$f":"VLOOKUP(B60,CCDDD!$A$3:$B$319,2,FALSE)","v":"26059"},"5301920","CUSICK",0,0,{"$f":"VLOOKUP(B60,'23-24 Adjusted Formula counts'!$A$2:$L$319,8,FALSE)","v":303},{"$f":"ROUND((F60/$F$5*Assumptions!$D$14*Assumptions!$D$30),0)","v":1626},{"$f":"VLOOKUP(B60,'23-24 Adjusted Formula counts'!$A$2:$L$319,9,FALSE)","v":63},{"$f":"ROUND((H60/$H$5*Assumptions!$D$14*Assumptions!$D$31),0)","v":12275},null,13901,null,null,13901,0,13901,null,0,13901,null,{"$f":"IFERROR(VLOOKUP($A60,#REF!, 21,FALSE),0)","v":0},null,13901,0,211,0,null,"5301920","CUSICK"]
[{"$f":"VLOOKUP(B61,CCDDD!$A$3:$B$319,2,FALSE)","v":"19007"},"5301950","DAMMAN",0,0,{"$f":"VLOOKUP(B61,'23-24 Adjusted Formula counts'!$A$2:$L$319,8,FALSE)","v":109},{"$f":"ROUND((F61/$F$5*Assumptions!$D$14*Assumptions!$D$30),0)","v":585},{"$f":"VLOOKUP(B61,'23-24 Adjusted Formula counts'!$A$2:$L$319,9,FALSE)","v":2},{"$f":"ROUND((H61/$H$5*Assumptions!$D$14*Assumptions!$D$31),0)","v":390},null,975,null,null,975,0,975,null,0,975,null,{"$f":"IFERROR(VLOOKUP($A61,#REF!, 21,FALSE),0)","v":0},null,975,0,313,0,null,"5301950","DAMMAN"]
[{"$f":"VLOOKUP(B62,CCDDD!$A$3:$B$319,2,FALSE)","v":"31330"},"5301980","DARRINGTON",0,0,{"$f":"VLOOKUP(B62,'23-24 Adjusted Formula counts'!$A$2:$L$319,8,FALSE)","v":510},{"$f":"ROUND((F62/$F$5*Assumptions!$D$14*Assumptions!$D$30),0)","v":2737},{"$f":"VLOOKUP(B62,'23-24 Adjusted Formula counts'!$A$2:$L$319,9,FALSE)","v":79},{"$f":"ROUND((H62/$H$5*Assumptions!$D$14*Assumptions!$D$31),0)","v":15392},null,18129,null,null,18129,0,18129,null,0,18129,null,{"$f":"IFERROR(VLOOKUP($A62,#REF!, 21,FALSE),0)","v":0},null,18129,0,192,0,null,"5301980","DARRINGTON"]
[{"$f":"VLOOKUP(B63,CCDDD!$A$3:$B$319,2,FALSE)","v":"22207"},"5302010","DAVENPORT",0,0,{"$f":"VLOOKUP(B63,'23-24 Adjusted Formula counts'!$A$2:$L$319,8,FALSE)","v":570},{"$f":"ROUND((F63/$F$5*Assumptions!$D$14*Assumptions!$D$30),0)","v":3059},{"$f":"VLOOKUP(B63,'23-24 Adjusted Formula counts'!$A$2:$L$319,9,FALSE)","v":67},{"$f":"ROUND((H63/$H$5*Assumptions!$D$14*Assumptions!$D$31),0)","v":13054},null,16113,null,null,16113,0,16113,null,0,16113,null,{"$f":"IFERROR(VLOOKUP($A63,#REF!, 21,FALSE),0)","v":0},null,16113,0,200,0,null,"5302010","DAVENPORT"]
[{"$f":"VLOOKUP(B64,CCDDD!$A$3:$B$319,2,FALSE)","v":"07002"},"5302040","DAYTON",0,0,{"$f":"VLOOKUP(B64,'23-24 Adjusted Formula counts'!$A$2:$L$319,8,FALSE)","v":525},{"$f":"ROUND((F64/$F$5*Assumptions!$D$14*Assumptions!$D$30),0)","v":2817},{"$f":"VLOOKUP(B64,'23-24 Adjusted Formula counts'!$A$2:$L$319,9,FALSE)","v":97},{"$f":"ROUND((H64/$H$5*Assumptions!$D$14*Assumptions!$D$31),0)","v":18899},null,21716,null,null,21716,0,21716,null,0,21716,null,{"$f":"IFERROR(VLOOKUP($A64,#REF!, 21,FALSE),0)","v":0},null,21716,0,183,0,null,"5302040","DAYTON"]
[{"$f":"VLOOKUP(B65,CCDDD!$A$3:$B$319,2,FALSE)","v":"32414"},"5302070","DEER PARK",0,0,{"$f":"VLOOKUP(B65,'23-24 Adjusted Formula counts'!$A$2:$L$319,8,FALSE)","v":2401},{"$f":"ROUND((F65/$F$5*Assumptions!$D$14*Assumptions!$D$30),0)","v":12884},{"$f":"VLOOKUP(B65,'23-24 Adjusted Formula counts'!$A$2:$L$319,9,FALSE)","v":346},{"$f":"ROUND((H65/$H$5*Assumptions!$D$14*Assumptions!$D$31),0)","v":67414},null,80298,null,null,80298,0,80298,null,0,80298,null,{"$f":"IFERROR(VLOOKUP($A65,#REF!, 21,FALSE),0)","v":0},null,80298,0,96,0,null,"5302070","DEER PARK"]
[{"$f":"VLOOKUP(B66,CCDDD!$A$3:$B$319,2,FALSE)","v":"27343"},"5302130","DIERINGER",0,0,{"$f":"VLOOKUP(B66,'23-24 Adjusted Formula counts'!$A$2:$L$319,8,FALSE)","v":2313},{"$f":"ROUND((F66/$F$5*Assumptions!$D$14*Assumptions!$D$30),0)","v":12412},{"$f":"VLOOKUP(B66,'23-24 Adjusted Formula counts'!$A$2:$L$319,9,FALSE)","v":99},{"$f":"ROUND((H66/$H$5*Assumptions!$D$14*Assumptions!$D$31),0)","v":19289},null,31701,null,null,31701,0,31701,null,0,31701,null,{"$f":"IFERROR(VLOOKUP($A66,#REF!, 21,FALSE),0)","v":0},null,31701,0,160,0,null,"5302130","DIERINGER"]
[{"$f":"VLOOKUP(B67,CCDDD!$A$3:$B$319,2,FALSE)","v":"36101"},"5302160","DIXIE",0,0,{"$f":"VLOOKUP(B67,'23-24 Adjusted Formula counts'!$A$2:$L$319,8,FALSE)","v":77},{"$f":"ROUND((F67/$F$5*Assumptions!$D$14*Assumptions!$D$30),0)","v":413},{"$f":"VLOOKUP(B67,'23-24 Adjusted Formula counts'!$A$2:$L$319,9,FALSE)","v":10},{"$f":"ROUND((H67/$H$5*Assumptions!$D$14*Assumptions!$D$31),0)","v":1948},null,2361,null,null,2361,0,2361,null,0,2361,null,{"$f":"IFERROR(VLOOKUP($A67,#REF!, 21,FALSE),0)","v":0},null,2361,0,293,0,null,"5302160","DIXIE"]
[{"$f":"VLOOKUP(B68,CCDDD!$A$3:$B$319,2,FALSE)","v":"32361"},"5302280","EAST VALLEY (SPK)",0,0,{"$f":"VLOOKUP(B68,'23-24 Adjusted Formula counts'!$A$2:$L$319,8,FALSE)","v":4751},{"$f":"ROUND((F68/$F$5*Assumptions!$D$14*Assumptions!$D$30),0)","v":25495},{"$f":"VLOOKUP(B68,'23-24 Adjusted Formula counts'!$A$2:$L$319,9,FALSE)","v":691},{"$f":"ROUND((H68/$H$5*Assumptions!$D$14*Assumptions!$D$31),0)","v":134632},null,160127,null,null,160127,0,160127,null,0,160127,null,{"$f":"IFERROR(VLOOKUP($A68,#REF!, 21,FALSE),0)","v":0},null,160127,0,58,0,null,"5302280","EAST VALLEY (SPK)"]
[{"$f":"VLOOKUP(B69,CCDDD!$A$3:$B$319,2,FALSE)","v":"39090"},"5305370","EAST VALLEY (YAK)",0,0,{"$f":"VLOOKUP(B69,'23-24 Adjusted Formula counts'!$A$2:$L$319,8,FALSE)","v":3617},{"$f":"ROUND((F69/$F$5*Assumptions!$D$14*Assumptions!$D$30),0)","v":19410},{"$f":"VLOOKUP(B69,'23-24 Adjusted Formula counts'!$A$2:$L$319,9,FALSE)","v":451},{"$f":"ROUND((H69/$H$5*Assumptions!$D$14*Assumptions!$D$31),0)","v":87871},null,107281,null,null,107281,0,107281,null,0,107281,null,{"$f":"IFERROR(VLOOKUP($A69,#REF!, 21,FALSE),0)","v":0},null,107281,0,76,0,null,"5305370","EAST VALLEY (YAK)"]
[{"$f":"VLOOKUP(B70,CCDDD!$A$3:$B$319,2,FALSE)","v":"09206"},"5302310","EASTMONT",0,0,{"$f":"VLOOKUP(B70,'23-24 Adjusted Formula counts'!$A$2:$L$319,8,FALSE)","v":6551},{"$f":"ROUND((F70/$F$5*Assumptions!$D$14*Assumptions!$D$30),0)","v":35154},{"$f":"VLOOKUP(B70,'23-24 Adjusted Formula counts'!$A$2:$L$319,9,FALSE)","v":668},{"$f":"ROUND((H70/$H$5*Assumptions!$D$14*Assumptions!$D$31),0)","v":130151},null,165305,null,null,165305,0,165305,null,0,165305,null,{"$f":"IFERROR(VLOOKUP($A70,#REF!, 21,FALSE),0)","v":0},null,165305,0,56,0,null,"5302310","EASTMONT"]
[{"$f":"VLOOKUP(B71,CCDDD!$A$3:$B$319,2,FALSE)","v":"19028"},"5302340","EASTON",0,0,{"$f":"VLOOKUP(B71,'23-24 Adjusted Formula counts'!$A$2:$L$319,8,FALSE)","v":146},{"$f":"ROUND((F71/$F$5*Assumptions!$D$14*Assumptions!$D$30),0)","v":783},{"$f":"VLOOKUP(B71,'23-24 Adjusted Formula counts'!$A$2:$L$319,9,FALSE)","v":12},{"$f":"ROUND((H71/$H$5*Assumptions!$D$14*Assumptions!$D$31),0)","v":2338},null,{"$f":"ROUNDDOWN(+I71+G71+E71+D71+J71,0)","v":3121},null,null,{"$f":"K71","v":3121},{"$f":"-ROUND(N71/$N$5*$M$5,0)","v":0},{"$f":"+K71+O71+M71","v":3121},null,{"$f":"-1*(P71*Q71)","v":0},{"$f":"+P71+R71","v":3121},null,{"$f":"IFERROR(VLOOKUP($A71,#REF!, 21,FALSE),0)","v":0},null,{"$f":"+S71-U71","v":3121},{"$f":"IF(U71>0,W71/U71,0)","v":0},284,{"$f":"(SUM(D71:E71)/S71)","v":0},null,{"$f":"+B71","v":"5302340"},{"$f":"+C71","v":"EASTON"}]
[{"$f":"VLOOKUP(B72,CCDDD!$A$3:$B$319,2,FALSE)","v":"27404"},"5302370","EATONVILLE",0,0,{"$f":"VLOOKUP(B72,'23-24 Adjusted Formula counts'!$A$2:$L$319,8,FALSE)","v":2240},{"$f":"ROUND((F72/$F$5*Assumptions!$D$14*Assumptions!$D$30),0)","v":12020},{"$f":"VLOOKUP(B72,'23-24 Adjusted Formula counts'!$A$2:$L$319,9,FALSE)","v":210},{"$f":"ROUND((H72/$H$5*Assumptions!$D$14*Assumptions!$D$31),0)","v":40916},null,52936,null,null,52936,0,52936,null,0,52936,null,{"$f":"IFERROR(VLOOKUP($A72,#REF!, 21,FALSE),0)","v":0},null,52936,0,{"$f":"RANK(W72,$W$7:$W$322,0)","v":124},0,null,"5302370","EATONVILLE"]
[{"$f":"VLOOKUP(B73,CCDDD!$A$3:$B$319,2,FALSE)","v":"31015"},"5302400","EDMONDS",0,0,{"$f":"VLOOKUP(B73,'23-24 Adjusted Formula counts'!$A$2:$L$319,8,FALSE)","v":24590},{"$f":"ROUND((F73/$F$5*Assumptions!$D$14*Assumptions!$D$30),0)","v":131956},{"$f":"VLOOKUP(B73,'23-24 Adjusted Formula counts'!$A$2:$L$319,9,FALSE)","v":1911},{"$f":"ROUND((H73/$H$5*Assumptions!$D$14*Assumptions!$D$31),0)","v":372334},null,504290,null,null,504290,0,504290,null,0,504290,null,{"$f":"IFERROR(VLOOKUP($A73,#REF!, 21,FALSE),0)","v":0},null,504290,0,15,0,null,"5302400","EDMONDS"]
[{"$f":"VLOOKUP(B74,CCDDD!$A$3:$B$319,2,FALSE)","v":"19401"},"5302460","ELLENSBURG",0,0,{"$f":"VLOOKUP(B74,'23-24 Adjusted Formula counts'!$A$2:$L$319,8,FALSE)","v":3474},{"$f":"ROUND((F74/$F$5*Assumptions!$D$14*Assumptions!$D$30),0)","v":18642},{"$f":"VLOOKUP(B74,'23-24 Adjusted Formula counts'!$A$2:$L$319,9,FALSE)","v":433},{"$f":"ROUND((H74/$H$5*Assumptions!$D$14*Assumptions!$D$31),0)","v":84364},null,103006,null,null,103006,0,103006,null,0,103006,null,{"$f":"IFERROR(VLOOKUP($A74,#REF!, 21,FALSE),0)","v":0},null,103006,0,80,0,null,"5302460","ELLENSBURG"]
[{"$f":"VLOOKUP(B75,CCDDD!$A$3:$B$319,2,FALSE)","v":"14068"},"5302490","ELMA",0,0,{"$f":"VLOOKUP(B75,'23-24 Adjusted Formula counts'!$A$2:$L$319,8,FALSE)","v":1609},{"$f":"ROUND((F75/$F$5*Assumptions!$D$14*Assumptions!$D$30),0)","v":8634},{"$f":"VLOOKUP(B75,'23-24 Adjusted Formula counts'!$A$2:$L$319,9,FALSE)","v":284},{"$f":"ROUND((H75/$H$5*Assumptions!$D$14*Assumptions!$D$31),0)","v":55334},null,63968,null,null,63968,0,63968,null,0,63968,null,{"$f":"IFERROR(VLOOKUP($A75,#REF!, 21,FALSE),0)","v":0},null,63968,0,108,0,null,"5302490","ELMA"]
[{"$f":"VLOOKUP(B76,CCDDD!$A$3:$B$319,2,FALSE)","v":"38308"},"5302520","ENDICOTT",0,0,{"$f":"VLOOKUP(B76,'23-24 Adjusted Formula counts'!$A$2:$L$319,8,FALSE)","v":87},{"$f":"ROUND((F76/$F$5*Assumptions!$D$14*Assumptions!$D$30),0)","v":467},{"$f":"VLOOKUP(B76,'23-24 Adjusted Formula counts'!$A$2:$L$319,9,FALSE)","v":18},{"$f":"ROUND((H76/$H$5*Assumptions!$D$14*Assumptions!$D$31),0)","v":3507},null,3974,null,null,3974,0,3974,null,0,3974,null,{"$f":"IFERROR(VLOOKUP($A76,#REF!, 21,FALSE),0)","v":0},null,3974,0,275,0,null,"5302520","ENDICOTT"]
[{"$f":"VLOOKUP(B77,CCDDD!$A$3:$B$319,2,FALSE)","v":"04127"},"5302550","ENTIAT",0,0,{"$f":"VLOOKUP(B77,'23-24 Adjusted Formula counts'!$A$2:$L$319,8,FALSE)","v":416},{"$f":"ROUND((F77/$F$5*Assumptions!$D$14*Assumptions!$D$30),0)","v":2232},{"$f":"VLOOKUP(B77,'23-24 Adjusted Formula counts'!$A$2:$L$319,9,FALSE)","v":61},{"$f":"ROUND((H77/$H$5*Assumptions!$D$14*Assumptions!$D$31),0)","v":11885},null,14117,null,null,14117,0,14117,null,0,14117,null,{"$f":"IFERROR(VLOOKUP($A77,#REF!, 21,FALSE),0)","v":0},null,14117,0,210,0,null,"5302550","ENTIAT"]
[{"$f":"VLOOKUP(B78,CCDDD!$A$3:$B$319,2,FALSE)","v":"17216"},"5300001","ENUMCLAW",0,0,{"$f":"VLOOKUP(B78,'23-24 Adjusted Formula counts'!$A$2:$L$319,8,FALSE)","v":4771},{"$f":"ROUND((F78/$F$5*Assumptions!$D$14*Assumptions!$D$30),0)","v":25602},{"$f":"VLOOKUP(B78,'23-24 Adjusted Formula counts'!$A$2:$L$319,9,FALSE)","v":339},{"$f":"ROUND((H78/$H$5*Assumptions!$D$14*Assumptions!$D$31),0)","v":66050},null,91652,null,null,91652,0,91652,null,0,91652,null,{"$f":"IFERROR(VLOOKUP($A78,#REF!, 21,FALSE),0)","v":0},null,91652,0,84,0,null,"5300001","ENUMCLAW"]
[{"$f":"VLOOKUP(B79,CCDDD!$A$3:$B$319,2,FALSE)","v":"13165"},"5302610","EPHRATA",0,0,{"$f":"VLOOKUP(B79,'23-24 Adjusted Formula counts'!$A$2:$L$319,8,FALSE)","v":2954},{"$f":"ROUND((F79/$F$5*Assumptions!$D$14*Assumptions!$D$30),0)","v":15852},{"$f":"VLOOKUP(B79,'23-24 Adjusted Formula counts'!$A$2:$L$319,9,FALSE)","v":340},{"$f":"ROUND((H79/$H$5*Assumptions!$D$14*Assumptions!$D$31),0)","v":66245},null,82097,null,null,82097,0,82097,null,0,82097,null,{"$f":"IFERROR(VLOOKUP($A79,#REF!, 21,FALSE),0)","v":0},null,82097,0,92,0,null,"5302610","EPHRATA"]
[{"$f":"VLOOKUP(B80,CCDDD!$A$3:$B$319,2,FALSE)","v":"21036"},"5302640","EVALINE",0,0,{"$f":"VLOOKUP(B80,'23-24 Adjusted Formula counts'!$A$2:$L$319,8,FALSE)","v":128},{"$f":"ROUND((F80/$F$5*Assumptions!$D$14*Assumptions!$D$30),0)","v":687},{"$f":"VLOOKUP(B80,'23-24 Adjusted Formula counts'!$A$2:$L$319,9,FALSE)","v":18},{"$f":"ROUND((H80/$H$5*Assumptions!$D$14*Assumptions!$D$31),0)","v":3507},null,4194,null,null,4194,0,4194,null,0,4194,null,{"$f":"IFERROR(VLOOKUP($A80,#REF!, 21,FALSE),0)","v":0},null,4194,0,273,0,null,"5302640","EVALINE"]
[{"$f":"VLOOKUP(B81,CCDDD!$A$3:$B$319,2,FALSE)","v":"31002"},"5302670","EVERETT",0,0,{"$f":"VLOOKUP(B81,'23-24 Adjusted Formula counts'!$A$2:$L$319,8,FALSE)","v":23124},{"$f":"ROUND((F81/$F$5*Assumptions!$D$14*Assumptions!$D$30),0)","v":124089},{"$f":"VLOOKUP(B81,'23-24 Adjusted Formula counts'!$A$2:$L$319,9,FALSE)","v":1895},{"$f":"ROUND((H81/$H$5*Assumptions!$D$14*Assumptions!$D$31),0)","v":369216},null,493305,null,null,493305,0,493305,null,0,493305,null,{"$f":"IFERROR(VLOOKUP($A81,#REF!, 21,FALSE),0)","v":0},null,493305,0,17,0,null,"5302670","EVERETT"]
[{"$f":"VLOOKUP(B82,CCDDD!$A$3:$B$319,2,FALSE)","v":"06114"},"5302700","EVERGREEN (CLARK)",0,0,{"$f":"VLOOKUP(B82,'23-24 Adjusted Formula counts'!$A$2:$L$319,8,FALSE)","v":27238},{"$f":"ROUND((F82/$F$5*Assumptions!$D$14*Assumptions!$D$30),0)","v":146166},{"$f":"VLOOKUP(B82,'23-24 Adjusted Formula counts'!$A$2:$L$319,9,FALSE)","v":2969},{"$f":"ROUND((H82/$H$5*Assumptions!$D$14*Assumptions!$D$31),0)","v":578471},null,724637,null,null,724637,0,724637,null,0,724637,null,{"$f":"IFERROR(VLOOKUP($A82,#REF!, 21,FALSE),0)","v":0},null,724637,0,9,0,null,"5302700","EVERGREEN (CLARK)"]
[{"$f":"VLOOKUP(B83,CCDDD!$A$3:$B$319,2,FALSE)","v":"33205"},"5302730","EVERGREEN (STEV)",0,0,{"$f":"VLOOKUP(B83,'23-24 Adjusted Formula counts'!$A$2:$L$319,8,FALSE)","v":57},{"$f":"ROUND((F83/$F$5*Assumptions!$D$14*Assumptions!$D$30),0)","v":306},{"$f":"VLOOKUP(B83,'23-24 Adjusted Formula counts'!$A$2:$L$319,9,FALSE)","v":18},{"$f":"ROUND((H83/$H$5*Assumptions!$D$14*Assumptions!$D$31),0)","v":3507},null,3813,null,null,3813,0,3813,null,0,3813,null,{"$f":"IFERROR(VLOOKUP($A83,#REF!, 21,FALSE),0)","v":0},null,3813,0,277,0,null,"5302730","EVERGREEN (STEV)"]
[{"$f":"VLOOKUP(B84,CCDDD!$A$3:$B$319,2,FALSE)","v":"17210"},"5302820","FEDERAL WAY",0,0,{"$f":"VLOOKUP(B84,'23-24 Adjusted Formula counts'!$A$2:$L$319,8,FALSE)","v":24624},{"$f":"ROUND((F84/$F$5*Assumptions!$D$14*Assumptions!$D$30),0)","v":132138},{"$f":"VLOOKUP(B84,'23-24 Adjusted Formula counts'!$A$2:$L$319,9,FALSE)","v":4027},{"$f":"ROUND((H84/$H$5*Assumptions!$D$14*Assumptions!$D$31),0)","v":784609},null,916747,null,null,916747,0,916747,null,0,916747,null,{"$f":"IFERROR(VLOOKUP($A84,#REF!, 21,FALSE),0)","v":0},null,916747,0,5,0,null,"5302820","FEDERAL WAY"]
[{"$f":"VLOOKUP(B85,CCDDD!$A$3:$B$319,2,FALSE)","v":"37502"},"5302850","FERNDALE",0,0,{"$f":"VLOOKUP(B85,'23-24 Adjusted Formula counts'!$A$2:$L$319,8,FALSE)","v":6288},{"$f":"ROUND((F85/$F$5*Assumptions!$D$14*Assumptions!$D$30),0)","v":33743},{"$f":"VLOOKUP(B85,'23-24 Adjusted Formula counts'!$A$2:$L$319,9,FALSE)","v":1010},{"$f":"ROUND((H85/$H$5*Assumptions!$D$14*Assumptions!$D$31),0)","v":196785},null,230528,null,null,230528,0,230528,null,0,230528,null,{"$f":"IFERROR(VLOOKUP($A85,#REF!, 21,FALSE),0)","v":0},null,230528,0,39,0,null,"5302850","FERNDALE"]
[{"$f":"VLOOKUP(B86,CCDDD!$A$3:$B$319,2,FALSE)","v":"27417"},"5302880","FIFE",0,0,{"$f":"VLOOKUP(B86,'23-24 Adjusted Formula counts'!$A$2:$L$319,8,FALSE)","v":4139},{"$f":"ROUND((F86/$F$5*Assumptions!$D$14*Assumptions!$D$30),0)","v":22211},{"$f":"VLOOKUP(B86,'23-24 Adjusted Formula counts'!$A$2:$L$319,9,FALSE)","v":404},{"$f":"ROUND((H86/$H$5*Assumptions!$D$14*Assumptions!$D$31),0)","v":78714},null,100925,null,null,100925,0,100925,null,0,100925,null,{"$f":"IFERROR(VLOOKUP($A86,#REF!, 21,FALSE),0)","v":0},null,100925,0,81,0,null,"5302880","FIFE"]
[{"$f":"VLOOKUP(B87,CCDDD!$A$3:$B$319,2,FALSE)","v":"03053"},"5302910","FINLEY",0,0,{"$f":"VLOOKUP(B87,'23-24 Adjusted Formula counts'!$A$2:$L$319,8,FALSE)","v":907},{"$f":"ROUND((F87/$F$5*Assumptions!$D$14*Assumptions!$D$30),0)","v":4867},{"$f":"VLOOKUP(B87,'23-24 Adjusted Formula counts'!$A$2:$L$319,9,FALSE)","v":135},{"$f":"ROUND((H87/$H$5*Assumptions!$D$14*Assumptions!$D$31),0)","v":26303},null,31170,null,null,31170,0,31170,null,0,31170,null,{"$f":"IFERROR(VLOOKUP($A87,#REF!, 21,FALSE),0)","v":0},null,31170,0,161,0,null,"5302910","FINLEY"]
[{"$f":"VLOOKUP(B88,CCDDD!$A$3:$B$319,2,FALSE)","v":"27402"},"5302940","FRANKLIN PIERCE",0,0,{"$f":"VLOOKUP(B88,'23-24 Adjusted Formula counts'!$A$2:$L$319,8,FALSE)","v":9422},{"$f":"ROUND((F88/$F$5*Assumptions!$D$14*Assumptions!$D$30),0)","v":50561},{"$f":"VLOOKUP(B88,'23-24 Adjusted Formula counts'!$A$2:$L$319,9,FALSE)","v":1236},{"$f":"ROUND((H88/$H$5*Assumptions!$D$14*Assumptions!$D$31),0)","v":240819},null,291380,null,null,291380,0,291380,null,0,291380,null,{"$f":"IFERROR(VLOOKUP($A88,#REF!, 21,FALSE),0)","v":0},null,291380,0,31,0,null,"5302940","FRANKLIN PIERCE"]
[{"$f":"VLOOKUP(B89,CCDDD!$A$3:$B$319,2,FALSE)","v":"32358"},"5302970","FREEMAN",0,0,{"$f":"VLOOKUP(B89,'23-24 Adjusted Formula counts'!$A$2:$L$319,8,FALSE)","v":1009},{"$f":"ROUND((F89/$F$5*Assumptions!$D$14*Assumptions!$D$30),0)","v":5415},{"$f":"VLOOKUP(B89,'23-24 Adjusted Formula counts'!$A$2:$L$319,9,FALSE)","v":57},{"$f":"ROUND((H89/$H$5*Assumptions!$D$14*Assumptions!$D$31),0)","v":11106},null,16521,null,null,16521,0,16521,null,0,16521,null,{"$f":"IFERROR(VLOOKUP($A89,#REF!, 21,FALSE),0)","v":0},null,16521,0,197,0,null,"5302970","FREEMAN"]
[{"$f":"VLOOKUP(B90,CCDDD!$A$3:$B$319,2,FALSE)","v":"38302"},"5303000","GARFIELD",0,0,{"$f":"VLOOKUP(B90,'23-24 Adjusted Formula counts'!$A$2:$L$319,8,FALSE)","v":128},{"$f":"ROUND((F90/$F$5*Assumptions!$D$14*Assumptions!$D$30),0)","v":687},{"$f":"VLOOKUP(B90,'23-24 Adjusted Formula counts'!$A$2:$L$319,9,FALSE)","v":23},{"$f":"ROUND((H90/$H$5*Assumptions!$D$14*Assumptions!$D$31),0)","v":4481},null,5168,null,null,5168,0,5168,null,0,5168,null,{"$f":"IFERROR(VLOOKUP($A90,#REF!, 21,FALSE),0)","v":0},null,5168,0,263,0,null,"5303000","GARFIELD"]
[{"$f":"VLOOKUP(B91,CCDDD!$A$3:$B$319,2,FALSE)","v":"20401"},"5303030","GLENWOOD",0,0,{"$f":"VLOOKUP(B91,'23-24 Adjusted Formula counts'!$A$2:$L$319,8,FALSE)","v":62},{"$f":"ROUND((F91/$F$5*Assumptions!$D$14*Assumptions!$D$30),0)","v":333},{"$f":"VLOOKUP(B91,'23-24 Adjusted Formula counts'!$A$2:$L$319,9,FALSE)","v":16},{"$f":"ROUND((H91/$H$5*Assumptions!$D$14*Assumptions!$D$31),0)","v":3117},null,3450,null,null,3450,0,3450,null,0,3450,null,{"$f":"IFERROR(VLOOKUP($A91,#REF!, 21,FALSE),0)","v":0},null,3450,0,278,0,null,"5303030","GLENWOOD"]
[{"$f":"VLOOKUP(B92,CCDDD!$A$3:$B$319,2,FALSE)","v":"20404"},"5303090","GOLDENDALE",0,0,{"$f":"VLOOKUP(B92,'23-24 Adjusted Formula counts'!$A$2:$L$319,8,FALSE)","v":1077},{"$f":"ROUND((F92/$F$5*Assumptions!$D$14*Assumptions!$D$30),0)","v":5779},{"$f":"VLOOKUP(B92,'23-24 Adjusted Formula counts'!$A$2:$L$319,9,FALSE)","v":241},{"$f":"ROUND((H92/$H$5*Assumptions!$D$14*Assumptions!$D$31),0)","v":46956},null,52735,null,null,52735,0,52735,null,0,52735,null,{"$f":"IFERROR(VLOOKUP($A92,#REF!, 21,FALSE),0)","v":0},null,52735,0,125,0,null,"5303090","GOLDENDALE"]
[{"$f":"VLOOKUP(B93,CCDDD!$A$3:$B$319,2,FALSE)","v":"13301"},"5303130","GRAND COULEE",0,0,{"$f":"VLOOKUP(B93,'23-24 Adjusted Formula counts'!$A$2:$L$319,8,FALSE)","v":686},{"$f":"ROUND((F93/$F$5*Assumptions!$D$14*Assumptions!$D$30),0)","v":3681},{"$f":"VLOOKUP(B93,'23-24 Adjusted Formula counts'!$A$2:$L$319,9,FALSE)","v":88},{"$f":"ROUND((H93/$H$5*Assumptions!$D$14*Assumptions!$D$31),0)","v":17146},null,20827,null,null,20827,0,20827,null,0,20827,null,{"$f":"IFERROR(VLOOKUP($A93,#REF!, 21,FALSE),0)","v":0},null,20827,0,185,0,null,"5303130","GRAND COULEE"]
[{"$f":"VLOOKUP(B94,CCDDD!$A$3:$B$319,2,FALSE)","v":"39200"},"5303150","GRANDVIEW",0,0,{"$f":"VLOOKUP(B94,'23-24 Adjusted Formula counts'!$A$2:$L$319,8,FALSE)","v":3793},{"$f":"ROUND((F94/$F$5*Assumptions!$D$14*Assumptions!$D$30),0)","v":20354},{"$f":"VLOOKUP(B94,'23-24 Adjusted Formula counts'!$A$2:$L$319,9,FALSE)","v":621},{"$f":"ROUND((H94/$H$5*Assumptions!$D$14*Assumptions!$D$31),0)","v":120994},null,141348,null,null,141348,0,141348,null,0,141348,null,{"$f":"IFERROR(VLOOKUP($A94,#REF!, 21,FALSE),0)","v":0},null,141348,0,64,0,null,"5303150","GRANDVIEW"]
[{"$f":"VLOOKUP(B95,CCDDD!$A$3:$B$319,2,FALSE)","v":"39204"},"5303180","GRANGER",0,0,{"$f":"VLOOKUP(B95,'23-24 Adjusted Formula counts'!$A$2:$L$319,8,FALSE)","v":1614},{"$f":"ROUND((F95/$F$5*Assumptions!$D$14*Assumptions!$D$30),0)","v":8661},{"$f":"VLOOKUP(B95,'23-24 Adjusted Formula counts'!$A$2:$L$319,9,FALSE)","v":353},{"$f":"ROUND((H95/$H$5*Assumptions!$D$14*Assumptions!$D$31),0)","v":68777},null,77438,null,null,77438,0,77438,null,0,77438,null,{"$f":"IFERROR(VLOOKUP($A95,#REF!, 21,FALSE),0)","v":0},null,77438,0,99,0,null,"5303180","GRANGER"]
[{"$f":"VLOOKUP(B96,CCDDD!$A$3:$B$319,2,FALSE)","v":"31332"},"5303210","GRANITE FALLS",0,0,{"$f":"VLOOKUP(B96,'23-24 Adjusted Formula counts'!$A$2:$L$319,8,FALSE)","v":2837},{"$f":"ROUND((F96/$F$5*Assumptions!$D$14*Assumptions!$D$30),0)","v":15224},{"$f":"VLOOKUP(B96,'23-24 Adjusted Formula counts'!$A$2:$L$319,9,FALSE)","v":209},{"$f":"ROUND((H96/$H$5*Assumptions!$D$14*Assumptions!$D$31),0)","v":40721},null,55945,null,null,55945,0,55945,null,0,55945,null,{"$f":"IFERROR(VLOOKUP($A96,#REF!, 21,FALSE),0)","v":0},null,55945,0,120,0,null,"5303210","GRANITE FALLS"]
[{"$f":"VLOOKUP(B97,CCDDD!$A$3:$B$319,2,FALSE)","v":"23054"},"5303240","GRAPEVIEW",0,0,{"$f":"VLOOKUP(B97,'23-24 Adjusted Formula counts'!$A$2:$L$319,8,FALSE)","v":341},{"$f":"ROUND((F97/$F$5*Assumptions!$D$14*Assumptions!$D$30),0)","v":1830},{"$f":"VLOOKUP(B97,'23-24 Adjusted Formula counts'!$A$2:$L$319,9,FALSE)","v":46},{"$f":"ROUND((H97/$H$5*Assumptions!$D$14*Assumptions!$D$31),0)","v":8963},null,10793,null,null,10793,0,10793,null,0,10793,null,{"$f":"IFERROR(VLOOKUP($A97,#REF!, 21,FALSE),0)","v":0},null,10793,0,230,0,null,"5303240","GRAPEVIEW"]
[{"$f":"VLOOKUP(B98,CCDDD!$A$3:$B$319,2,FALSE)","v":"32312"},"5303270","GREAT NORTHERN",0,0,{"$f":"VLOOKUP(B98,'23-24 Adjusted Formula counts'!$A$2:$L$319,8,FALSE)","v":189},{"$f":"ROUND((F98/$F$5*Assumptions!$D$14*Assumptions!$D$30),0)","v":1014},{"$f":"VLOOKUP(B98,'23-24 Adjusted Formula counts'!$A$2:$L$319,9,FALSE)","v":44},{"$f":"ROUND((H98/$H$5*Assumptions!$D$14*Assumptions!$D$31),0)","v":8573},null,9587,null,null,9587,0,9587,null,0,9587,null,{"$f":"IFERROR(VLOOKUP($A98,#REF!, 21,FALSE),0)","v":0},null,9587,0,234,0,null,"5303270","GREAT NORTHERN"]
[{"$f":"VLOOKUP(B99,CCDDD!$A$3:$B$319,2,FALSE)","v":"17910"},"5303280","RAINIER VALLEY CHARTER",0,0,{"$f":"VLOOKUP(B99,'23-24 Adjusted Formula counts'!$A$2:$L$319,8,FALSE)","v":200.3237432},{"$f":"ROUND((F99/$F$5*Assumptions!$D$14*Assumptions!$D$30),0)","v":1075},{"$f":"VLOOKUP(B99,'23-24 Adjusted Formula counts'!$A$2:$L$319,9,FALSE)","v":50.213772229999996},{"$f":"ROUND((H99/$H$5*Assumptions!$D$14*Assumptions!$D$31),0)","v":9784},null,10859,null,null,10859,0,10859,null,0,10859,null,{"$f":"IFERROR(VLOOKUP($A99,#REF!, 21,FALSE),0)","v":0},null,10859,0,229,0,null,"5303280","RAINIER VALLEY CHARTER"]
[{"$f":"VLOOKUP(B100,CCDDD!$A$3:$B$319,2,FALSE)","v":"06103"},"5303300","GREEN MOUNTAIN",0,0,{"$f":"VLOOKUP(B100,'23-24 Adjusted Formula counts'!$A$2:$L$319,8,FALSE)","v":209},{"$f":"ROUND((F100/$F$5*Assumptions!$D$14*Assumptions!$D$30),0)","v":1122},{"$f":"VLOOKUP(B100,'23-24 Adjusted Formula counts'!$A$2:$L$319,9,FALSE)","v":18},{"$f":"ROUND((H100/$H$5*Assumptions!$D$14*Assumptions!$D$31),0)","v":3507},null,4629,null,null,4629,0,4629,null,0,4629,null,{"$f":"IFERROR(VLOOKUP($A100,#REF!, 21,FALSE),0)","v":0},null,4629,0,269,0,null,"5303300","GREEN MOUNTAIN"]
[{"$f":"VLOOKUP(B101,CCDDD!$A$3:$B$319,2,FALSE)","v":"34324"},"5303330","GRIFFIN",0,0,{"$f":"VLOOKUP(B101,'23-24 Adjusted Formula counts'!$A$2:$L$319,8,FALSE)","v":913},{"$f":"ROUND((F101/$F$5*Assumptions!$D$14*Assumptions!$D$30),0)","v":4899},{"$f":"VLOOKUP(B101,'23-24 Adjusted Formula counts'!$A$2:$L$319,9,FALSE)","v":66},{"$f":"ROUND((H101/$H$5*Assumptions!$D$14*Assumptions!$D$31),0)","v":12859},null,17758,null,null,17758,0,17758,null,0,17758,null,{"$f":"IFERROR(VLOOKUP($A101,#REF!, 21,FALSE),0)","v":0},null,17758,0,193,0,null,"5303330","GRIFFIN"]
[{"$f":"VLOOKUP(B102,CCDDD!$A$3:$B$319,2,FALSE)","v":"22204"},"5303360","HARRINGTON",0,0,{"$f":"VLOOKUP(B102,'23-24 Adjusted Formula counts'!$A$2:$L$319,8,FALSE)","v":141},{"$f":"ROUND((F102/$F$5*Assumptions!$D$14*Assumptions!$D$30),0)","v":757},{"$f":"VLOOKUP(B102,'23-24 Adjusted Formula counts'!$A$2:$L$319,9,FALSE)","v":18},{"$f":"ROUND((H102/$H$5*Assumptions!$D$14*Assumptions!$D$31),0)","v":3507},null,4264,null,null,4264,0,4264,null,0,4264,null,{"$f":"IFERROR(VLOOKUP($A102,#REF!, 21,FALSE),0)","v":0},null,4264,0,272,0,null,"5303360","HARRINGTON"]
[{"$f":"VLOOKUP(B103,CCDDD!$A$3:$B$319,2,FALSE)","v":"39203"},"5303510","HIGHLAND",0,0,{"$f":"VLOOKUP(B103,'23-24 Adjusted Formula counts'!$A$2:$L$319,8,FALSE)","v":1293},{"$f":"ROUND((F103/$F$5*Assumptions!$D$14*Assumptions!$D$30),0)","v":6939},{"$f":"VLOOKUP(B103,'23-24 Adjusted Formula counts'!$A$2:$L$319,9,FALSE)","v":225},{"$f":"ROUND((H103/$H$5*Assumptions!$D$14*Assumptions!$D$31),0)","v":43838},null,50777,null,null,50777,0,50777,null,0,50777,null,{"$f":"IFERROR(VLOOKUP($A103,#REF!, 21,FALSE),0)","v":0},null,50777,0,127,0,null,"5303510","HIGHLAND"]
[{"$f":"VLOOKUP(B104,CCDDD!$A$3:$B$319,2,FALSE)","v":"17401"},"5303540","HIGHLINE",0,0,{"$f":"VLOOKUP(B104,'23-24 Adjusted Formula counts'!$A$2:$L$319,8,FALSE)","v":19915.901239999999},{"$f":"ROUND((F104/$F$5*Assumptions!$D$14*Assumptions!$D$30),0)","v":106874},{"$f":"VLOOKUP(B104,'23-24 Adjusted Formula counts'!$A$2:$L$319,9,FALSE)","v":3358.9087370000002},{"$f":"ROUND((H104/$H$5*Assumptions!$D$14*Assumptions!$D$31),0)","v":654440},null,761314,null,null,761314,0,761314,null,0,761314,null,{"$f":"IFERROR(VLOOKUP($A104,#REF!, 21,FALSE),0)","v":0},null,761314,0,7,0,null,"5303540","HIGHLINE"]
[{"$f":"VLOOKUP(B105,CCDDD!$A$3:$B$319,2,FALSE)","v":"06098"},"5303570","HOCKINSON",0,0,{"$f":"VLOOKUP(B105,'23-24 Adjusted Formula counts'!$A$2:$L$319,8,FALSE)","v":2219},{"$f":"ROUND((F105/$F$5*Assumptions!$D$14*Assumptions!$D$30),0)","v":11908},{"$f":"VLOOKUP(B105,'23-24 Adjusted Formula counts'!$A$2:$L$319,9,FALSE)","v":143},{"$f":"ROUND((H105/$H$5*Assumptions!$D$14*Assumptions!$D$31),0)","v":27862},null,39770,null,null,39770,0,39770,null,0,39770,null,{"$f":"IFERROR(VLOOKUP($A105,#REF!, 21,FALSE),0)","v":0},null,39770,0,144,0,null,"5303570","HOCKINSON"]
[{"$f":"VLOOKUP(B106,CCDDD!$A$3:$B$319,2,FALSE)","v":"23404"},"5303600","HOOD CANAL",0,0,{"$f":"VLOOKUP(B106,'23-24 Adjusted Formula counts'!$A$2:$L$319,8,FALSE)","v":700},{"$f":"ROUND((F106/$F$5*Assumptions!$D$14*Assumptions!$D$30),0)","v":3756},{"$f":"VLOOKUP(B106,'23-24 Adjusted Formula counts'!$A$2:$L$319,9,FALSE)","v":137},{"$f":"ROUND((H106/$H$5*Assumptions!$D$14*Assumptions!$D$31),0)","v":26693},null,30449,null,null,30449,0,30449,null,0,30449,null,{"$f":"IFERROR(VLOOKUP($A106,#REF!, 21,FALSE),0)","v":0},null,30449,0,164,0,null,"5303600","HOOD CANAL"]
[{"$f":"VLOOKUP(B107,CCDDD!$A$3:$B$319,2,FALSE)","v":"14028"},"5303660","HOQUIAM",0,0,{"$f":"VLOOKUP(B107,'23-24 Adjusted Formula counts'!$A$2:$L$319,8,FALSE)","v":1840},{"$f":"ROUND((F107/$F$5*Assumptions!$D$14*Assumptions!$D$30),0)","v":9874},{"$f":"VLOOKUP(B107,'23-24 Adjusted Formula counts'!$A$2:$L$319,9,FALSE)","v":403},{"$f":"ROUND((H107/$H$5*Assumptions!$D$14*Assumptions!$D$31),0)","v":78519},null,88393,null,null,88393,0,88393,null,0,88393,null,{"$f":"IFERROR(VLOOKUP($A107,#REF!, 21,FALSE),0)","v":0},null,88393,0,88,0,null,"5303660","HOQUIAM"]
[{"$f":"VLOOKUP(B108,CCDDD!$A$3:$B$319,2,FALSE)","v":"27902"},"5303705","IMPACT COMMENCEMENT BAY CHARTER",0,0,{"$f":"VLOOKUP(B108,'23-24 Adjusted Formula counts'!$A$2:$L$319,8,FALSE)","v":401.13095240000001},{"$f":"ROUND((F108/$F$5*Assumptions!$D$14*Assumptions!$D$30),0)","v":2153},{"$f":"VLOOKUP(B108,'23-24 Adjusted Formula counts'!$A$2:$L$319,9,FALSE)","v":54.706976150000003},{"$f":"ROUND((H108/$H$5*Assumptions!$D$14*Assumptions!$D$31),0)","v":10659},null,12812,null,null,12812,0,12812,null,0,12812,null,{"$f":"IFERROR(VLOOKUP($A108,#REF!, 21,FALSE),0)","v":0},null,12812,0,217,0,null,"5303705","IMPACT COMMENCEMENT BAY CHARTER"]
[{"$f":"VLOOKUP(B109,CCDDD!$A$3:$B$319,2,FALSE)","v":"17911"},"5303700","IMPACT PUGET SOUND CHARTER",0,0,{"$f":"VLOOKUP(B109,'23-24 Adjusted Formula counts'!$A$2:$L$319,8,FALSE)","v":511.06752590000002},{"$f":"ROUND((F109/$F$5*Assumptions!$D$14*Assumptions!$D$30),0)","v":2743},{"$f":"VLOOKUP(B109,'23-24 Adjusted Formula counts'!$A$2:$L$319,9,FALSE)","v":102.70357},{"$f":"ROUND((H109/$H$5*Assumptions!$D$14*Assumptions!$D$31),0)","v":20010},null,22753,null,null,22753,0,22753,null,0,22753,null,{"$f":"IFERROR(VLOOKUP($A109,#REF!, 21,FALSE),0)","v":0},null,22753,0,181,0,null,"5303700","IMPACT PUGET SOUND CHARTER"]
[{"$f":"VLOOKUP(B110,CCDDD!$A$3:$B$319,2,FALSE)","v":"17916"},"5303710","IMPACT SALISH SEA CHARTER",0,0,{"$f":"VLOOKUP(B110,'23-24 Adjusted Formula counts'!$A$2:$L$319,8,FALSE)","v":298.97450270000002},{"$f":"ROUND((F110/$F$5*Assumptions!$D$14*Assumptions!$D$30),0)","v":1604},{"$f":"VLOOKUP(B110,'23-24 Adjusted Formula counts'!$A$2:$L$319,9,FALSE)","v":56.070597669999998},{"$f":"ROUND((H110/$H$5*Assumptions!$D$14*Assumptions!$D$31),0)","v":10925},null,12529,null,null,12529,0,12529,null,0,12529,null,{"$f":"IFERROR(VLOOKUP($A110,#REF!, 21,FALSE),0)","v":0},null,12529,0,219,0,null,"5303710","IMPACT SALISH SEA CHARTER"]
[{"$f":"VLOOKUP(B111,CCDDD!$A$3:$B$319,2,FALSE)","v":"10070"},"5300002","INCHELIUM",0,0,{"$f":"VLOOKUP(B111,'23-24 Adjusted Formula counts'!$A$2:$L$319,8,FALSE)","v":182},{"$f":"ROUND((F111/$F$5*Assumptions!$D$14*Assumptions!$D$30),0)","v":977},{"$f":"VLOOKUP(B111,'23-24 Adjusted Formula counts'!$A$2:$L$319,9,FALSE)","v":44},{"$f":"ROUND((H111/$H$5*Assumptions!$D$14*Assumptions!$D$31),0)","v":8573},null,9550,null,null,9550,0,9550,null,0,9550,null,{"$f":"IFERROR(VLOOKUP($A111,#REF!, 21,FALSE),0)","v":0},null,9550,0,236,0,null,"5300002","INCHELIUM"]
[{"$f":"VLOOKUP(B112,CCDDD!$A$3:$B$319,2,FALSE)","v":"31063"},"5303720","INDEX",0,0,{"$f":"VLOOKUP(B112,'23-24 Adjusted Formula counts'!$A$2:$L$319,8,FALSE)","v":55},{"$f":"ROUND((F112/$F$5*Assumptions!$D$14*Assumptions!$D$30),0)","v":295},{"$f":"VLOOKUP(B112,'23-24 Adjusted Formula counts'!$A$2:$L$319,9,FALSE)","v":9},{"$f":"ROUND((H112/$H$5*Assumptions!$D$14*Assumptions!$D$31),0)","v":1754},null,2049,null,null,2049,0,2049,null,0,2049,null,{"$f":"IFERROR(VLOOKUP($A112,#REF!, 21,FALSE),0)","v":0},null,2049,0,301,0,null,"5303720","INDEX"]
[{"$f":"VLOOKUP(B113,CCDDD!$A$3:$B$319,2,FALSE)","v":"17411"},"5303750","ISSAQUAH",0,0,{"$f":"VLOOKUP(B113,'23-24 Adjusted Formula counts'!$A$2:$L$319,8,FALSE)","v":23245},{"$f":"ROUND((F113/$F$5*Assumptions!$D$14*Assumptions!$D$30),0)","v":124738},{"$f":"VLOOKUP(B113,'23-24 Adjusted Formula counts'!$A$2:$L$319,9,FALSE)","v":936},{"$f":"ROUND((H113/$H$5*Assumptions!$D$14*Assumptions!$D$31),0)","v":182367},null,307105,null,null,307105,0,307105,null,0,307105,null,{"$f":"IFERROR(VLOOKUP($A113,#REF!, 21,FALSE),0)","v":0},null,307105,0,28,0,null,"5303750","ISSAQUAH"]
[{"$f":"VLOOKUP(B114,CCDDD!$A$3:$B$319,2,FALSE)","v":"11056"},"5303780","KAHLOTUS",0,0,{"$f":"VLOOKUP(B114,'23-24 Adjusted Formula counts'!$A$2:$L$319,8,FALSE)","v":61},{"$f":"ROUND((F114/$F$5*Assumptions!$D$14*Assumptions!$D$30),0)","v":327},{"$f":"VLOOKUP(B114,'23-24 Adjusted Formula counts'!$A$2:$L$319,9,FALSE)","v":14},{"$f":"ROUND((H114/$H$5*Assumptions!$D$14*Assumptions!$D$31),0)","v":2728},null,3055,null,null,3055,0,3055,null,0,3055,null,{"$f":"IFERROR(VLOOKUP($A114,#REF!, 21,FALSE),0)","v":0},null,3055,0,285,0,null,"5303780","KAHLOTUS"]
[{"$f":"VLOOKUP(B115,CCDDD!$A$3:$B$319,2,FALSE)","v":"08402"},"5303810","KALAMA",0,0,{"$f":"VLOOKUP(B115,'23-24 Adjusted Formula counts'!$A$2:$L$319,8,FALSE)","v":1360},{"$f":"ROUND((F115/$F$5*Assumptions!$D$14*Assumptions!$D$30),0)","v":7298},{"$f":"VLOOKUP(B115,'23-24 Adjusted Formula counts'!$A$2:$L$319,9,FALSE)","v":122},{"$f":"ROUND((H115/$H$5*Assumptions!$D$14*Assumptions!$D$31),0)","v":23770},null,31068,null,null,31068,0,31068,null,0,31068,null,{"$f":"IFERROR(VLOOKUP($A115,#REF!, 21,FALSE),0)","v":0},null,31068,0,162,0,null,"5303810","KALAMA"]
[{"$f":"VLOOKUP(B116,CCDDD!$A$3:$B$319,2,FALSE)","v":"10003"},"5303870","KELLER",0,0,{"$f":"VLOOKUP(B116,'23-24 Adjusted Formula counts'!$A$2:$L$319,8,FALSE)","v":100},{"$f":"ROUND((F116/$F$5*Assumptions!$D$14*Assumptions!$D$30),0)","v":537},{"$f":"VLOOKUP(B116,'23-24 Adjusted Formula counts'!$A$2:$L$319,9,FALSE)","v":30},{"$f":"ROUND((H116/$H$5*Assumptions!$D$14*Assumptions!$D$31),0)","v":5845},null,6382,null,null,6382,0,6382,null,0,6382,null,{"$f":"IFERROR(VLOOKUP($A116,#REF!, 21,FALSE),0)","v":0},null,6382,0,254,0,null,"5303870","KELLER"]
[{"$f":"VLOOKUP(B117,CCDDD!$A$3:$B$319,2,FALSE)","v":"08458"},"5300003","KELSO",0,0,{"$f":"VLOOKUP(B117,'23-24 Adjusted Formula counts'!$A$2:$L$319,8,FALSE)","v":5497},{"$f":"ROUND((F117/$F$5*Assumptions!$D$14*Assumptions!$D$30),0)","v":29498},{"$f":"VLOOKUP(B117,'23-24 Adjusted Formula counts'!$A$2:$L$319,9,FALSE)","v":855},{"$f":"ROUND((H117/$H$5*Assumptions!$D$14*Assumptions!$D$31),0)","v":166586},null,196084,null,null,196084,0,196084,null,0,196084,null,{"$f":"IFERROR(VLOOKUP($A117,#REF!, 21,FALSE),0)","v":0},null,196084,0,43,0,null,"5300003","KELSO"]
[{"$f":"VLOOKUP(B118,CCDDD!$A$3:$B$319,2,FALSE)","v":"03017"},"5303930","KENNEWICK",0,0,{"$f":"VLOOKUP(B118,'23-24 Adjusted Formula counts'!$A$2:$L$319,8,FALSE)","v":20458},{"$f":"ROUND((F118/$F$5*Assumptions!$D$14*Assumptions!$D$30),0)","v":109783},{"$f":"VLOOKUP(B118,'23-24 Adjusted Formula counts'!$A$2:$L$319,9,FALSE)","v":2558},{"$f":"ROUND((H118/$H$5*Assumptions!$D$14*Assumptions!$D$31),0)","v":498393},null,608176,null,null,608176,0,608176,null,0,608176,null,{"$f":"IFERROR(VLOOKUP($A118,#REF!, 21,FALSE),0)","v":0},null,608176,0,12,0,null,"5303930","KENNEWICK"]
[{"$f":"VLOOKUP(B119,CCDDD!$A$3:$B$319,2,FALSE)","v":"17415"},"5303960","KENT",0,0,{"$f":"VLOOKUP(B119,'23-24 Adjusted Formula counts'!$A$2:$L$319,8,FALSE)","v":30689},{"$f":"ROUND((F119/$F$5*Assumptions!$D$14*Assumptions!$D$30),0)","v":164685},{"$f":"VLOOKUP(B119,'23-24 Adjusted Formula counts'!$A$2:$L$319,9,FALSE)","v":4485},{"$f":"ROUND((H119/$H$5*Assumptions!$D$14*Assumptions!$D$31),0)","v":873844},null,1038529,null,null,1038529,0,1038529,null,0,1038529,null,{"$f":"IFERROR(VLOOKUP($A119,#REF!, 21,FALSE),0)","v":0},null,1038529,0,3,0,null,"5303960","KENT"]
[{"$f":"VLOOKUP(B120,CCDDD!$A$3:$B$319,2,FALSE)","v":"33212"},"5303990","KETTLE FALLS",0,0,{"$f":"VLOOKUP(B120,'23-24 Adjusted Formula counts'!$A$2:$L$319,8,FALSE)","v":940},{"$f":"ROUND((F120/$F$5*Assumptions!$D$14*Assumptions!$D$30),0)","v":5044},{"$f":"VLOOKUP(B120,'23-24 Adjusted Formula counts'!$A$2:$L$319,9,FALSE)","v":165},{"$f":"ROUND((H120/$H$5*Assumptions!$D$14*Assumptions!$D$31),0)","v":32148},null,37192,null,null,37192,0,37192,null,0,37192,null,{"$f":"IFERROR(VLOOKUP($A120,#REF!, 21,FALSE),0)","v":0},null,37192,0,151,0,null,"5303990","KETTLE FALLS"]
[{"$f":"VLOOKUP(B121,CCDDD!$A$3:$B$319,2,FALSE)","v":"03052"},"5304020","KIONA-BENTON",0,0,{"$f":"VLOOKUP(B121,'23-24 Adjusted Formula counts'!$A$2:$L$319,8,FALSE)","v":1733},{"$f":"ROUND((F121/$F$5*Assumptions!$D$14*Assumptions!$D$30),0)","v":9300},{"$f":"VLOOKUP(B121,'23-24 Adjusted Formula counts'!$A$2:$L$319,9,FALSE)","v":266},{"$f":"ROUND((H121/$H$5*Assumptions!$D$14*Assumptions!$D$31),0)","v":51827},null,61127,null,null,61127,0,61127,null,0,61127,null,{"$f":"IFERROR(VLOOKUP($A121,#REF!, 21,FALSE),0)","v":0},null,61127,0,110,0,null,"5304020","KIONA-BENTON"]
[{"$f":"VLOOKUP(B122,CCDDD!$A$3:$B$319,2,FALSE)","v":"19403"},"5304050","KITTITAS",0,0,{"$f":"VLOOKUP(B122,'23-24 Adjusted Formula counts'!$A$2:$L$319,8,FALSE)","v":722},{"$f":"ROUND((F122/$F$5*Assumptions!$D$14*Assumptions!$D$30),0)","v":3874},{"$f":"VLOOKUP(B122,'23-24 Adjusted Formula counts'!$A$2:$L$319,9,FALSE)","v":58},{"$f":"ROUND((H122/$H$5*Assumptions!$D$14*Assumptions!$D$31),0)","v":11301},null,15175,null,null,15175,0,15175,null,0,15175,null,{"$f":"IFERROR(VLOOKUP($A122,#REF!, 21,FALSE),0)","v":0},null,15175,0,206,0,null,"5304050","KITTITAS"]
[{"$f":"VLOOKUP(B123,CCDDD!$A$3:$B$319,2,FALSE)","v":"20402"},"5304080","KLICKITAT",0,0,{"$f":"VLOOKUP(B123,'23-24 Adjusted Formula counts'!$A$2:$L$319,8,FALSE)","v":82},{"$f":"ROUND((F123/$F$5*Assumptions!$D$14*Assumptions!$D$30),0)","v":440},{"$f":"VLOOKUP(B123,'23-24 Adjusted Formula counts'!$A$2:$L$319,9,FALSE)","v":12},{"$f":"ROUND((H123/$H$5*Assumptions!$D$14*Assumptions!$D$31),0)","v":2338},null,2778,null,null,2778,0,2778,null,0,2778,null,{"$f":"IFERROR(VLOOKUP($A123,#REF!, 21,FALSE),0)","v":0},null,2778,0,289,0,null,"5304080","KLICKITAT"]
[{"$f":"VLOOKUP(B124,CCDDD!$A$3:$B$319,2,FALSE)","v":"06101"},"5304170","LA CENTER",0,0,{"$f":"VLOOKUP(B124,'23-24 Adjusted Formula counts'!$A$2:$L$319,8,FALSE)","v":1970},{"$f":"ROUND((F124/$F$5*Assumptions!$D$14*Assumptions!$D$30),0)","v":10571},{"$f":"VLOOKUP(B124,'23-24 Adjusted Formula counts'!$A$2:$L$319,9,FALSE)","v":140},{"$f":"ROUND((H124/$H$5*Assumptions!$D$14*Assumptions!$D$31),0)","v":27277},null,37848,null,null,37848,0,37848,null,0,37848,null,{"$f":"IFERROR(VLOOKUP($A124,#REF!, 21,FALSE),0)","v":0},null,37848,0,147,0,null,"5304170","LA CENTER"]
[{"$f":"VLOOKUP(B125,CCDDD!$A$3:$B$319,2,FALSE)","v":"29311"},"5304110","LA CONNER",0,0,{"$f":"VLOOKUP(B125,'23-24 Adjusted Formula counts'!$A$2:$L$319,8,FALSE)","v":602},{"$f":"ROUND((F125/$F$5*Assumptions!$D$14*Assumptions!$D$30),0)","v":3230},{"$f":"VLOOKUP(B125,'23-24 Adjusted Formula counts'!$A$2:$L$319,9,FALSE)","v":134},{"$f":"ROUND((H125/$H$5*Assumptions!$D$14*Assumptions!$D$31),0)","v":26108},null,29338,null,null,29338,0,29338,null,0,29338,null,{"$f":"IFERROR(VLOOKUP($A125,#REF!, 21,FALSE),0)","v":0},null,29338,0,166,0,null,"5304110","LA CONNER"]
[{"$f":"VLOOKUP(B126,CCDDD!$A$3:$B$319,2,FALSE)","v":"38126"},"5304150","LACROSSE",0,0,{"$f":"VLOOKUP(B126,'23-24 Adjusted Formula counts'!$A$2:$L$319,8,FALSE)","v":87},{"$f":"ROUND((F126/$F$5*Assumptions!$D$14*Assumptions!$D$30),0)","v":467},{"$f":"VLOOKUP(B126,'23-24 Adjusted Formula counts'!$A$2:$L$319,9,FALSE)","v":9},{"$f":"ROUND((H126/$H$5*Assumptions!$D$14*Assumptions!$D$31),0)","v":1754},null,2221,null,null,2221,0,2221,null,0,2221,null,{"$f":"IFERROR(VLOOKUP($A126,#REF!, 21,FALSE),0)","v":0},null,2221,0,296,0,null,"5304150","LACROSSE"]
[{"$f":"VLOOKUP(B127,CCDDD!$A$3:$B$319,2,FALSE)","v":"04129"},"5301200","LAKE CHELAN",0,0,{"$f":"VLOOKUP(B127,'23-24 Adjusted Formula counts'!$A$2:$L$319,8,FALSE)","v":1264},{"$f":"ROUND((F127/$F$5*Assumptions!$D$14*Assumptions!$D$30),0)","v":6783},{"$f":"VLOOKUP(B127,'23-24 Adjusted Formula counts'!$A$2:$L$319,9,FALSE)","v":170},{"$f":"ROUND((H127/$H$5*Assumptions!$D$14*Assumptions!$D$31),0)","v":33122},null,39905,null,null,39905,0,39905,null,0,39905,null,{"$f":"IFERROR(VLOOKUP($A127,#REF!, 21,FALSE),0)","v":0},null,39905,0,143,0,null,"5301200","LAKE CHELAN"]
[{"$f":"VLOOKUP(B128,CCDDD!$A$3:$B$319,2,FALSE)","v":"14097"},"5307050","QUINAULT",0,0,{"$f":"VLOOKUP(B128,'23-24 Adjusted Formula counts'!$A$2:$L$319,8,FALSE)","v":176},{"$f":"ROUND((F128/$F$5*Assumptions!$D$14*Assumptions!$D$30),0)","v":944},{"$f":"VLOOKUP(B128,'23-24 Adjusted Formula counts'!$A$2:$L$319,9,FALSE)","v":41},{"$f":"ROUND((H128/$H$5*Assumptions!$D$14*Assumptions!$D$31),0)","v":7988},null,8932,null,null,8932,0,8932,null,0,8932,null,{"$f":"IFERROR(VLOOKUP($A128,#REF!, 21,FALSE),0)","v":0},null,8932,0,239,0,null,"5307050","QUINAULT"]
[{"$f":"VLOOKUP(B129,CCDDD!$A$3:$B$319,2,FALSE)","v":"31004"},"5304200","LAKE STEVENS",0,0,{"$f":"VLOOKUP(B129,'23-24 Adjusted Formula counts'!$A$2:$L$319,8,FALSE)","v":10404},{"$f":"ROUND((F129/$F$5*Assumptions!$D$14*Assumptions!$D$30),0)","v":55830},{"$f":"VLOOKUP(B129,'23-24 Adjusted Formula counts'!$A$2:$L$319,9,FALSE)","v":521},{"$f":"ROUND((H129/$H$5*Assumptions!$D$14*Assumptions!$D$31),0)","v":101510},null,157340,null,null,157340,0,157340,null,0,157340,null,{"$f":"IFERROR(VLOOKUP($A129,#REF!, 21,FALSE),0)","v":0},null,157340,0,59,0,null,"5304200","LAKE STEVENS"]
[{"$f":"VLOOKUP(B130,CCDDD!$A$3:$B$319,2,FALSE)","v":"17414"},"5304230","LAKE WASHINGTON",0,0,{"$f":"VLOOKUP(B130,'23-24 Adjusted Formula counts'!$A$2:$L$319,8,FALSE)","v":36438},{"$f":"ROUND((F130/$F$5*Assumptions!$D$14*Assumptions!$D$30),0)","v":195535},{"$f":"VLOOKUP(B130,'23-24 Adjusted Formula counts'!$A$2:$L$319,9,FALSE)","v":1528},{"$f":"ROUND((H130/$H$5*Assumptions!$D$14*Assumptions!$D$31),0)","v":297711},null,493246,null,null,493246,0,493246,null,0,493246,null,{"$f":"IFERROR(VLOOKUP($A130,#REF!, 21,FALSE),0)","v":0},null,493246,0,18,0,null,"5304230","LAKE WASHINGTON"]
[{"$f":"VLOOKUP(B131,CCDDD!$A$3:$B$319,2,FALSE)","v":"31306"},"5304260","LAKEWOOD",0,0,{"$f":"VLOOKUP(B131,'23-24 Adjusted Formula counts'!$A$2:$L$319,8,FALSE)","v":2680},{"$f":"ROUND((F131/$F$5*Assumptions!$D$14*Assumptions!$D$30),0)","v":14382},{"$f":"VLOOKUP(B131,'23-24 Adjusted Formula counts'!$A$2:$L$319,9,FALSE)","v":297},{"$f":"ROUND((H131/$H$5*Assumptions!$D$14*Assumptions!$D$31),0)","v":57867},null,72249,null,null,72249,0,72249,null,0,72249,null,{"$f":"IFERROR(VLOOKUP($A131,#REF!, 21,FALSE),0)","v":0},null,72249,0,101,0,null,"5304260","LAKEWOOD"]
[{"$f":"VLOOKUP(B132,CCDDD!$A$3:$B$319,2,FALSE)","v":"38264"},"5304290","LAMONT",0,0,{"$f":"VLOOKUP(B132,'23-24 Adjusted Formula counts'!$A$2:$L$319,8,FALSE)","v":28},{"$f":"ROUND((F132/$F$5*Assumptions!$D$14*Assumptions!$D$30),0)","v":150},{"$f":"VLOOKUP(B132,'23-24 Adjusted Formula counts'!$A$2:$L$319,9,FALSE)","v":9},{"$f":"ROUND((H132/$H$5*Assumptions!$D$14*Assumptions!$D$31),0)","v":1754},null,1904,null,null,1904,0,1904,null,0,1904,null,{"$f":"IFERROR(VLOOKUP($A132,#REF!, 21,FALSE),0)","v":0},null,1904,0,306,0,null,"5304290","LAMONT"]
[{"$f":"VLOOKUP(B133,CCDDD!$A$3:$B$319,2,FALSE)","v":"32362"},"5304380","LIBERTY",0,0,{"$f":"VLOOKUP(B133,'23-24 Adjusted Formula counts'!$A$2:$L$319,8,FALSE)","v":839},{"$f":"ROUND((F133/$F$5*Assumptions!$D$14*Assumptions!$D$30),0)","v":4502},{"$f":"VLOOKUP(B133,'23-24 Adjusted Formula counts'!$A$2:$L$319,9,FALSE)","v":67},{"$f":"ROUND((H133/$H$5*Assumptions!$D$14*Assumptions!$D$31),0)","v":13054},null,17556,null,null,17556,0,17556,null,0,17556,null,{"$f":"IFERROR(VLOOKUP($A133,#REF!, 21,FALSE),0)","v":0},null,17556,0,194,0,null,"5304380","LIBERTY"]
[{"$f":"VLOOKUP(B134,CCDDD!$A$3:$B$319,2,FALSE)","v":"01158"},"5304410","LIND",0,0,{"$f":"VLOOKUP(B134,'23-24 Adjusted Formula counts'!$A$2:$L$319,8,FALSE)","v":310},{"$f":"ROUND((F134/$F$5*Assumptions!$D$14*Assumptions!$D$30),0)","v":1664},{"$f":"VLOOKUP(B134,'23-24 Adjusted Formula counts'!$A$2:$L$319,9,FALSE)","v":66},{"$f":"ROUND((H134/$H$5*Assumptions!$D$14*Assumptions!$D$31),0)","v":12859},null,14523,null,null,14523,0,14523,null,0,14523,null,{"$f":"IFERROR(VLOOKUP($A134,#REF!, 21,FALSE),0)","v":0},null,14523,0,209,0,null,"5304410","LIND"]
[{"$f":"VLOOKUP(B135,CCDDD!$A$3:$B$319,2,FALSE)","v":"08122"},"5304470","LONGVIEW",0,0,{"$f":"VLOOKUP(B135,'23-24 Adjusted Formula counts'!$A$2:$L$319,8,FALSE)","v":7250},{"$f":"ROUND((F135/$F$5*Assumptions!$D$14*Assumptions!$D$30),0)","v":38905},{"$f":"VLOOKUP(B135,'23-24 Adjusted Formula counts'!$A$2:$L$319,9,FALSE)","v":1186},{"$f":"ROUND((H135/$H$5*Assumptions!$D$14*Assumptions!$D$31),0)","v":231077},null,{"$f":"ROUNDDOWN(+I135+G135+E135+D135+J135,0)","v":269982},null,null,{"$f":"K135","v":269982},{"$f":"-ROUND(N135/$N$5*$M$5,0)","v":0},{"$f":"+K135+O135+M135","v":269982},null,{"$f":"-1*(P135*Q135)","v":0},{"$f":"+P135+R135","v":269982},null,{"$f":"IFERROR(VLOOKUP($A135,#REF!, 21,FALSE),0)","v":0},null,{"$f":"+S135-U135","v":269982},{"$f":"IF(U135>0,W135/U135,0)","v":0},34,{"$f":"(SUM(D135:E135)/S135)","v":0},null,{"$f":"+B135","v":"5304470"},{"$f":"+C135","v":"LONGVIEW"}]
[{"$f":"VLOOKUP(B136,CCDDD!$A$3:$B$319,2,FALSE)","v":"33183"},"5304500","LOON LAKE",0,0,{"$f":"VLOOKUP(B136,'23-24 Adjusted Formula counts'!$A$2:$L$319,8,FALSE)","v":257},{"$f":"ROUND((F136/$F$5*Assumptions!$D$14*Assumptions!$D$30),0)","v":1379},{"$f":"VLOOKUP(B136,'23-24 Adjusted Formula counts'!$A$2:$L$319,9,FALSE)","v":44},{"$f":"ROUND((H136/$H$5*Assumptions!$D$14*Assumptions!$D$31),0)","v":8573},null,9952,null,null,9952,0,9952,null,0,9952,null,{"$f":"IFERROR(VLOOKUP($A136,#REF!, 21,FALSE),0)","v":0},null,9952,0,{"$f":"RANK(W136,$W$7:$W$322,0)","v":233},0,null,"5304500","LOON LAKE"]
[{"$f":"VLOOKUP(B137,CCDDD!$A$3:$B$319,2,FALSE)","v":"28144"},"5304530","LOPEZ",0,0,{"$f":"VLOOKUP(B137,'23-24 Adjusted Formula counts'!$A$2:$L$319,8,FALSE)","v":289},{"$f":"ROUND((F137/$F$5*Assumptions!$D$14*Assumptions!$D$30),0)","v":1551},{"$f":"VLOOKUP(B137,'23-24 Adjusted Formula counts'!$A$2:$L$319,9,FALSE)","v":57},{"$f":"ROUND((H137/$H$5*Assumptions!$D$14*Assumptions!$D$31),0)","v":11106},null,12657,null,null,12657,0,12657,null,0,12657,null,{"$f":"IFERROR(VLOOKUP($A137,#REF!, 21,FALSE),0)","v":0},null,12657,0,218,0,null,"5304530","LOPEZ"]
[{"$f":"VLOOKUP(B138,CCDDD!$A$3:$B$319,2,FALSE)","v":"32903"},"5304550","LUMEN CHARTER",0,0,{"$f":"VLOOKUP(B138,'23-24 Adjusted Formula counts'!$A$2:$L$319,8,FALSE)","v":42.079470200000003},{"$f":"ROUND((F138/$F$5*Assumptions!$D$14*Assumptions!$D$30),0)","v":226},{"$f":"VLOOKUP(B138,'23-24 Adjusted Formula counts'!$A$2:$L$319,9,FALSE)","v":9.1475244189999998},{"$f":"ROUND((H138/$H$5*Assumptions!$D$14*Assumptions!$D$31),0)","v":1782},null,2008,null,null,2008,0,2008,null,0,2008,null,{"$f":"IFERROR(VLOOKUP($A138,#REF!, 21,FALSE),0)","v":0},null,2008,0,304,0,null,"5304550","LUMEN CHARTER"]
[{"$f":"VLOOKUP(B139,CCDDD!$A$3:$B$319,2,FALSE)","v":"20406"},"5304590","LYLE",0,0,{"$f":"VLOOKUP(B139,'23-24 Adjusted Formula counts'!$A$2:$L$319,8,FALSE)","v":419},{"$f":"ROUND((F139/$F$5*Assumptions!$D$14*Assumptions!$D$30),0)","v":2248},{"$f":"VLOOKUP(B139,'23-24 Adjusted Formula counts'!$A$2:$L$319,9,FALSE)","v":69},{"$f":"ROUND((H139/$H$5*Assumptions!$D$14*Assumptions!$D$31),0)","v":13444},null,15692,null,null,15692,0,15692,null,0,15692,null,{"$f":"IFERROR(VLOOKUP($A139,#REF!, 21,FALSE),0)","v":0},null,15692,0,202,0,null,"5304590","LYLE"]
[{"$f":"VLOOKUP(B140,CCDDD!$A$3:$B$319,2,FALSE)","v":"37504"},"5304620","LYNDEN",0,0,{"$f":"VLOOKUP(B140,'23-24 Adjusted Formula counts'!$A$2:$L$319,8,FALSE)","v":4435},{"$f":"ROUND((F140/$F$5*Assumptions!$D$14*Assumptions!$D$30),0)","v":23799},{"$f":"VLOOKUP(B140,'23-24 Adjusted Formula counts'!$A$2:$L$319,9,FALSE)","v":415},{"$f":"ROUND((H140/$H$5*Assumptions!$D$14*Assumptions!$D$31),0)","v":80857},null,104656,null,null,104656,0,104656,null,0,104656,null,{"$f":"IFERROR(VLOOKUP($A140,#REF!, 21,FALSE),0)","v":0},null,104656,0,78,0,null,"5304620","LYNDEN"]
[{"$f":"VLOOKUP(B141,CCDDD!$A$3:$B$319,2,FALSE)","v":"39120"},"5304650","MABTON",0,0,{"$f":"VLOOKUP(B141,'23-24 Adjusted Formula counts'!$A$2:$L$319,8,FALSE)","v":783},{"$f":"ROUND((F141/$F$5*Assumptions!$D$14*Assumptions!$D$30),0)","v":4202},{"$f":"VLOOKUP(B141,'23-24 Adjusted Formula counts'!$A$2:$L$319,9,FALSE)","v":164},{"$f":"ROUND((H141/$H$5*Assumptions!$D$14*Assumptions!$D$31),0)","v":31953},null,36155,null,null,36155,0,36155,null,0,36155,null,{"$f":"IFERROR(VLOOKUP($A141,#REF!, 21,FALSE),0)","v":0},null,36155,0,153,0,null,"5304650","MABTON"]
[{"$f":"VLOOKUP(B142,CCDDD!$A$3:$B$319,2,FALSE)","v":"09207"},"5304710","MANSFIELD",0,0,{"$f":"VLOOKUP(B142,'23-24 Adjusted Formula counts'!$A$2:$L$319,8,FALSE)","v":88},{"$f":"ROUND((F142/$F$5*Assumptions!$D$14*Assumptions!$D$30),0)","v":472},{"$f":"VLOOKUP(B142,'23-24 Adjusted Formula counts'!$A$2:$L$319,9,FALSE)","v":27},{"$f":"ROUND((H142/$H$5*Assumptions!$D$14*Assumptions!$D$31),0)","v":5261},null,5733,null,null,5733,0,5733,null,0,5733,null,{"$f":"IFERROR(VLOOKUP($A142,#REF!, 21,FALSE),0)","v":0},null,5733,0,259,0,null,"5304710","MANSFIELD"]
[{"$f":"VLOOKUP(B143,CCDDD!$A$3:$B$319,2,FALSE)","v":"04019"},"5304740","MANSON",0,0,{"$f":"VLOOKUP(B143,'23-24 Adjusted Formula counts'!$A$2:$L$319,8,FALSE)","v":623},{"$f":"ROUND((F143/$F$5*Assumptions!$D$14*Assumptions!$D$30),0)","v":3343},{"$f":"VLOOKUP(B143,'23-24 Adjusted Formula counts'!$A$2:$L$319,9,FALSE)","v":106},{"$f":"ROUND((H143/$H$5*Assumptions!$D$14*Assumptions!$D$31),0)","v":20653},null,23996,null,null,23996,0,23996,null,0,23996,null,{"$f":"IFERROR(VLOOKUP($A143,#REF!, 21,FALSE),0)","v":0},null,23996,0,176,0,null,"5304740","MANSON"]
[{"$f":"VLOOKUP(B144,CCDDD!$A$3:$B$319,2,FALSE)","v":"23311"},"5304800","MARY M KNIGHT",0,0,{"$f":"VLOOKUP(B144,'23-24 Adjusted Formula counts'!$A$2:$L$319,8,FALSE)","v":207},{"$f":"ROUND((F144/$F$5*Assumptions!$D$14*Assumptions!$D$30),0)","v":1111},{"$f":"VLOOKUP(B144,'23-24 Adjusted Formula counts'!$A$2:$L$319,9,FALSE)","v":33},{"$f":"ROUND((H144/$H$5*Assumptions!$D$14*Assumptions!$D$31),0)","v":6430},null,7541,null,null,7541,0,7541,null,0,7541,null,{"$f":"IFERROR(VLOOKUP($A144,#REF!, 21,FALSE),0)","v":0},null,7541,0,246,0,null,"5304800","MARY M KNIGHT"]
[{"$f":"VLOOKUP(B145,CCDDD!$A$3:$B$319,2,FALSE)","v":"33207"},"5304830","MARY WALKER",0,0,{"$f":"VLOOKUP(B145,'23-24 Adjusted Formula counts'!$A$2:$L$319,8,FALSE)","v":646},{"$f":"ROUND((F145/$F$5*Assumptions!$D$14*Assumptions!$D$30),0)","v":3467},{"$f":"VLOOKUP(B145,'23-24 Adjusted Formula counts'!$A$2:$L$319,9,FALSE)","v":150},{"$f":"ROUND((H145/$H$5*Assumptions!$D$14*Assumptions!$D$31),0)","v":29226},null,32693,null,null,32693,0,32693,null,0,32693,null,{"$f":"IFERROR(VLOOKUP($A145,#REF!, 21,FALSE),0)","v":0},null,32693,0,157,0,null,"5304830","MARY WALKER"]
[{"$f":"VLOOKUP(B146,CCDDD!$A$3:$B$319,2,FALSE)","v":"31025"},"5304860","MARYSVILLE",0,0,{"$f":"VLOOKUP(B146,'23-24 Adjusted Formula counts'!$A$2:$L$319,8,FALSE)","v":12720},{"$f":"ROUND((F146/$F$5*Assumptions!$D$14*Assumptions!$D$30),0)","v":68259},{"$f":"VLOOKUP(B146,'23-24 Adjusted Formula counts'!$A$2:$L$319,9,FALSE)","v":1226},{"$f":"ROUND((H146/$H$5*Assumptions!$D$14*Assumptions!$D$31),0)","v":238870},null,307129,null,null,307129,0,307129,null,0,307129,null,{"$f":"IFERROR(VLOOKUP($A146,#REF!, 21,FALSE),0)","v":0},null,307129,0,27,0,null,"5304860","MARYSVILLE"]
[{"$f":"VLOOKUP(B147,CCDDD!$A$3:$B$319,2,FALSE)","v":"14065"},"5304890","MCCLEARY",0,0,{"$f":"VLOOKUP(B147,'23-24 Adjusted Formula counts'!$A$2:$L$319,8,FALSE)","v":579},{"$f":"ROUND((F147/$F$5*Assumptions!$D$14*Assumptions!$D$30),0)","v":3107},{"$f":"VLOOKUP(B147,'23-24 Adjusted Formula counts'!$A$2:$L$319,9,FALSE)","v":65},{"$f":"ROUND((H147/$H$5*Assumptions!$D$14*Assumptions!$D$31),0)","v":12664},null,15771,null,null,15771,0,15771,null,0,15771,null,{"$f":"IFERROR(VLOOKUP($A147,#REF!, 21,FALSE),0)","v":0},null,15771,0,201,0,null,"5304890","MCCLEARY"]
[{"$f":"VLOOKUP(B148,CCDDD!$A$3:$B$319,2,FALSE)","v":"32354"},"5304920","MEAD",0,0,{"$f":"VLOOKUP(B148,'23-24 Adjusted Formula counts'!$A$2:$L$319,8,FALSE)","v":12203},{"$f":"ROUND((F148/$F$5*Assumptions!$D$14*Assumptions!$D$30),0)","v":65484},{"$f":"VLOOKUP(B148,'23-24 Adjusted Formula counts'!$A$2:$L$319,9,FALSE)","v":985},{"$f":"ROUND((H148/$H$5*Assumptions!$D$14*Assumptions!$D$31),0)","v":191914},null,257398,null,null,257398,0,257398,null,0,257398,null,{"$f":"IFERROR(VLOOKUP($A148,#REF!, 21,FALSE),0)","v":0},null,257398,0,36,0,null,"5304920","MEAD"]
[{"$f":"VLOOKUP(B149,CCDDD!$A$3:$B$319,2,FALSE)","v":"32326"},"5304950","MEDICAL LAKE",0,0,{"$f":"VLOOKUP(B149,'23-24 Adjusted Formula counts'!$A$2:$L$319,8,FALSE)","v":1829},{"$f":"ROUND((F149/$F$5*Assumptions!$D$14*Assumptions!$D$30),0)","v":9815},{"$f":"VLOOKUP(B149,'23-24 Adjusted Formula counts'!$A$2:$L$319,9,FALSE)","v":173},{"$f":"ROUND((H149/$H$5*Assumptions!$D$14*Assumptions!$D$31),0)","v":33707},null,43522,null,null,43522,0,43522,null,0,43522,null,{"$f":"IFERROR(VLOOKUP($A149,#REF!, 21,FALSE),0)","v":0},null,43522,0,136,0,null,"5304950","MEDICAL LAKE"]
[{"$f":"VLOOKUP(B150,CCDDD!$A$3:$B$319,2,FALSE)","v":"17400"},"5304980","MERCER ISLAND",0,0,{"$f":"VLOOKUP(B150,'23-24 Adjusted Formula counts'!$A$2:$L$319,8,FALSE)","v":4992},{"$f":"ROUND((F150/$F$5*Assumptions!$D$14*Assumptions!$D$30),0)","v":26788},{"$f":"VLOOKUP(B150,'23-24 Adjusted Formula counts'!$A$2:$L$319,9,FALSE)","v":184},{"$f":"ROUND((H150/$H$5*Assumptions!$D$14*Assumptions!$D$31),0)","v":35850},null,62638,null,null,62638,0,62638,null,0,62638,null,{"$f":"IFERROR(VLOOKUP($A150,#REF!, 21,FALSE),0)","v":0},null,62638,0,109,0,null,"5304980","MERCER ISLAND"]
[{"$f":"VLOOKUP(B151,CCDDD!$A$3:$B$319,2,FALSE)","v":"37505"},"5305010","MERIDIAN",0,0,{"$f":"VLOOKUP(B151,'23-24 Adjusted Formula counts'!$A$2:$L$319,8,FALSE)","v":1737},{"$f":"ROUND((F151/$F$5*Assumptions!$D$14*Assumptions!$D$30),0)","v":9321},{"$f":"VLOOKUP(B151,'23-24 Adjusted Formula counts'!$A$2:$L$319,9,FALSE)","v":237},{"$f":"ROUND((H151/$H$5*Assumptions!$D$14*Assumptions!$D$31),0)","v":46176},null,55497,null,null,55497,0,55497,null,0,55497,null,{"$f":"IFERROR(VLOOKUP($A151,#REF!, 21,FALSE),0)","v":0},null,55497,0,121,0,null,"5305010","MERIDIAN"]
[{"$f":"VLOOKUP(B152,CCDDD!$A$3:$B$319,2,FALSE)","v":"24350"},"5305020","METHOW VALLEY",0,0,{"$f":"VLOOKUP(B152,'23-24 Adjusted Formula counts'!$A$2:$L$319,8,FALSE)","v":860},{"$f":"ROUND((F152/$F$5*Assumptions!$D$14*Assumptions!$D$30),0)","v":4615},{"$f":"VLOOKUP(B152,'23-24 Adjusted Formula counts'!$A$2:$L$319,9,FALSE)","v":101},{"$f":"ROUND((H152/$H$5*Assumptions!$D$14*Assumptions!$D$31),0)","v":19679},null,24294,null,null,24294,0,24294,null,0,24294,null,{"$f":"IFERROR(VLOOKUP($A152,#REF!, 21,FALSE),0)","v":0},null,24294,0,175,0,null,"5305020","METHOW VALLEY"]
[{"$f":"VLOOKUP(B153,CCDDD!$A$3:$B$319,2,FALSE)","v":"30031"},"5305040","MILL A",0,0,{"$f":"VLOOKUP(B153,'23-24 Adjusted Formula counts'!$A$2:$L$319,8,FALSE)","v":74},{"$f":"ROUND((F153/$F$5*Assumptions!$D$14*Assumptions!$D$30),0)","v":397},{"$f":"VLOOKUP(B153,'23-24 Adjusted Formula counts'!$A$2:$L$319,9,FALSE)","v":12},{"$f":"ROUND((H153/$H$5*Assumptions!$D$14*Assumptions!$D$31),0)","v":2338},null,2735,null,null,2735,0,2735,null,0,2735,null,{"$f":"IFERROR(VLOOKUP($A153,#REF!, 21,FALSE),0)","v":0},null,2735,0,290,0,null,"5305040","MILL A"]
[{"$f":"VLOOKUP(B154,CCDDD!$A$3:$B$319,2,FALSE)","v":"31103"},"5305130","MONROE",0,0,{"$f":"VLOOKUP(B154,'23-24 Adjusted Formula counts'!$A$2:$L$319,8,FALSE)","v":6741},{"$f":"ROUND((F154/$F$5*Assumptions!$D$14*Assumptions!$D$30),0)","v":36174},{"$f":"VLOOKUP(B154,'23-24 Adjusted Formula counts'!$A$2:$L$319,9,FALSE)","v":398},{"$f":"ROUND((H154/$H$5*Assumptions!$D$14*Assumptions!$D$31),0)","v":77545},null,113719,null,null,113719,0,113719,null,0,113719,null,{"$f":"IFERROR(VLOOKUP($A154,#REF!, 21,FALSE),0)","v":0},null,113719,0,74,0,null,"5305130","MONROE"]
[{"$f":"VLOOKUP(B155,CCDDD!$A$3:$B$319,2,FALSE)","v":"14066"},"5305160","MONTESANO",0,0,{"$f":"VLOOKUP(B155,'23-24 Adjusted Formula counts'!$A$2:$L$319,8,FALSE)","v":1351},{"$f":"ROUND((F155/$F$5*Assumptions!$D$14*Assumptions!$D$30),0)","v":7250},{"$f":"VLOOKUP(B155,'23-24 Adjusted Formula counts'!$A$2:$L$319,9,FALSE)","v":159},{"$f":"ROUND((H155/$H$5*Assumptions!$D$14*Assumptions!$D$31),0)","v":30979},null,38229,null,null,38229,0,38229,null,0,38229,null,{"$f":"IFERROR(VLOOKUP($A155,#REF!, 21,FALSE),0)","v":0},null,38229,0,146,0,null,"5305160","MONTESANO"]
[{"$f":"VLOOKUP(B156,CCDDD!$A$3:$B$319,2,FALSE)","v":"21214"},"5305190","MORTON",0,0,{"$f":"VLOOKUP(B156,'23-24 Adjusted Formula counts'!$A$2:$L$319,8,FALSE)","v":332},{"$f":"ROUND((F156/$F$5*Assumptions!$D$14*Assumptions!$D$30),0)","v":1782},{"$f":"VLOOKUP(B156,'23-24 Adjusted Formula counts'!$A$2:$L$319,9,FALSE)","v":66},{"$f":"ROUND((H156/$H$5*Assumptions!$D$14*Assumptions!$D$31),0)","v":12859},null,14641,null,null,14641,0,14641,null,0,14641,null,{"$f":"IFERROR(VLOOKUP($A156,#REF!, 21,FALSE),0)","v":0},null,14641,0,208,0,null,"5305190","MORTON"]
[{"$f":"VLOOKUP(B157,CCDDD!$A$3:$B$319,2,FALSE)","v":"13161"},"5305220","MOSES LAKE",0,0,{"$f":"VLOOKUP(B157,'23-24 Adjusted Formula counts'!$A$2:$L$319,8,FALSE)","v":9920},{"$f":"ROUND((F157/$F$5*Assumptions!$D$14*Assumptions!$D$30),0)","v":53233},{"$f":"VLOOKUP(B157,'23-24 Adjusted Formula counts'!$A$2:$L$319,9,FALSE)","v":1242},{"$f":"ROUND((H157/$H$5*Assumptions!$D$14*Assumptions!$D$31),0)","v":241988},null,295221,null,null,295221,0,295221,null,0,295221,null,{"$f":"IFERROR(VLOOKUP($A157,#REF!, 21,FALSE),0)","v":0},null,295221,0,30,0,null,"5305220","MOSES LAKE"]
[{"$f":"VLOOKUP(B158,CCDDD!$A$3:$B$319,2,FALSE)","v":"21206"},"5305250","MOSSYROCK",0,0,{"$f":"VLOOKUP(B158,'23-24 Adjusted Formula counts'!$A$2:$L$319,8,FALSE)","v":698},{"$f":"ROUND((F158/$F$5*Assumptions!$D$14*Assumptions!$D$30),0)","v":3746},{"$f":"VLOOKUP(B158,'23-24 Adjusted Formula counts'!$A$2:$L$319,9,FALSE)","v":106},{"$f":"ROUND((H158/$H$5*Assumptions!$D$14*Assumptions!$D$31),0)","v":20653},null,24399,null,null,24399,0,24399,null,0,24399,null,{"$f":"IFERROR(VLOOKUP($A158,#REF!, 21,FALSE),0)","v":0},null,24399,0,174,0,null,"5305250","MOSSYROCK"]
[{"$f":"VLOOKUP(B159,CCDDD!$A$3:$B$319,2,FALSE)","v":"39209"},"5305280","MOUNT ADAMS",0,0,{"$f":"VLOOKUP(B159,'23-24 Adjusted Formula counts'!$A$2:$L$319,8,FALSE)","v":1015},{"$f":"ROUND((F159/$F$5*Assumptions!$D$14*Assumptions!$D$30),0)","v":5447},{"$f":"VLOOKUP(B159,'23-24 Adjusted Formula counts'!$A$2:$L$319,9,FALSE)","v":247},{"$f":"ROUND((H159/$H$5*Assumptions!$D$14*Assumptions!$D$31),0)","v":48125},null,53572,null,null,53572,0,53572,null,0,53572,null,{"$f":"IFERROR(VLOOKUP($A159,#REF!, 21,FALSE),0)","v":0},null,53572,0,123,0,null,"5305280","MOUNT ADAMS"]
[{"$f":"VLOOKUP(B160,CCDDD!$A$3:$B$319,2,FALSE)","v":"37507"},"5305310","MOUNT BAKER",0,0,{"$f":"VLOOKUP(B160,'23-24 Adjusted Formula counts'!$A$2:$L$319,8,FALSE)","v":2481},{"$f":"ROUND((F160/$F$5*Assumptions!$D$14*Assumptions!$D$30),0)","v":13314},{"$f":"VLOOKUP(B160,'23-24 Adjusted Formula counts'!$A$2:$L$319,9,FALSE)","v":416},{"$f":"ROUND((H160/$H$5*Assumptions!$D$14*Assumptions!$D$31),0)","v":81052},null,94366,null,null,94366,0,94366,null,0,94366,null,{"$f":"IFERROR(VLOOKUP($A160,#REF!, 21,FALSE),0)","v":0},null,94366,0,83,0,null,"5305310","MOUNT BAKER"]
[{"$f":"VLOOKUP(B161,CCDDD!$A$3:$B$319,2,FALSE)","v":"30029"},"5305340","MOUNT PLEASANT",0,0,{"$f":"VLOOKUP(B161,'23-24 Adjusted Formula counts'!$A$2:$L$319,8,FALSE)","v":41},{"$f":"ROUND((F161/$F$5*Assumptions!$D$14*Assumptions!$D$30),0)","v":220},{"$f":"VLOOKUP(B161,'23-24 Adjusted Formula counts'!$A$2:$L$319,9,FALSE)","v":6},{"$f":"ROUND((H161/$H$5*Assumptions!$D$14*Assumptions!$D$31),0)","v":1169},null,1389,null,null,1389,0,1389,null,0,1389,null,{"$f":"IFERROR(VLOOKUP($A161,#REF!, 21,FALSE),0)","v":0},null,1389,0,309,0,null,"5305340","MOUNT PLEASANT"]
[{"$f":"VLOOKUP(B162,CCDDD!$A$3:$B$319,2,FALSE)","v":"29320"},"5305400","MOUNT VERNON",0,0,{"$f":"VLOOKUP(B162,'23-24 Adjusted Formula counts'!$A$2:$L$319,8,FALSE)","v":6931},{"$f":"ROUND((F162/$F$5*Assumptions!$D$14*Assumptions!$D$30),0)","v":37193},{"$f":"VLOOKUP(B162,'23-24 Adjusted Formula counts'!$A$2:$L$319,9,FALSE)","v":948},{"$f":"ROUND((H162/$H$5*Assumptions!$D$14*Assumptions!$D$31),0)","v":184706},null,221899,null,null,221899,0,221899,null,0,221899,null,{"$f":"IFERROR(VLOOKUP($A162,#REF!, 21,FALSE),0)","v":0},null,221899,0,40,0,null,"5305400","MOUNT VERNON"]
[{"$f":"VLOOKUP(B163,CCDDD!$A$3:$B$319,2,FALSE)","v":"31006"},"5305430","MUKILTEO",0,0,{"$f":"VLOOKUP(B163,'23-24 Adjusted Formula counts'!$A$2:$L$319,8,FALSE)","v":17175},{"$f":"ROUND((F163/$F$5*Assumptions!$D$14*Assumptions!$D$30),0)","v":92165},{"$f":"VLOOKUP(B163,'23-24 Adjusted Formula counts'!$A$2:$L$319,9,FALSE)","v":1881},{"$f":"ROUND((H163/$H$5*Assumptions!$D$14*Assumptions!$D$31),0)","v":366488},null,458653,null,null,458653,0,458653,null,0,458653,null,{"$f":"IFERROR(VLOOKUP($A163,#REF!, 21,FALSE),0)","v":0},null,458653,0,19,0,null,"5305430","MUKILTEO"]
[{"$f":"VLOOKUP(B164,CCDDD!$A$3:$B$319,2,FALSE)","v":"39003"},"5305460","NACHES VALLEY",0,0,{"$f":"VLOOKUP(B164,'23-24 Adjusted Formula counts'!$A$2:$L$319,8,FALSE)","v":1640},{"$f":"ROUND((F164/$F$5*Assumptions!$D$14*Assumptions!$D$30),0)","v":8801},{"$f":"VLOOKUP(B164,'23-24 Adjusted Formula counts'!$A$2:$L$319,9,FALSE)","v":202},{"$f":"ROUND((H164/$H$5*Assumptions!$D$14*Assumptions!$D$31),0)","v":39357},null,48158,null,null,48158,0,48158,null,0,48158,null,{"$f":"IFERROR(VLOOKUP($A164,#REF!, 21,FALSE),0)","v":0},null,48158,0,130,0,null,"5305460","NACHES VALLEY"]
[{"$f":"VLOOKUP(B165,CCDDD!$A$3:$B$319,2,FALSE)","v":"21014"},"5305490","NAPAVINE",0,0,{"$f":"VLOOKUP(B165,'23-24 Adjusted Formula counts'!$A$2:$L$319,8,FALSE)","v":774},{"$f":"ROUND((F165/$F$5*Assumptions!$D$14*Assumptions!$D$30),0)","v":4153},{"$f":"VLOOKUP(B165,'23-24 Adjusted Formula counts'!$A$2:$L$319,9,FALSE)","v":78},{"$f":"ROUND((H165/$H$5*Assumptions!$D$14*Assumptions!$D$31),0)","v":15197},null,19350,null,null,19350,0,19350,null,0,19350,null,{"$f":"IFERROR(VLOOKUP($A165,#REF!, 21,FALSE),0)","v":0},null,19350,0,189,0,null,"5305490","NAPAVINE"]
[{"$f":"VLOOKUP(B166,CCDDD!$A$3:$B$319,2,FALSE)","v":"25155"},"5305520","NASELLE-GRAYS",0,0,{"$f":"VLOOKUP(B166,'23-24 Adjusted Formula counts'!$A$2:$L$319,8,FALSE)","v":343},{"$f":"ROUND((F166/$F$5*Assumptions!$D$14*Assumptions!$D$30),0)","v":1841},{"$f":"VLOOKUP(B166,'23-24 Adjusted Formula counts'!$A$2:$L$319,9,FALSE)","v":48},{"$f":"ROUND((H166/$H$5*Assumptions!$D$14*Assumptions!$D$31),0)","v":9352},null,11193,null,null,11193,0,11193,null,0,11193,null,{"$f":"IFERROR(VLOOKUP($A166,#REF!, 21,FALSE),0)","v":0},null,11193,0,225,0,null,"5305520","NASELLE-GRAYS"]
[{"$f":"VLOOKUP(B167,CCDDD!$A$3:$B$319,2,FALSE)","v":"24014"},"5305550","NESPELEM",0,0,{"$f":"VLOOKUP(B167,'23-24 Adjusted Formula counts'!$A$2:$L$319,8,FALSE)","v":253},{"$f":"ROUND((F167/$F$5*Assumptions!$D$14*Assumptions!$D$30),0)","v":1358},{"$f":"VLOOKUP(B167,'23-24 Adjusted Formula counts'!$A$2:$L$319,9,FALSE)","v":57},{"$f":"ROUND((H167/$H$5*Assumptions!$D$14*Assumptions!$D$31),0)","v":11106},null,12464,null,null,12464,0,12464,null,0,12464,null,{"$f":"IFERROR(VLOOKUP($A167,#REF!, 21,FALSE),0)","v":0},null,12464,0,220,0,null,"5305550","NESPELEM"]
[{"$f":"VLOOKUP(B168,CCDDD!$A$3:$B$319,2,FALSE)","v":"26056"},"5305610","NEWPORT",0,0,{"$f":"VLOOKUP(B168,'23-24 Adjusted Formula counts'!$A$2:$L$319,8,FALSE)","v":1342},{"$f":"ROUND((F168/$F$5*Assumptions!$D$14*Assumptions!$D$30),0)","v":7201},{"$f":"VLOOKUP(B168,'23-24 Adjusted Formula counts'!$A$2:$L$319,9,FALSE)","v":310},{"$f":"ROUND((H168/$H$5*Assumptions!$D$14*Assumptions!$D$31),0)","v":60399},null,67600,null,null,67600,0,67600,null,0,67600,null,{"$f":"IFERROR(VLOOKUP($A168,#REF!, 21,FALSE),0)","v":0},null,67600,0,106,0,null,"5305610","NEWPORT"]
[{"$f":"VLOOKUP(B169,CCDDD!$A$3:$B$319,2,FALSE)","v":"32325"},"5305640","NINE MILE FALLS",0,0,{"$f":"VLOOKUP(B169,'23-24 Adjusted Formula counts'!$A$2:$L$319,8,FALSE)","v":1580},{"$f":"ROUND((F169/$F$5*Assumptions!$D$14*Assumptions!$D$30),0)","v":8479},{"$f":"VLOOKUP(B169,'23-24 Adjusted Formula counts'!$A$2:$L$319,9,FALSE)","v":149},{"$f":"ROUND((H169/$H$5*Assumptions!$D$14*Assumptions!$D$31),0)","v":29031},null,37510,null,null,37510,0,37510,null,0,37510,null,{"$f":"IFERROR(VLOOKUP($A169,#REF!, 21,FALSE),0)","v":0},null,37510,0,150,0,null,"5305640","NINE MILE FALLS"]
[{"$f":"VLOOKUP(B170,CCDDD!$A$3:$B$319,2,FALSE)","v":"37506"},"5305670","NOOKSACK VALLEY",0,0,{"$f":"VLOOKUP(B170,'23-24 Adjusted Formula counts'!$A$2:$L$319,8,FALSE)","v":2252},{"$f":"ROUND((F170/$F$5*Assumptions!$D$14*Assumptions!$D$30),0)","v":12085},{"$f":"VLOOKUP(B170,'23-24 Adjusted Formula counts'!$A$2:$L$319,9,FALSE)","v":294},{"$f":"ROUND((H170/$H$5*Assumptions!$D$14*Assumptions!$D$31),0)","v":57282},null,69367,null,null,69367,0,69367,null,0,69367,null,{"$f":"IFERROR(VLOOKUP($A170,#REF!, 21,FALSE),0)","v":0},null,69367,0,104,0,null,"5305670","NOOKSACK VALLEY"]
[{"$f":"VLOOKUP(B171,CCDDD!$A$3:$B$319,2,FALSE)","v":"14064"},"5305700","NORTH BEACH",0,0,{"$f":"VLOOKUP(B171,'23-24 Adjusted Formula counts'!$A$2:$L$319,8,FALSE)","v":713},{"$f":"ROUND((F171/$F$5*Assumptions!$D$14*Assumptions!$D$30),0)","v":3826},{"$f":"VLOOKUP(B171,'23-24 Adjusted Formula counts'!$A$2:$L$319,9,FALSE)","v":161},{"$f":"ROUND((H171/$H$5*Assumptions!$D$14*Assumptions!$D$31),0)","v":31369},null,35195,null,null,35195,0,35195,null,0,35195,null,{"$f":"IFERROR(VLOOKUP($A171,#REF!, 21,FALSE),0)","v":0},null,35195,0,156,0,null,"5305700","NORTH BEACH"]
[{"$f":"VLOOKUP(B172,CCDDD!$A$3:$B$319,2,FALSE)","v":"11051"},"5305730","NORTH FRANKLIN",0,0,{"$f":"VLOOKUP(B172,'23-24 Adjusted Formula counts'!$A$2:$L$319,8,FALSE)","v":2246},{"$f":"ROUND((F172/$F$5*Assumptions!$D$14*Assumptions!$D$30),0)","v":12053},{"$f":"VLOOKUP(B172,'23-24 Adjusted Formula counts'!$A$2:$L$319,9,FALSE)","v":312},{"$f":"ROUND((H172/$H$5*Assumptions!$D$14*Assumptions!$D$31),0)","v":60789},null,72842,null,null,72842,0,72842,null,0,72842,null,{"$f":"IFERROR(VLOOKUP($A172,#REF!, 21,FALSE),0)","v":0},null,72842,0,100,0,null,"5305730","NORTH FRANKLIN"]
[{"$f":"VLOOKUP(B173,CCDDD!$A$3:$B$319,2,FALSE)","v":"18400"},"5305760","NORTH KITSAP",0,0,{"$f":"VLOOKUP(B173,'23-24 Adjusted Formula counts'!$A$2:$L$319,8,FALSE)","v":7279},{"$f":"ROUND((F173/$F$5*Assumptions!$D$14*Assumptions!$D$30),0)","v":39061},{"$f":"VLOOKUP(B173,'23-24 Adjusted Formula counts'!$A$2:$L$319,9,FALSE)","v":601},{"$f":"ROUND((H173/$H$5*Assumptions!$D$14*Assumptions!$D$31),0)","v":117097},null,156158,null,null,156158,0,156158,null,0,156158,null,{"$f":"IFERROR(VLOOKUP($A173,#REF!, 21,FALSE),0)","v":0},null,156158,0,60,0,null,"5305760","NORTH KITSAP"]
[{"$f":"VLOOKUP(B174,CCDDD!$A$3:$B$319,2,FALSE)","v":"23403"},"5305790","NORTH MASON",0,0,{"$f":"VLOOKUP(B174,'23-24 Adjusted Formula counts'!$A$2:$L$319,8,FALSE)","v":2465},{"$f":"ROUND((F174/$F$5*Assumptions!$D$14*Assumptions!$D$30),0)","v":13228},{"$f":"VLOOKUP(B174,'23-24 Adjusted Formula counts'!$A$2:$L$319,9,FALSE)","v":394},{"$f":"ROUND((H174/$H$5*Assumptions!$D$14*Assumptions!$D$31),0)","v":76766},null,89994,null,null,89994,0,89994,null,0,89994,null,{"$f":"IFERROR(VLOOKUP($A174,#REF!, 21,FALSE),0)","v":0},null,89994,0,86,0,null,"5305790","NORTH MASON"]
[{"$f":"VLOOKUP(B175,CCDDD!$A$3:$B$319,2,FALSE)","v":"25200"},"5305820","NORTH RIVER",0,0,{"$f":"VLOOKUP(B175,'23-24 Adjusted Formula counts'!$A$2:$L$319,8,FALSE)","v":54},{"$f":"ROUND((F175/$F$5*Assumptions!$D$14*Assumptions!$D$30),0)","v":290},{"$f":"VLOOKUP(B175,'23-24 Adjusted Formula counts'!$A$2:$L$319,9,FALSE)","v":8},{"$f":"ROUND((H175/$H$5*Assumptions!$D$14*Assumptions!$D$31),0)","v":1559},null,1849,null,null,1849,0,1849,null,0,1849,null,{"$f":"IFERROR(VLOOKUP($A175,#REF!, 21,FALSE),0)","v":0},null,1849,0,307,0,null,"5305820","NORTH RIVER"]
[{"$f":"VLOOKUP(B176,CCDDD!$A$3:$B$319,2,FALSE)","v":"34003"},"5305850","NORTH THURSTON",0,0,{"$f":"VLOOKUP(B176,'23-24 Adjusted Formula counts'!$A$2:$L$319,8,FALSE)","v":17329},{"$f":"ROUND((F176/$F$5*Assumptions!$D$14*Assumptions!$D$30),0)","v":92992},{"$f":"VLOOKUP(B176,'23-24 Adjusted Formula counts'!$A$2:$L$319,9,FALSE)","v":1789},{"$f":"ROUND((H176/$H$5*Assumptions!$D$14*Assumptions!$D$31),0)","v":348563},null,441555,null,null,441555,0,441555,null,0,441555,null,{"$f":"IFERROR(VLOOKUP($A176,#REF!, 21,FALSE),0)","v":0},null,441555,0,21,0,null,"5305850","NORTH THURSTON"]
[{"$f":"VLOOKUP(B177,CCDDD!$A$3:$B$319,2,FALSE)","v":"33211"},"5305880","NORTHPORT",0,0,{"$f":"VLOOKUP(B177,'23-24 Adjusted Formula counts'!$A$2:$L$319,8,FALSE)","v":227},{"$f":"ROUND((F177/$F$5*Assumptions!$D$14*Assumptions!$D$30),0)","v":1218},{"$f":"VLOOKUP(B177,'23-24 Adjusted Formula counts'!$A$2:$L$319,9,FALSE)","v":60},{"$f":"ROUND((H177/$H$5*Assumptions!$D$14*Assumptions!$D$31),0)","v":11690},null,12908,null,null,12908,0,12908,null,0,12908,null,{"$f":"IFERROR(VLOOKUP($A177,#REF!, 21,FALSE),0)","v":0},null,12908,0,216,0,null,"5305880","NORTHPORT"]
[{"$f":"VLOOKUP(B178,CCDDD!$A$3:$B$319,2,FALSE)","v":"17417"},"5305910","NORTHSHORE",0,0,{"$f":"VLOOKUP(B178,'23-24 Adjusted Formula counts'!$A$2:$L$319,8,FALSE)","v":26739},{"$f":"ROUND((F178/$F$5*Assumptions!$D$14*Assumptions!$D$30),0)","v":143488},{"$f":"VLOOKUP(B178,'23-24 Adjusted Formula counts'!$A$2:$L$319,9,FALSE)","v":1028},{"$f":"ROUND((H178/$H$5*Assumptions!$D$14*Assumptions!$D$31),0)","v":200292},null,343780,null,null,343780,0,343780,null,0,343780,null,{"$f":"IFERROR(VLOOKUP($A178,#REF!, 21,FALSE),0)","v":0},null,343780,0,26,0,null,"5305910","NORTHSHORE"]
[{"$f":"VLOOKUP(B179,CCDDD!$A$3:$B$319,2,FALSE)","v":"15201"},"5305940","OAK HARBOR",0,0,{"$f":"VLOOKUP(B179,'23-24 Adjusted Formula counts'!$A$2:$L$319,8,FALSE)","v":6127},{"$f":"ROUND((F179/$F$5*Assumptions!$D$14*Assumptions!$D$30),0)","v":32879},{"$f":"VLOOKUP(B179,'23-24 Adjusted Formula counts'!$A$2:$L$319,9,FALSE)","v":554},{"$f":"ROUND((H179/$H$5*Assumptions!$D$14*Assumptions!$D$31),0)","v":107940},null,140819,null,null,140819,0,140819,null,0,140819,null,{"$f":"IFERROR(VLOOKUP($A179,#REF!, 21,FALSE),0)","v":0},null,140819,0,65,0,null,"5305940","OAK HARBOR"]
[{"$f":"VLOOKUP(B180,CCDDD!$A$3:$B$319,2,FALSE)","v":"38324"},"5305970","OAKESDALE",0,0,{"$f":"VLOOKUP(B180,'23-24 Adjusted Formula counts'!$A$2:$L$319,8,FALSE)","v":127},{"$f":"ROUND((F180/$F$5*Assumptions!$D$14*Assumptions!$D$30),0)","v":682},{"$f":"VLOOKUP(B180,'23-24 Adjusted Formula counts'!$A$2:$L$319,9,FALSE)","v":12},{"$f":"ROUND((H180/$H$5*Assumptions!$D$14*Assumptions!$D$31),0)","v":2338},null,3020,null,null,3020,0,3020,null,0,3020,null,{"$f":"IFERROR(VLOOKUP($A180,#REF!, 21,FALSE),0)","v":0},null,3020,0,287,0,null,"5305970","OAKESDALE"]
[{"$f":"VLOOKUP(B181,CCDDD!$A$3:$B$319,2,FALSE)","v":"14400"},"5306000","OAKVILLE",0,0,{"$f":"VLOOKUP(B181,'23-24 Adjusted Formula counts'!$A$2:$L$319,8,FALSE)","v":456},{"$f":"ROUND((F181/$F$5*Assumptions!$D$14*Assumptions!$D$30),0)","v":2447},{"$f":"VLOOKUP(B181,'23-24 Adjusted Formula counts'!$A$2:$L$319,9,FALSE)","v":72},{"$f":"ROUND((H181/$H$5*Assumptions!$D$14*Assumptions!$D$31),0)","v":14028},null,16475,null,null,16475,0,16475,null,0,16475,null,{"$f":"IFERROR(VLOOKUP($A181,#REF!, 21,FALSE),0)","v":0},null,16475,0,198,0,null,"5306000","OAKVILLE"]
[{"$f":"VLOOKUP(B182,CCDDD!$A$3:$B$319,2,FALSE)","v":"25101"},"5306060","OCEAN BEACH",0,0,{"$f":"VLOOKUP(B182,'23-24 Adjusted Formula counts'!$A$2:$L$319,8,FALSE)","v":1066},{"$f":"ROUND((F182/$F$5*Assumptions!$D$14*Assumptions!$D$30),0)","v":5720},{"$f":"VLOOKUP(B182,'23-24 Adjusted Formula counts'!$A$2:$L$319,9,FALSE)","v":210},{"$f":"ROUND((H182/$H$5*Assumptions!$D$14*Assumptions!$D$31),0)","v":40916},null,46636,null,null,46636,0,46636,null,0,46636,null,{"$f":"IFERROR(VLOOKUP($A182,#REF!, 21,FALSE),0)","v":0},null,46636,0,132,0,null,"5306060","OCEAN BEACH"]
[{"$f":"VLOOKUP(B183,CCDDD!$A$3:$B$319,2,FALSE)","v":"14172"},"5306090","OCOSTA",0,0,{"$f":"VLOOKUP(B183,'23-24 Adjusted Formula counts'!$A$2:$L$319,8,FALSE)","v":669},{"$f":"ROUND((F183/$F$5*Assumptions!$D$14*Assumptions!$D$30),0)","v":3590},{"$f":"VLOOKUP(B183,'23-24 Adjusted Formula counts'!$A$2:$L$319,9,FALSE)","v":192},{"$f":"ROUND((H183/$H$5*Assumptions!$D$14*Assumptions!$D$31),0)","v":37409},null,40999,null,null,40999,0,40999,null,0,40999,null,{"$f":"IFERROR(VLOOKUP($A183,#REF!, 21,FALSE),0)","v":0},null,40999,0,142,0,null,"5306090","OCOSTA"]
[{"$f":"VLOOKUP(B184,CCDDD!$A$3:$B$319,2,FALSE)","v":"22105"},"5306120","ODESSA",0,0,{"$f":"VLOOKUP(B184,'23-24 Adjusted Formula counts'!$A$2:$L$319,8,FALSE)","v":304},{"$f":"ROUND((F184/$F$5*Assumptions!$D$14*Assumptions!$D$30),0)","v":1631},{"$f":"VLOOKUP(B184,'23-24 Adjusted Formula counts'!$A$2:$L$319,9,FALSE)","v":40},{"$f":"ROUND((H184/$H$5*Assumptions!$D$14*Assumptions!$D$31),0)","v":7793},null,9424,null,null,9424,0,9424,null,0,9424,null,{"$f":"IFERROR(VLOOKUP($A184,#REF!, 21,FALSE),0)","v":0},null,9424,0,238,0,null,"5306120","ODESSA"]
[{"$f":"VLOOKUP(B185,CCDDD!$A$3:$B$319,2,FALSE)","v":"24105"},"5306150","OKANOGAN",0,0,{"$f":"VLOOKUP(B185,'23-24 Adjusted Formula counts'!$A$2:$L$319,8,FALSE)","v":982},{"$f":"ROUND((F185/$F$5*Assumptions!$D$14*Assumptions!$D$30),0)","v":5270},{"$f":"VLOOKUP(B185,'23-24 Adjusted Formula counts'!$A$2:$L$319,9,FALSE)","v":167},{"$f":"ROUND((H185/$H$5*Assumptions!$D$14*Assumptions!$D$31),0)","v":32538},null,37808,null,null,37808,0,37808,null,0,37808,null,{"$f":"IFERROR(VLOOKUP($A185,#REF!, 21,FALSE),0)","v":0},null,37808,0,148,0,null,"5306150","OKANOGAN"]
[{"$f":"VLOOKUP(B186,CCDDD!$A$3:$B$319,2,FALSE)","v":"34111"},"5306180","OLYMPIA",0,0,{"$f":"VLOOKUP(B186,'23-24 Adjusted Formula counts'!$A$2:$L$319,8,FALSE)","v":10589},{"$f":"ROUND((F186/$F$5*Assumptions!$D$14*Assumptions!$D$30),0)","v":56823},{"$f":"VLOOKUP(B186,'23-24 Adjusted Formula counts'!$A$2:$L$319,9,FALSE)","v":1159},{"$f":"ROUND((H186/$H$5*Assumptions!$D$14*Assumptions!$D$31),0)","v":225816},null,282639,null,null,282639,0,282639,null,0,282639,null,{"$f":"IFERROR(VLOOKUP($A186,#REF!, 21,FALSE),0)","v":0},null,282639,0,33,0,null,"5306180","OLYMPIA"]
[{"$f":"VLOOKUP(B187,CCDDD!$A$3:$B$319,2,FALSE)","v":"24019"},"5306220","OMAK",0,0,{"$f":"VLOOKUP(B187,'23-24 Adjusted Formula counts'!$A$2:$L$319,8,FALSE)","v":1933},{"$f":"ROUND((F187/$F$5*Assumptions!$D$14*Assumptions!$D$30),0)","v":10373},{"$f":"VLOOKUP(B187,'23-24 Adjusted Formula counts'!$A$2:$L$319,9,FALSE)","v":410},{"$f":"ROUND((H187/$H$5*Assumptions!$D$14*Assumptions!$D$31),0)","v":79883},null,90256,null,null,90256,0,90256,null,0,90256,null,{"$f":"IFERROR(VLOOKUP($A187,#REF!, 21,FALSE),0)","v":0},null,90256,0,85,0,null,"5306220","OMAK"]
[{"$f":"VLOOKUP(B188,CCDDD!$A$3:$B$319,2,FALSE)","v":"21300"},"5306240","ONALASKA",0,0,{"$f":"VLOOKUP(B188,'23-24 Adjusted Formula counts'!$A$2:$L$319,8,FALSE)","v":932},{"$f":"ROUND((F188/$F$5*Assumptions!$D$14*Assumptions!$D$30),0)","v":5001},{"$f":"VLOOKUP(B188,'23-24 Adjusted Formula counts'!$A$2:$L$319,9,FALSE)","v":142},{"$f":"ROUND((H188/$H$5*Assumptions!$D$14*Assumptions!$D$31),0)","v":27667},null,32668,null,null,32668,0,32668,null,0,32668,null,{"$f":"IFERROR(VLOOKUP($A188,#REF!, 21,FALSE),0)","v":0},null,32668,0,158,0,null,"5306240","ONALASKA"]
[{"$f":"VLOOKUP(B189,CCDDD!$A$3:$B$319,2,FALSE)","v":"33030"},"5306270","ONION CREEK",0,0,{"$f":"VLOOKUP(B189,'23-24 Adjusted Formula counts'!$A$2:$L$319,8,FALSE)","v":63},{"$f":"ROUND((F189/$F$5*Assumptions!$D$14*Assumptions!$D$30),0)","v":338},{"$f":"VLOOKUP(B189,'23-24 Adjusted Formula counts'!$A$2:$L$319,9,FALSE)","v":15},{"$f":"ROUND((H189/$H$5*Assumptions!$D$14*Assumptions!$D$31),0)","v":2923},null,3261,null,null,3261,0,3261,null,0,3261,null,{"$f":"IFERROR(VLOOKUP($A189,#REF!, 21,FALSE),0)","v":0},null,3261,0,282,0,null,"5306270","ONION CREEK"]
[{"$f":"VLOOKUP(B190,CCDDD!$A$3:$B$319,2,FALSE)","v":"28137"},"5306300","ORCAS ISLAND",0,0,{"$f":"VLOOKUP(B190,'23-24 Adjusted Formula counts'!$A$2:$L$319,8,FALSE)","v":592},{"$f":"ROUND((F190/$F$5*Assumptions!$D$14*Assumptions!$D$30),0)","v":3177},{"$f":"VLOOKUP(B190,'23-24 Adjusted Formula counts'!$A$2:$L$319,9,FALSE)","v":85},{"$f":"ROUND((H190/$H$5*Assumptions!$D$14*Assumptions!$D$31),0)","v":16561},null,19738,null,null,19738,0,19738,null,0,19738,null,{"$f":"IFERROR(VLOOKUP($A190,#REF!, 21,FALSE),0)","v":0},null,19738,0,187,0,null,"5306300","ORCAS ISLAND"]
[{"$f":"VLOOKUP(B191,CCDDD!$A$3:$B$319,2,FALSE)","v":"32123"},"5306330","ORCHARD PRAIRIE",0,0,{"$f":"VLOOKUP(B191,'23-24 Adjusted Formula counts'!$A$2:$L$319,8,FALSE)","v":180},{"$f":"ROUND((F191/$F$5*Assumptions!$D$14*Assumptions!$D$30),0)","v":966},{"$f":"VLOOKUP(B191,'23-24 Adjusted Formula counts'!$A$2:$L$319,9,FALSE)","v":7},{"$f":"ROUND((H191/$H$5*Assumptions!$D$14*Assumptions!$D$31),0)","v":1364},null,2330,null,null,2330,0,2330,null,0,2330,null,{"$f":"IFERROR(VLOOKUP($A191,#REF!, 21,FALSE),0)","v":0},null,2330,0,294,0,null,"5306330","ORCHARD PRAIRIE"]
[{"$f":"VLOOKUP(B192,CCDDD!$A$3:$B$319,2,FALSE)","v":"10065"},"5306360","ORIENT",0,0,{"$f":"VLOOKUP(B192,'23-24 Adjusted Formula counts'!$A$2:$L$319,8,FALSE)","v":127},{"$f":"ROUND((F192/$F$5*Assumptions!$D$14*Assumptions!$D$30),0)","v":682},{"$f":"VLOOKUP(B192,'23-24 Adjusted Formula counts'!$A$2:$L$319,9,FALSE)","v":31},{"$f":"ROUND((H192/$H$5*Assumptions!$D$14*Assumptions!$D$31),0)","v":6040},null,6722,null,null,6722,0,6722,null,0,6722,null,{"$f":"IFERROR(VLOOKUP($A192,#REF!, 21,FALSE),0)","v":0},null,6722,0,252,0,null,"5306360","ORIENT"]
[{"$f":"VLOOKUP(B193,CCDDD!$A$3:$B$319,2,FALSE)","v":"09013"},"5306390","ORONDO",0,0,{"$f":"VLOOKUP(B193,'23-24 Adjusted Formula counts'!$A$2:$L$319,8,FALSE)","v":270},{"$f":"ROUND((F193/$F$5*Assumptions!$D$14*Assumptions!$D$30),0)","v":1449},{"$f":"VLOOKUP(B193,'23-24 Adjusted Formula counts'!$A$2:$L$319,9,FALSE)","v":51},{"$f":"ROUND((H193/$H$5*Assumptions!$D$14*Assumptions!$D$31),0)","v":9937},null,11386,null,null,11386,0,11386,null,0,11386,null,{"$f":"IFERROR(VLOOKUP($A193,#REF!, 21,FALSE),0)","v":0},null,11386,0,224,0,null,"5306390","ORONDO"]
[{"$f":"VLOOKUP(B194,CCDDD!$A$3:$B$319,2,FALSE)","v":"24410"},"5306420","OROVILLE",0,0,{"$f":"VLOOKUP(B194,'23-24 Adjusted Formula counts'!$A$2:$L$319,8,FALSE)","v":712},{"$f":"ROUND((F194/$F$5*Assumptions!$D$14*Assumptions!$D$30),0)","v":3821},{"$f":"VLOOKUP(B194,'23-24 Adjusted Formula counts'!$A$2:$L$319,9,FALSE)","v":208},{"$f":"ROUND((H194/$H$5*Assumptions!$D$14*Assumptions!$D$31),0)","v":40526},null,44347,null,null,44347,0,44347,null,0,44347,null,{"$f":"IFERROR(VLOOKUP($A194,#REF!, 21,FALSE),0)","v":0},null,44347,0,135,0,null,"5306420","OROVILLE"]
[{"$f":"VLOOKUP(B195,CCDDD!$A$3:$B$319,2,FALSE)","v":"27344"},"5306450","ORTING",0,0,{"$f":"VLOOKUP(B195,'23-24 Adjusted Formula counts'!$A$2:$L$319,8,FALSE)","v":3303},{"$f":"ROUND((F195/$F$5*Assumptions!$D$14*Assumptions!$D$30),0)","v":17725},{"$f":"VLOOKUP(B195,'23-24 Adjusted Formula counts'!$A$2:$L$319,9,FALSE)","v":198},{"$f":"ROUND((H195/$H$5*Assumptions!$D$14*Assumptions!$D$31),0)","v":38578},null,56303,null,null,56303,0,56303,null,0,56303,null,{"$f":"IFERROR(VLOOKUP($A195,#REF!, 21,FALSE),0)","v":0},null,56303,0,119,0,null,"5306450","ORTING"]
[{"$f":"VLOOKUP(B196,CCDDD!$A$3:$B$319,2,FALSE)","v":"01147"},"5306480","OTHELLO",0,0,{"$f":"VLOOKUP(B196,'23-24 Adjusted Formula counts'!$A$2:$L$319,8,FALSE)","v":4661},{"$f":"ROUND((F196/$F$5*Assumptions!$D$14*Assumptions!$D$30),0)","v":25012},{"$f":"VLOOKUP(B196,'23-24 Adjusted Formula counts'!$A$2:$L$319,9,FALSE)","v":883},{"$f":"ROUND((H196/$H$5*Assumptions!$D$14*Assumptions!$D$31),0)","v":172041},null,197053,null,null,197053,0,197053,null,0,197053,null,{"$f":"IFERROR(VLOOKUP($A196,#REF!, 21,FALSE),0)","v":0},null,197053,0,42,0,null,"5306480","OTHELLO"]
[{"$f":"VLOOKUP(B197,CCDDD!$A$3:$B$319,2,FALSE)","v":"09102"},"5306510","PALISADES",0,0,{"$f":"VLOOKUP(B197,'23-24 Adjusted Formula counts'!$A$2:$L$319,8,FALSE)","v":48},{"$f":"ROUND((F197/$F$5*Assumptions!$D$14*Assumptions!$D$30),0)","v":258},{"$f":"VLOOKUP(B197,'23-24 Adjusted Formula counts'!$A$2:$L$319,9,FALSE)","v":10},{"$f":"ROUND((H197/$H$5*Assumptions!$D$14*Assumptions!$D$31),0)","v":1948},null,2206,null,null,2206,0,2206,null,0,2206,null,{"$f":"IFERROR(VLOOKUP($A197,#REF!, 21,FALSE),0)","v":0},null,2206,0,297,0,null,"5306510","PALISADES"]
[{"$f":"VLOOKUP(B198,CCDDD!$A$3:$B$319,2,FALSE)","v":"38301"},"5306540","PALOUSE",0,0,{"$f":"VLOOKUP(B198,'23-24 Adjusted Formula counts'!$A$2:$L$319,8,FALSE)","v":240},{"$f":"ROUND((F198/$F$5*Assumptions!$D$14*Assumptions!$D$30),0)","v":1288},{"$f":"VLOOKUP(B198,'23-24 Adjusted Formula counts'!$A$2:$L$319,9,FALSE)","v":23},{"$f":"ROUND((H198/$H$5*Assumptions!$D$14*Assumptions!$D$31),0)","v":4481},null,5769,null,null,5769,0,5769,null,0,5769,null,{"$f":"IFERROR(VLOOKUP($A198,#REF!, 21,FALSE),0)","v":0},null,5769,0,258,0,null,"5306540","PALOUSE"]
[{"$f":"VLOOKUP(B199,CCDDD!$A$3:$B$319,2,FALSE)","v":"11001"},"5306570","PASCO",0,0,{"$f":"VLOOKUP(B199,'23-24 Adjusted Formula counts'!$A$2:$L$319,8,FALSE)","v":20732},{"$f":"ROUND((F199/$F$5*Assumptions!$D$14*Assumptions!$D$30),0)","v":111253},{"$f":"VLOOKUP(B199,'23-24 Adjusted Formula counts'!$A$2:$L$319,9,FALSE)","v":2762},{"$f":"ROUND((H199/$H$5*Assumptions!$D$14*Assumptions!$D$31),0)","v":538140},null,{"$f":"ROUNDDOWN(+I199+G199+E199+D199+J199,0)","v":649393},null,null,{"$f":"K199","v":649393},{"$f":"-ROUND(N199/$N$5*$M$5,0)","v":0},{"$f":"+K199+O199+M199","v":649393},null,{"$f":"-1*(P199*Q199)","v":0},{"$f":"+P199+R199","v":649393},null,{"$f":"IFERROR(VLOOKUP($A199,#REF!, 21,FALSE),0)","v":0},null,{"$f":"+S199-U199","v":649393},{"$f":"IF(U199>0,W199/U199,0)","v":0},10,{"$f":"(SUM(D199:E199)/S199)","v":0},null,{"$f":"+B199","v":"5306570"},{"$f":"+C199","v":"PASCO"}]
[{"$f":"VLOOKUP(B200,CCDDD!$A$3:$B$319,2,FALSE)","v":"24122"},"5306600","PATEROS",0,0,{"$f":"VLOOKUP(B200,'23-24 Adjusted Formula counts'!$A$2:$L$319,8,FALSE)","v":295},{"$f":"ROUND((F200/$F$5*Assumptions!$D$14*Assumptions!$D$30),0)","v":1583},{"$f":"VLOOKUP(B200,'23-24 Adjusted Formula counts'!$A$2:$L$319,9,FALSE)","v":36},{"$f":"ROUND((H200/$H$5*Assumptions!$D$14*Assumptions!$D$31),0)","v":7014},null,8597,null,null,8597,0,8597,null,0,8597,null,{"$f":"IFERROR(VLOOKUP($A200,#REF!, 21,FALSE),0)","v":0},null,8597,0,{"$f":"RANK(W200,$W$7:$W$322,0)","v":242},0,null,"5306600","PATEROS"]
[{"$f":"VLOOKUP(B201,CCDDD!$A$3:$B$319,2,FALSE)","v":"03050"},"5306630","PATERSON",0,0,{"$f":"VLOOKUP(B201,'23-24 Adjusted Formula counts'!$A$2:$L$319,8,FALSE)","v":88},{"$f":"ROUND((F201/$F$5*Assumptions!$D$14*Assumptions!$D$30),0)","v":472},{"$f":"VLOOKUP(B201,'23-24 Adjusted Formula counts'!$A$2:$L$319,9,FALSE)","v":10},{"$f":"ROUND((H201/$H$5*Assumptions!$D$14*Assumptions!$D$31),0)","v":1948},null,2420,null,null,2420,0,2420,null,0,2420,null,{"$f":"IFERROR(VLOOKUP($A201,#REF!, 21,FALSE),0)","v":0},null,2420,0,292,0,null,"5306630","PATERSON"]
[{"$f":"VLOOKUP(B202,CCDDD!$A$3:$B$319,2,FALSE)","v":"21301"},"5306660","PE ELL",0,0,{"$f":"VLOOKUP(B202,'23-24 Adjusted Formula counts'!$A$2:$L$319,8,FALSE)","v":248},{"$f":"ROUND((F202/$F$5*Assumptions!$D$14*Assumptions!$D$30),0)","v":1331},{"$f":"VLOOKUP(B202,'23-24 Adjusted Formula counts'!$A$2:$L$319,9,FALSE)","v":37},{"$f":"ROUND((H202/$H$5*Assumptions!$D$14*Assumptions!$D$31),0)","v":7209},null,8540,null,null,8540,0,8540,null,0,8540,null,{"$f":"IFERROR(VLOOKUP($A202,#REF!, 21,FALSE),0)","v":0},null,8540,0,243,0,null,"5306660","PE ELL"]
[{"$f":"VLOOKUP(B203,CCDDD!$A$3:$B$319,2,FALSE)","v":"27401"},"5306690","PENINSULA",0,0,{"$f":"VLOOKUP(B203,'23-24 Adjusted Formula counts'!$A$2:$L$319,8,FALSE)","v":11879},{"$f":"ROUND((F203/$F$5*Assumptions!$D$14*Assumptions!$D$30),0)","v":63746},{"$f":"VLOOKUP(B203,'23-24 Adjusted Formula counts'!$A$2:$L$319,9,FALSE)","v":621},{"$f":"ROUND((H203/$H$5*Assumptions!$D$14*Assumptions!$D$31),0)","v":120994},null,184740,null,null,184740,0,184740,null,0,184740,null,{"$f":"IFERROR(VLOOKUP($A203,#REF!, 21,FALSE),0)","v":0},null,184740,0,46,0,null,"5306690","PENINSULA"]
[{"$f":"VLOOKUP(B204,CCDDD!$A$3:$B$319,2,FALSE)","v":"04901"},"5306770","PINNACLE PREP CHARTER",0,0,{"$f":"VLOOKUP(B204,'23-24 Adjusted Formula counts'!$A$2:$L$319,8,FALSE)","v":86.276984659999997},{"$f":"ROUND((F204/$F$5*Assumptions!$D$14*Assumptions!$D$30),0)","v":463},{"$f":"VLOOKUP(B204,'23-24 Adjusted Formula counts'!$A$2:$L$319,9,FALSE)","v":10.28775913},{"$f":"ROUND((H204/$H$5*Assumptions!$D$14*Assumptions!$D$31),0)","v":2004},null,2467,null,null,2467,0,2467,null,0,2467,null,{"$f":"IFERROR(VLOOKUP($A204,#REF!, 21,FALSE),0)","v":0},null,2467,0,291,0,null,"5306770","PINNACLE PREP CHARTER"]
[{"$f":"VLOOKUP(B205,CCDDD!$A$3:$B$319,2,FALSE)","v":"23402"},"5306750","PIONEER",0,0,{"$f":"VLOOKUP(B205,'23-24 Adjusted Formula counts'!$A$2:$L$319,8,FALSE)","v":1504},{"$f":"ROUND((F205/$F$5*Assumptions!$D$14*Assumptions!$D$30),0)","v":8071},{"$f":"VLOOKUP(B205,'23-24 Adjusted Formula counts'!$A$2:$L$319,9,FALSE)","v":242},{"$f":"ROUND((H205/$H$5*Assumptions!$D$14*Assumptions!$D$31),0)","v":47151},null,55222,null,null,55222,0,55222,null,0,55222,null,{"$f":"IFERROR(VLOOKUP($A205,#REF!, 21,FALSE),0)","v":0},null,55222,0,122,0,null,"5306750","PIONEER"]
[{"$f":"VLOOKUP(B206,CCDDD!$A$3:$B$319,2,FALSE)","v":"12110"},"5306780","POMEROY",0,0,{"$f":"VLOOKUP(B206,'23-24 Adjusted Formula counts'!$A$2:$L$319,8,FALSE)","v":363},{"$f":"ROUND((F206/$F$5*Assumptions!$D$14*Assumptions!$D$30),0)","v":1948},{"$f":"VLOOKUP(B206,'23-24 Adjusted Formula counts'!$A$2:$L$319,9,FALSE)","v":59},{"$f":"ROUND((H206/$H$5*Assumptions!$D$14*Assumptions!$D$31),0)","v":11495},null,13443,null,null,13443,0,13443,null,0,13443,null,{"$f":"IFERROR(VLOOKUP($A206,#REF!, 21,FALSE),0)","v":0},null,13443,0,212,0,null,"5306780","POMEROY"]
[{"$f":"VLOOKUP(B207,CCDDD!$A$3:$B$319,2,FALSE)","v":"05121"},"5306820","PORT ANGELES",0,0,{"$f":"VLOOKUP(B207,'23-24 Adjusted Formula counts'!$A$2:$L$319,8,FALSE)","v":4440},{"$f":"ROUND((F207/$F$5*Assumptions!$D$14*Assumptions!$D$30),0)","v":23826},{"$f":"VLOOKUP(B207,'23-24 Adjusted Formula counts'!$A$2:$L$319,9,FALSE)","v":653},{"$f":"ROUND((H207/$H$5*Assumptions!$D$14*Assumptions!$D$31),0)","v":127229},null,151055,null,null,151055,0,151055,null,0,151055,null,{"$f":"IFERROR(VLOOKUP($A207,#REF!, 21,FALSE),0)","v":0},null,151055,0,63,0,null,"5306820","PORT ANGELES"]
[{"$f":"VLOOKUP(B208,CCDDD!$A$3:$B$319,2,FALSE)","v":"16050"},"5306840","PORT TOWNSEND",0,0,{"$f":"VLOOKUP(B208,'23-24 Adjusted Formula counts'!$A$2:$L$319,8,FALSE)","v":1377},{"$f":"ROUND((F208/$F$5*Assumptions!$D$14*Assumptions!$D$30),0)","v":7389},{"$f":"VLOOKUP(B208,'23-24 Adjusted Formula counts'!$A$2:$L$319,9,FALSE)","v":261},{"$f":"ROUND((H208/$H$5*Assumptions!$D$14*Assumptions!$D$31),0)","v":50852},null,58241,null,null,58241,0,58241,null,0,58241,null,{"$f":"IFERROR(VLOOKUP($A208,#REF!, 21,FALSE),0)","v":0},null,58241,0,118,0,null,"5306840","PORT TOWNSEND"]
[{"$f":"VLOOKUP(B209,CCDDD!$A$3:$B$319,2,FALSE)","v":"36402"},"5306870","PRESCOTT",0,0,{"$f":"VLOOKUP(B209,'23-24 Adjusted Formula counts'!$A$2:$L$319,8,FALSE)","v":357},{"$f":"ROUND((F209/$F$5*Assumptions!$D$14*Assumptions!$D$30),0)","v":1916},{"$f":"VLOOKUP(B209,'23-24 Adjusted Formula counts'!$A$2:$L$319,9,FALSE)","v":46},{"$f":"ROUND((H209/$H$5*Assumptions!$D$14*Assumptions!$D$31),0)","v":8963},null,10879,null,null,10879,0,10879,null,0,10879,null,{"$f":"IFERROR(VLOOKUP($A209,#REF!, 21,FALSE),0)","v":0},null,10879,0,227,0,null,"5306870","PRESCOTT"]
[{"$f":"VLOOKUP(B210,CCDDD!$A$3:$B$319,2,FALSE)","v":"32907"},"5306890","PRIDE PREP CHARTER",0,0,{"$f":"VLOOKUP(B210,'23-24 Adjusted Formula counts'!$A$2:$L$319,8,FALSE)","v":598.46357620000003},{"$f":"ROUND((F210/$F$5*Assumptions!$D$14*Assumptions!$D$30),0)","v":3211},{"$f":"VLOOKUP(B210,'23-24 Adjusted Formula counts'!$A$2:$L$319,9,FALSE)","v":78.724149550000007},{"$f":"ROUND((H210/$H$5*Assumptions!$D$14*Assumptions!$D$31),0)","v":15338},null,18549,null,null,18549,0,18549,null,0,18549,null,{"$f":"IFERROR(VLOOKUP($A210,#REF!, 21,FALSE),0)","v":0},null,18549,0,190,0,null,"5306890","PRIDE PREP CHARTER"]
[{"$f":"VLOOKUP(B211,CCDDD!$A$3:$B$319,2,FALSE)","v":"03116"},"5306900","PROSSER",0,0,{"$f":"VLOOKUP(B211,'23-24 Adjusted Formula counts'!$A$2:$L$319,8,FALSE)","v":2907},{"$f":"ROUND((F211/$F$5*Assumptions!$D$14*Assumptions!$D$30),0)","v":15600},{"$f":"VLOOKUP(B211,'23-24 Adjusted Formula counts'!$A$2:$L$319,9,FALSE)","v":358},{"$f":"ROUND((H211/$H$5*Assumptions!$D$14*Assumptions!$D$31),0)","v":69752},null,85352,null,null,85352,0,85352,null,0,85352,null,{"$f":"IFERROR(VLOOKUP($A211,#REF!, 21,FALSE),0)","v":0},null,85352,0,89,0,null,"5306900","PROSSER"]
[{"$f":"VLOOKUP(B212,CCDDD!$A$3:$B$319,2,FALSE)","v":"38901"},"5306940","PULLMAN MONTESSORI CHARTER",0,0,{"$f":"VLOOKUP(B212,'23-24 Adjusted Formula counts'!$A$2:$L$319,8,FALSE)","v":109.5647668},{"$f":"ROUND((F212/$F$5*Assumptions!$D$14*Assumptions!$D$30),0)","v":588},{"$f":"VLOOKUP(B212,'23-24 Adjusted Formula counts'!$A$2:$L$319,9,FALSE)","v":7.4178082190000003},{"$f":"ROUND((H212/$H$5*Assumptions!$D$14*Assumptions!$D$31),0)","v":1445},null,2033,null,null,2033,0,2033,null,0,2033,null,{"$f":"IFERROR(VLOOKUP($A212,#REF!, 21,FALSE),0)","v":0},null,2033,0,302,0,null,"5306940","PULLMAN MONTESSORI CHARTER"]
[{"$f":"VLOOKUP(B213,CCDDD!$A$3:$B$319,2,FALSE)","v":"38267"},"5306930","PULLMAN",0,0,{"$f":"VLOOKUP(B213,'23-24 Adjusted Formula counts'!$A$2:$L$319,8,FALSE)","v":3099.440415},{"$f":"ROUND((F213/$F$5*Assumptions!$D$14*Assumptions!$D$30),0)","v":16632},{"$f":"VLOOKUP(B213,'23-24 Adjusted Formula counts'!$A$2:$L$319,9,FALSE)","v":349.34344420000002},{"$f":"ROUND((H213/$H$5*Assumptions!$D$14*Assumptions!$D$31),0)","v":68065},null,84697,null,null,84697,0,84697,null,0,84697,null,{"$f":"IFERROR(VLOOKUP($A213,#REF!, 21,FALSE),0)","v":0},null,84697,0,90,0,null,"5306930","PULLMAN"]
[{"$f":"VLOOKUP(B214,CCDDD!$A$3:$B$319,2,FALSE)","v":"27003"},"5306960","PUYALLUP",0,0,{"$f":"VLOOKUP(B214,'23-24 Adjusted Formula counts'!$A$2:$L$319,8,FALSE)","v":25979},{"$f":"ROUND((F214/$F$5*Assumptions!$D$14*Assumptions!$D$30),0)","v":139410},{"$f":"VLOOKUP(B214,'23-24 Adjusted Formula counts'!$A$2:$L$319,9,FALSE)","v":1842},{"$f":"ROUND((H214/$H$5*Assumptions!$D$14*Assumptions!$D$31),0)","v":358890},null,498300,null,null,498300,0,498300,null,0,498300,null,{"$f":"IFERROR(VLOOKUP($A214,#REF!, 21,FALSE),0)","v":0},null,498300,0,16,0,null,"5306960","PUYALLUP"]
[{"$f":"VLOOKUP(B215,CCDDD!$A$3:$B$319,2,FALSE)","v":"16020"},"5301380","QUEETS-CLEARWATER",0,0,{"$f":"VLOOKUP(B215,'23-24 Adjusted Formula counts'!$A$2:$L$319,8,FALSE)","v":33},{"$f":"ROUND((F215/$F$5*Assumptions!$D$14*Assumptions!$D$30),0)","v":177},{"$f":"VLOOKUP(B215,'23-24 Adjusted Formula counts'!$A$2:$L$319,9,FALSE)","v":9},{"$f":"ROUND((H215/$H$5*Assumptions!$D$14*Assumptions!$D$31),0)","v":1754},null,1931,null,null,1931,0,1931,null,0,1931,null,{"$f":"IFERROR(VLOOKUP($A215,#REF!, 21,FALSE),0)","v":0},null,1931,0,305,0,null,"5301380","QUEETS-CLEARWATER"]
[{"$f":"VLOOKUP(B216,CCDDD!$A$3:$B$319,2,FALSE)","v":"16048"},"5306990","QUILCENE",0,0,{"$f":"VLOOKUP(B216,'23-24 Adjusted Formula counts'!$A$2:$L$319,8,FALSE)","v":204},{"$f":"ROUND((F216/$F$5*Assumptions!$D$14*Assumptions!$D$30),0)","v":1095},{"$f":"VLOOKUP(B216,'23-24 Adjusted Formula counts'!$A$2:$L$319,9,FALSE)","v":28},{"$f":"ROUND((H216/$H$5*Assumptions!$D$14*Assumptions!$D$31),0)","v":5455},null,6550,null,null,6550,0,6550,0.1042,{"$f":"-1*(P216*Q216)","v":-682.51},5867.49,null,{"$f":"IFERROR(VLOOKUP($A216,#REF!, 21,FALSE),0)","v":0},null,5867.49,0,257,0,null,"5306990","QUILCENE"]
[{"$f":"VLOOKUP(B217,CCDDD!$A$3:$B$319,2,FALSE)","v":"05402"},"5307020","QUILLAYUTE VALLEY",0,0,{"$f":"VLOOKUP(B217,'23-24 Adjusted Formula counts'!$A$2:$L$319,8,FALSE)","v":1213},{"$f":"ROUND((F217/$F$5*Assumptions!$D$14*Assumptions!$D$30),0)","v":6509},{"$f":"VLOOKUP(B217,'23-24 Adjusted Formula counts'!$A$2:$L$319,9,FALSE)","v":272},{"$f":"ROUND((H217/$H$5*Assumptions!$D$14*Assumptions!$D$31),0)","v":52996},null,59505,null,null,59505,0,59505,null,{"$f":"-1*(P217*Q217)","v":0},59505,null,{"$f":"IFERROR(VLOOKUP($A217,#REF!, 21,FALSE),0)","v":0},null,59505,0,116,0,null,"5307020","QUILLAYUTE VALLEY"]
[{"$f":"VLOOKUP(B218,CCDDD!$A$3:$B$319,2,FALSE)","v":"13144"},"5307080","QUINCY",0,0,{"$f":"VLOOKUP(B218,'23-24 Adjusted Formula counts'!$A$2:$L$319,8,FALSE)","v":3190},{"$f":"ROUND((F218/$F$5*Assumptions!$D$14*Assumptions!$D$30),0)","v":17118},{"$f":"VLOOKUP(B218,'23-24 Adjusted Formula counts'!$A$2:$L$319,9,FALSE)","v":426},{"$f":"ROUND((H218/$H$5*Assumptions!$D$14*Assumptions!$D$31),0)","v":83001},null,100119,null,null,100119,0,100119,null,0,100119,null,{"$f":"IFERROR(VLOOKUP($A218,#REF!, 21,FALSE),0)","v":0},null,100119,0,82,0,null,"5307080","QUINCY"]
[{"$f":"VLOOKUP(B219,CCDDD!$A$3:$B$319,2,FALSE)","v":"17908"},"5307120","RAINIER PREP CHARTER",0,0,{"$f":"VLOOKUP(B219,'23-24 Adjusted Formula counts'!$A$2:$L$319,8,FALSE)","v":373.05795599999999},{"$f":"ROUND((F219/$F$5*Assumptions!$D$14*Assumptions!$D$30),0)","v":2002},{"$f":"VLOOKUP(B219,'23-24 Adjusted Formula counts'!$A$2:$L$319,9,FALSE)","v":56.12211757},{"$f":"ROUND((H219/$H$5*Assumptions!$D$14*Assumptions!$D$31),0)","v":10935},null,12937,null,null,12937,0,12937,null,0,12937,null,{"$f":"IFERROR(VLOOKUP($A219,#REF!, 21,FALSE),0)","v":0},null,12937,0,215,0,null,"5307120","RAINIER PREP CHARTER"]
[{"$f":"VLOOKUP(B220,CCDDD!$A$3:$B$319,2,FALSE)","v":"34307"},"5307110","RAINIER",0,0,{"$f":"VLOOKUP(B220,'23-24 Adjusted Formula counts'!$A$2:$L$319,8,FALSE)","v":1044},{"$f":"ROUND((F220/$F$5*Assumptions!$D$14*Assumptions!$D$30),0)","v":5602},{"$f":"VLOOKUP(B220,'23-24 Adjusted Formula counts'!$A$2:$L$319,9,FALSE)","v":155},{"$f":"ROUND((H220/$H$5*Assumptions!$D$14*Assumptions!$D$31),0)","v":30200},null,35802,null,null,35802,0,35802,null,0,35802,null,{"$f":"IFERROR(VLOOKUP($A220,#REF!, 21,FALSE),0)","v":0},null,35802,0,154,0,null,"5307110","RAINIER"]
[{"$f":"VLOOKUP(B221,CCDDD!$A$3:$B$319,2,FALSE)","v":"25116"},"5307140","RAYMOND",0,0,{"$f":"VLOOKUP(B221,'23-24 Adjusted Formula counts'!$A$2:$L$319,8,FALSE)","v":641},{"$f":"ROUND((F221/$F$5*Assumptions!$D$14*Assumptions!$D$30),0)","v":3440},{"$f":"VLOOKUP(B221,'23-24 Adjusted Formula counts'!$A$2:$L$319,9,FALSE)","v":103},{"$f":"ROUND((H221/$H$5*Assumptions!$D$14*Assumptions!$D$31),0)","v":20068},null,23508,null,null,23508,0,23508,null,0,23508,null,{"$f":"IFERROR(VLOOKUP($A221,#REF!, 21,FALSE),0)","v":0},null,23508,0,179,0,null,"5307140","RAYMOND"]
[{"$f":"VLOOKUP(B222,CCDDD!$A$3:$B$319,2,FALSE)","v":"22009"},"5307210","REARDAN-EDWALL",0,0,{"$f":"VLOOKUP(B222,'23-24 Adjusted Formula counts'!$A$2:$L$319,8,FALSE)","v":991},{"$f":"ROUND((F222/$F$5*Assumptions!$D$14*Assumptions!$D$30),0)","v":5318},{"$f":"VLOOKUP(B222,'23-24 Adjusted Formula counts'!$A$2:$L$319,9,FALSE)","v":115},{"$f":"ROUND((H222/$H$5*Assumptions!$D$14*Assumptions!$D$31),0)","v":22406},null,27724,null,null,27724,0,27724,null,0,27724,null,{"$f":"IFERROR(VLOOKUP($A222,#REF!, 21,FALSE),0)","v":0},null,27724,0,170,0,null,"5307210","REARDAN-EDWALL"]
[{"$f":"VLOOKUP(B223,CCDDD!$A$3:$B$319,2,FALSE)","v":"17403"},"5307230","RENTON",0,0,{"$f":"VLOOKUP(B223,'23-24 Adjusted Formula counts'!$A$2:$L$319,8,FALSE)","v":17916.014289999999},{"$f":"ROUND((F223/$F$5*Assumptions!$D$14*Assumptions!$D$30),0)","v":96142},{"$f":"VLOOKUP(B223,'23-24 Adjusted Formula counts'!$A$2:$L$319,9,FALSE)","v":2371.0265279999999},{"$f":"ROUND((H223/$H$5*Assumptions!$D$14*Assumptions!$D$31),0)","v":461964},null,558106,null,null,558106,0,558106,null,0,558106,null,{"$f":"IFERROR(VLOOKUP($A223,#REF!, 21,FALSE),0)","v":0},null,558106,0,14,0,null,"5307230","RENTON"]
[{"$f":"VLOOKUP(B224,CCDDD!$A$3:$B$319,2,FALSE)","v":"10309"},"5307260","REPUBLIC",0,0,{"$f":"VLOOKUP(B224,'23-24 Adjusted Formula counts'!$A$2:$L$319,8,FALSE)","v":347},{"$f":"ROUND((F224/$F$5*Assumptions!$D$14*Assumptions!$D$30),0)","v":1862},{"$f":"VLOOKUP(B224,'23-24 Adjusted Formula counts'!$A$2:$L$319,9,FALSE)","v":85},{"$f":"ROUND((H224/$H$5*Assumptions!$D$14*Assumptions!$D$31),0)","v":16561},null,18423,null,null,18423,0,18423,null,0,18423,null,{"$f":"IFERROR(VLOOKUP($A224,#REF!, 21,FALSE),0)","v":0},null,18423,0,191,0,null,"5307260","REPUBLIC"]
[{"$f":"VLOOKUP(B225,CCDDD!$A$3:$B$319,2,FALSE)","v":"03400"},"5307320","RICHLAND",0,0,{"$f":"VLOOKUP(B225,'23-24 Adjusted Formula counts'!$A$2:$L$319,8,FALSE)","v":15521},{"$f":"ROUND((F225/$F$5*Assumptions!$D$14*Assumptions!$D$30),0)","v":83289},{"$f":"VLOOKUP(B225,'23-24 Adjusted Formula counts'!$A$2:$L$319,9,FALSE)","v":1486},{"$f":"ROUND((H225/$H$5*Assumptions!$D$14*Assumptions!$D$31),0)","v":289528},null,372817,null,null,372817,0,372817,null,0,372817,null,{"$f":"IFERROR(VLOOKUP($A225,#REF!, 21,FALSE),0)","v":0},null,372817,0,25,0,null,"5307320","RICHLAND"]
[{"$f":"VLOOKUP(B226,CCDDD!$A$3:$B$319,2,FALSE)","v":"06122"},"5307350","RIDGEFIELD",0,0,{"$f":"VLOOKUP(B226,'23-24 Adjusted Formula counts'!$A$2:$L$319,8,FALSE)","v":4226},{"$f":"ROUND((F226/$F$5*Assumptions!$D$14*Assumptions!$D$30),0)","v":22678},{"$f":"VLOOKUP(B226,'23-24 Adjusted Formula counts'!$A$2:$L$319,9,FALSE)","v":247},{"$f":"ROUND((H226/$H$5*Assumptions!$D$14*Assumptions!$D$31),0)","v":48125},null,70803,null,null,70803,0,70803,null,0,70803,null,{"$f":"IFERROR(VLOOKUP($A226,#REF!, 21,FALSE),0)","v":0},null,70803,0,102,0,null,"5307350","RIDGEFIELD"]
[{"$f":"VLOOKUP(B227,CCDDD!$A$3:$B$319,2,FALSE)","v":"01160"},"5307380","RITZVILLE",0,0,{"$f":"VLOOKUP(B227,'23-24 Adjusted Formula counts'!$A$2:$L$319,8,FALSE)","v":425},{"$f":"ROUND((F227/$F$5*Assumptions!$D$14*Assumptions!$D$30),0)","v":2281},{"$f":"VLOOKUP(B227,'23-24 Adjusted Formula counts'!$A$2:$L$319,9,FALSE)","v":55},{"$f":"ROUND((H227/$H$5*Assumptions!$D$14*Assumptions!$D$31),0)","v":10716},null,12997,null,null,12997,0,12997,null,0,12997,null,{"$f":"IFERROR(VLOOKUP($A227,#REF!, 21,FALSE),0)","v":0},null,12997,0,214,0,null,"5307380","RITZVILLE"]
[{"$f":"VLOOKUP(B228,CCDDD!$A$3:$B$319,2,FALSE)","v":"32416"},"5307440","RIVERSIDE",0,0,{"$f":"VLOOKUP(B228,'23-24 Adjusted Formula counts'!$A$2:$L$319,8,FALSE)","v":2065},{"$f":"ROUND((F228/$F$5*Assumptions!$D$14*Assumptions!$D$30),0)","v":11081},{"$f":"VLOOKUP(B228,'23-24 Adjusted Formula counts'!$A$2:$L$319,9,FALSE)","v":249},{"$f":"ROUND((H228/$H$5*Assumptions!$D$14*Assumptions!$D$31),0)","v":48514},null,59595,null,null,59595,0,59595,null,0,59595,null,{"$f":"IFERROR(VLOOKUP($A228,#REF!, 21,FALSE),0)","v":0},null,59595,0,115,0,null,"5307440","RIVERSIDE"]
[{"$f":"VLOOKUP(B229,CCDDD!$A$3:$B$319,2,FALSE)","v":"17407"},"5304560","RIVERVIEW",0,0,{"$f":"VLOOKUP(B229,'23-24 Adjusted Formula counts'!$A$2:$L$319,8,FALSE)","v":3896},{"$f":"ROUND((F229/$F$5*Assumptions!$D$14*Assumptions!$D$30),0)","v":20907},{"$f":"VLOOKUP(B229,'23-24 Adjusted Formula counts'!$A$2:$L$319,9,FALSE)","v":206},{"$f":"ROUND((H229/$H$5*Assumptions!$D$14*Assumptions!$D$31),0)","v":40136},null,61043,null,null,61043,0,61043,null,0,61043,null,{"$f":"IFERROR(VLOOKUP($A229,#REF!, 21,FALSE),0)","v":0},null,61043,0,111,0,null,"5304560","RIVERVIEW"]
[{"$f":"VLOOKUP(B230,CCDDD!$A$3:$B$319,2,FALSE)","v":"34401"},"5307470","ROCHESTER",0,0,{"$f":"VLOOKUP(B230,'23-24 Adjusted Formula counts'!$A$2:$L$319,8,FALSE)","v":2522},{"$f":"ROUND((F230/$F$5*Assumptions!$D$14*Assumptions!$D$30),0)","v":13534},{"$f":"VLOOKUP(B230,'23-24 Adjusted Formula counts'!$A$2:$L$319,9,FALSE)","v":349},{"$f":"ROUND((H230/$H$5*Assumptions!$D$14*Assumptions!$D$31),0)","v":67998},null,81532,null,null,81532,0,81532,null,0,81532,null,{"$f":"IFERROR(VLOOKUP($A230,#REF!, 21,FALSE),0)","v":0},null,81532,0,94,0,null,"5307470","ROCHESTER"]
[{"$f":"VLOOKUP(B231,CCDDD!$A$3:$B$319,2,FALSE)","v":"20403"},"5307530","ROOSEVELT",0,0,{"$f":"VLOOKUP(B231,'23-24 Adjusted Formula counts'!$A$2:$L$319,8,FALSE)","v":43},{"$f":"ROUND((F231/$F$5*Assumptions!$D$14*Assumptions!$D$30),0)","v":231},{"$f":"VLOOKUP(B231,'23-24 Adjusted Formula counts'!$A$2:$L$319,9,FALSE)","v":10},{"$f":"ROUND((H231/$H$5*Assumptions!$D$14*Assumptions!$D$31),0)","v":1948},null,2179,null,null,2179,0,2179,null,0,2179,null,{"$f":"IFERROR(VLOOKUP($A231,#REF!, 21,FALSE),0)","v":0},null,2179,0,298,0,null,"5307530","ROOSEVELT"]
[{"$f":"VLOOKUP(B232,CCDDD!$A$3:$B$319,2,FALSE)","v":"38320"},"5307560","ROSALIA",0,0,{"$f":"VLOOKUP(B232,'23-24 Adjusted Formula counts'!$A$2:$L$319,8,FALSE)","v":240},{"$f":"ROUND((F232/$F$5*Assumptions!$D$14*Assumptions!$D$30),0)","v":1288},{"$f":"VLOOKUP(B232,'23-24 Adjusted Formula counts'!$A$2:$L$319,9,FALSE)","v":38},{"$f":"ROUND((H232/$H$5*Assumptions!$D$14*Assumptions!$D$31),0)","v":7404},null,8692,null,null,8692,0,8692,null,0,8692,null,{"$f":"IFERROR(VLOOKUP($A232,#REF!, 21,FALSE),0)","v":0},null,8692,0,241,0,null,"5307560","ROSALIA"]
[{"$f":"VLOOKUP(B233,CCDDD!$A$3:$B$319,2,FALSE)","v":"13160"},"5307620","ROYAL",0,0,{"$f":"VLOOKUP(B233,'23-24 Adjusted Formula counts'!$A$2:$L$319,8,FALSE)","v":1673},{"$f":"ROUND((F233/$F$5*Assumptions!$D$14*Assumptions!$D$30),0)","v":8978},{"$f":"VLOOKUP(B233,'23-24 Adjusted Formula counts'!$A$2:$L$319,9,FALSE)","v":209},{"$f":"ROUND((H233/$H$5*Assumptions!$D$14*Assumptions!$D$31),0)","v":40721},null,49699,null,null,49699,0,49699,null,0,49699,null,{"$f":"IFERROR(VLOOKUP($A233,#REF!, 21,FALSE),0)","v":0},null,49699,0,129,0,null,"5307620","ROYAL"]
[{"$f":"VLOOKUP(B234,CCDDD!$A$3:$B$319,2,FALSE)","v":"28149"},"5307650","SAN JUAN ISLAND",0,0,{"$f":"VLOOKUP(B234,'23-24 Adjusted Formula counts'!$A$2:$L$319,8,FALSE)","v":899},{"$f":"ROUND((F234/$F$5*Assumptions!$D$14*Assumptions!$D$30),0)","v":4824},{"$f":"VLOOKUP(B234,'23-24 Adjusted Formula counts'!$A$2:$L$319,9,FALSE)","v":120},{"$f":"ROUND((H234/$H$5*Assumptions!$D$14*Assumptions!$D$31),0)","v":23380},null,28204,null,null,28204,0,28204,null,0,28204,null,{"$f":"IFERROR(VLOOKUP($A234,#REF!, 21,FALSE),0)","v":0},null,28204,0,168,0,null,"5307650","SAN JUAN ISLAND"]
[{"$f":"VLOOKUP(B235,CCDDD!$A$3:$B$319,2,FALSE)","v":"14104"},"5307680","SATSOP",0,0,{"$f":"VLOOKUP(B235,'23-24 Adjusted Formula counts'!$A$2:$L$319,8,FALSE)","v":112},{"$f":"ROUND((F235/$F$5*Assumptions!$D$14*Assumptions!$D$30),0)","v":601},{"$f":"VLOOKUP(B235,'23-24 Adjusted Formula counts'!$A$2:$L$319,9,FALSE)","v":22},{"$f":"ROUND((H235/$H$5*Assumptions!$D$14*Assumptions!$D$31),0)","v":4286},null,4887,null,null,4887,0,4887,null,0,4887,null,{"$f":"IFERROR(VLOOKUP($A235,#REF!, 21,FALSE),0)","v":0},null,4887,0,266,0,null,"5307680","SATSOP"]
[{"$f":"VLOOKUP(B236,CCDDD!$A$3:$B$319,2,FALSE)","v":"34975"},"5307700","SCHOOL FOR THE DEAF",0,0,{"$f":"VLOOKUP(B236,'23-24 Adjusted Formula counts'!$A$2:$L$319,8,FALSE)","v":126.5734266},{"$f":"ROUND((F236/$F$5*Assumptions!$D$14*Assumptions!$D$30),0)","v":679},{"$f":"VLOOKUP(B236,'23-24 Adjusted Formula counts'!$A$2:$L$319,9,FALSE)","v":19.54449339},{"$f":"ROUND((H236/$H$5*Assumptions!$D$14*Assumptions!$D$31),0)","v":3808},null,{"$f":"ROUNDDOWN(+I236+G236+E236+D236+J236,0)","v":4487},null,null,4487,0,4487,null,0,4487,null,{"$f":"IFERROR(VLOOKUP($A236,#REF!, 21,FALSE),0)","v":0},null,4487,0,270,0,null,"5307700","SCHOOL FOR THE DEAF"]
[{"$f":"VLOOKUP(B237,CCDDD!$A$3:$B$319,2,FALSE)","v":"34974"},"5307690","SCHOOL OF THE BLIND",0,0,{"$f":"VLOOKUP(B237,'23-24 Adjusted Formula counts'!$A$2:$L$319,8,FALSE)","v":66.738715830000004},{"$f":"ROUND((F237/$F$5*Assumptions!$D$14*Assumptions!$D$30),0)","v":358},{"$f":"VLOOKUP(B237,'23-24 Adjusted Formula counts'!$A$2:$L$319,9,FALSE)","v":4.4673127749999999},{"$f":"ROUND((H237/$H$5*Assumptions!$D$14*Assumptions!$D$31),0)","v":870},null,{"$f":"ROUNDDOWN(+I237+G237+E237+D237+J237,0)","v":1228},null,null,1228,0,1228,null,0,1228,null,{"$f":"IFERROR(VLOOKUP($A237,#REF!, 21,FALSE),0)","v":0},null,1228,0,310,0,null,"5307690","SCHOOL OF THE BLIND"]
[{"$f":"VLOOKUP(B238,CCDDD!$A$3:$B$319,2,FALSE)","v":"17001"},"5307710","SEATTLE",0,0,{"$f":"VLOOKUP(B238,'23-24 Adjusted Formula counts'!$A$2:$L$319,8,FALSE)","v":69797.731629999995},{"$f":"ROUND((F238/$F$5*Assumptions!$D$14*Assumptions!$D$30),0)","v":374551},{"$f":"VLOOKUP(B238,'23-24 Adjusted Formula counts'!$A$2:$L$319,9,FALSE)","v":6817.6207590000004},{"$f":"ROUND((H238/$H$5*Assumptions!$D$14*Assumptions!$D$31),0)","v":1328325},null,{"$f":"ROUNDDOWN(+I238+G238+E238+D238+J238,0)-9","v":1702867},null,null,1702867,0,1702867,null,0,1702867,null,{"$f":"IFERROR(VLOOKUP($A238,#REF!, 21,FALSE),0)","v":0},null,1702867,0,1,0,null,"5307710","SEATTLE"]
[{"$f":"VLOOKUP(B239,CCDDD!$A$3:$B$319,2,FALSE)","v":"29101"},"5307740","SEDRO-WOOLLEY",0,0,{"$f":"VLOOKUP(B239,'23-24 Adjusted Formula counts'!$A$2:$L$319,8,FALSE)","v":5216},{"$f":"ROUND((F239/$F$5*Assumptions!$D$14*Assumptions!$D$30),0)","v":27990},{"$f":"VLOOKUP(B239,'23-24 Adjusted Formula counts'!$A$2:$L$319,9,FALSE)","v":637},{"$f":"ROUND((H239/$H$5*Assumptions!$D$14*Assumptions!$D$31),0)","v":124111},null,152101,null,null,152101,0,152101,null,0,152101,null,{"$f":"IFERROR(VLOOKUP($A239,#REF!, 21,FALSE),0)","v":0},null,152101,0,62,0,null,"5307740","SEDRO-WOOLLEY"]
[{"$f":"VLOOKUP(B240,CCDDD!$A$3:$B$319,2,FALSE)","v":"39119"},"5307770","SELAH",0,0,{"$f":"VLOOKUP(B240,'23-24 Adjusted Formula counts'!$A$2:$L$319,8,FALSE)","v":4248},{"$f":"ROUND((F240/$F$5*Assumptions!$D$14*Assumptions!$D$30),0)","v":22796},{"$f":"VLOOKUP(B240,'23-24 Adjusted Formula counts'!$A$2:$L$319,9,FALSE)","v":447},{"$f":"ROUND((H240/$H$5*Assumptions!$D$14*Assumptions!$D$31),0)","v":87092},null,109888,null,null,109888,0,109888,null,0,109888,null,{"$f":"IFERROR(VLOOKUP($A240,#REF!, 21,FALSE),0)","v":0},null,109888,0,75,0,null,"5307770","SELAH"]
[{"$f":"VLOOKUP(B241,CCDDD!$A$3:$B$319,2,FALSE)","v":"26070"},"5307800","SELKIRK",0,0,{"$f":"VLOOKUP(B241,'23-24 Adjusted Formula counts'!$A$2:$L$319,8,FALSE)","v":299},{"$f":"ROUND((F241/$F$5*Assumptions!$D$14*Assumptions!$D$30),0)","v":1605},{"$f":"VLOOKUP(B241,'23-24 Adjusted Formula counts'!$A$2:$L$319,9,FALSE)","v":78},{"$f":"ROUND((H241/$H$5*Assumptions!$D$14*Assumptions!$D$31),0)","v":15197},null,16802,null,null,16802,0,16802,null,0,16802,null,{"$f":"IFERROR(VLOOKUP($A241,#REF!, 21,FALSE),0)","v":0},null,16802,0,196,0,null,"5307800","SELKIRK"]
[{"$f":"VLOOKUP(B242,CCDDD!$A$3:$B$319,2,FALSE)","v":"05323"},"5307830","SEQUIM",0,0,{"$f":"VLOOKUP(B242,'23-24 Adjusted Formula counts'!$A$2:$L$319,8,FALSE)","v":3263},{"$f":"ROUND((F242/$F$5*Assumptions!$D$14*Assumptions!$D$30),0)","v":17510},{"$f":"VLOOKUP(B242,'23-24 Adjusted Formula counts'!$A$2:$L$319,9,FALSE)","v":496},{"$f":"ROUND((H242/$H$5*Assumptions!$D$14*Assumptions!$D$31),0)","v":96639},null,114149,null,null,114149,0,114149,null,0,114149,null,{"$f":"IFERROR(VLOOKUP($A242,#REF!, 21,FALSE),0)","v":0},null,114149,0,73,0,null,"5307830","SEQUIM"]
[{"$f":"VLOOKUP(B243,CCDDD!$A$3:$B$319,2,FALSE)","v":"28010"},"5307860","SHAW ISLAND",0,0,{"$f":"VLOOKUP(B243,'23-24 Adjusted Formula counts'!$A$2:$L$319,8,FALSE)","v":23},{"$f":"ROUND((F243/$F$5*Assumptions!$D$14*Assumptions!$D$30),0)","v":123},{"$f":"VLOOKUP(B243,'23-24 Adjusted Formula counts'!$A$2:$L$319,9,FALSE)","v":3},{"$f":"ROUND((H243/$H$5*Assumptions!$D$14*Assumptions!$D$31),0)","v":585},null,708,null,null,708,0,708,null,0,708,null,{"$f":"IFERROR(VLOOKUP($A243,#REF!, 21,FALSE),0)","v":0},null,708,0,314,0,null,"5307860","SHAW ISLAND"]
[{"$f":"VLOOKUP(B244,CCDDD!$A$3:$B$319,2,FALSE)","v":"23309"},"5307900","SHELTON",0,0,{"$f":"VLOOKUP(B244,'23-24 Adjusted Formula counts'!$A$2:$L$319,8,FALSE)","v":4156},{"$f":"ROUND((F244/$F$5*Assumptions!$D$14*Assumptions!$D$30),0)","v":22302},{"$f":"VLOOKUP(B244,'23-24 Adjusted Formula counts'!$A$2:$L$319,9,FALSE)","v":804},{"$f":"ROUND((H244/$H$5*Assumptions!$D$14*Assumptions!$D$31),0)","v":156649},null,178951,null,null,178951,0,178951,null,0,178951,null,{"$f":"IFERROR(VLOOKUP($A244,#REF!, 21,FALSE),0)","v":0},null,178951,0,50,0,null,"5307900","SHELTON"]
[{"$f":"VLOOKUP(B245,CCDDD!$A$3:$B$319,2,FALSE)","v":"17412"},"5307920","SHORELINE",0,0,{"$f":"VLOOKUP(B245,'23-24 Adjusted Formula counts'!$A$2:$L$319,8,FALSE)","v":10556},{"$f":"ROUND((F245/$F$5*Assumptions!$D$14*Assumptions!$D$30),0)","v":56646},{"$f":"VLOOKUP(B245,'23-24 Adjusted Formula counts'!$A$2:$L$319,9,FALSE)","v":801},{"$f":"ROUND((H245/$H$5*Assumptions!$D$14*Assumptions!$D$31),0)","v":156064},null,212710,null,null,212710,0,212710,null,0,212710,null,{"$f":"IFERROR(VLOOKUP($A245,#REF!, 21,FALSE),0)","v":0},null,212710,0,41,0,null,"5307920","SHORELINE"]
[{"$f":"VLOOKUP(B246,CCDDD!$A$3:$B$319,2,FALSE)","v":"30002"},"5307950","SKAMANIA",0,0,{"$f":"VLOOKUP(B246,'23-24 Adjusted Formula counts'!$A$2:$L$319,8,FALSE)","v":127},{"$f":"ROUND((F246/$F$5*Assumptions!$D$14*Assumptions!$D$30),0)","v":682},{"$f":"VLOOKUP(B246,'23-24 Adjusted Formula counts'!$A$2:$L$319,9,FALSE)","v":14},{"$f":"ROUND((H246/$H$5*Assumptions!$D$14*Assumptions!$D$31),0)","v":2728},null,3410,null,null,3410,0,3410,null,0,3410,null,{"$f":"IFERROR(VLOOKUP($A246,#REF!, 21,FALSE),0)","v":0},null,3410,0,279,0,null,"5307950","SKAMANIA"]
[{"$f":"VLOOKUP(B247,CCDDD!$A$3:$B$319,2,FALSE)","v":"17404"},"5307980","SKYKOMISH",0,0,{"$f":"VLOOKUP(B247,'23-24 Adjusted Formula counts'!$A$2:$L$319,8,FALSE)","v":70},{"$f":"ROUND((F247/$F$5*Assumptions!$D$14*Assumptions!$D$30),0)","v":376},{"$f":"VLOOKUP(B247,'23-24 Adjusted Formula counts'!$A$2:$L$319,9,FALSE)","v":10},{"$f":"ROUND((H247/$H$5*Assumptions!$D$14*Assumptions!$D$31),0)","v":1948},null,2324,null,null,2324,0,2324,null,0,2324,null,{"$f":"IFERROR(VLOOKUP($A247,#REF!, 21,FALSE),0)","v":0},null,2324,0,295,0,null,"5307980","SKYKOMISH"]
[{"$f":"VLOOKUP(B248,CCDDD!$A$3:$B$319,2,FALSE)","v":"31201"},"5308020","SNOHOMISH",0,0,{"$f":"VLOOKUP(B248,'23-24 Adjusted Formula counts'!$A$2:$L$319,8,FALSE)","v":10865},{"$f":"ROUND((F248/$F$5*Assumptions!$D$14*Assumptions!$D$30),0)","v":58304},{"$f":"VLOOKUP(B248,'23-24 Adjusted Formula counts'!$A$2:$L$319,9,FALSE)","v":500},{"$f":"ROUND((H248/$H$5*Assumptions!$D$14*Assumptions!$D$31),0)","v":97419},null,155723,null,null,155723,0,155723,null,0,155723,null,{"$f":"IFERROR(VLOOKUP($A248,#REF!, 21,FALSE),0)","v":0},null,155723,0,61,0,null,"5308020","SNOHOMISH"]
[{"$f":"VLOOKUP(B249,CCDDD!$A$3:$B$319,2,FALSE)","v":"17410"},"5308040","SNOQUALMIE VALLEY",0,0,{"$f":"VLOOKUP(B249,'23-24 Adjusted Formula counts'!$A$2:$L$319,8,FALSE)","v":7917},{"$f":"ROUND((F249/$F$5*Assumptions!$D$14*Assumptions!$D$30),0)","v":42485},{"$f":"VLOOKUP(B249,'23-24 Adjusted Formula counts'!$A$2:$L$319,9,FALSE)","v":383},{"$f":"ROUND((H249/$H$5*Assumptions!$D$14*Assumptions!$D$31),0)","v":74623},null,117108,null,null,117108,0,117108,null,0,117108,null,{"$f":"IFERROR(VLOOKUP($A249,#REF!, 21,FALSE),0)","v":0},null,117108,0,70,0,null,"5308040","SNOQUALMIE VALLEY"]
[{"$f":"VLOOKUP(B250,CCDDD!$A$3:$B$319,2,FALSE)","v":"13156"},"5308070","SOAP LAKE",0,0,{"$f":"VLOOKUP(B250,'23-24 Adjusted Formula counts'!$A$2:$L$319,8,FALSE)","v":619},{"$f":"ROUND((F250/$F$5*Assumptions!$D$14*Assumptions!$D$30),0)","v":3322},{"$f":"VLOOKUP(B250,'23-24 Adjusted Formula counts'!$A$2:$L$319,9,FALSE)","v":115},{"$f":"ROUND((H250/$H$5*Assumptions!$D$14*Assumptions!$D$31),0)","v":22406},null,25728,null,null,25728,0,25728,null,0,25728,null,{"$f":"IFERROR(VLOOKUP($A250,#REF!, 21,FALSE),0)","v":0},null,25728,0,173,0,null,"5308070","SOAP LAKE"]
[{"$f":"VLOOKUP(B251,CCDDD!$A$3:$B$319,2,FALSE)","v":"25118"},"5308100","SOUTH BEND",0,0,{"$f":"VLOOKUP(B251,'23-24 Adjusted Formula counts'!$A$2:$L$319,8,FALSE)","v":391},{"$f":"ROUND((F251/$F$5*Assumptions!$D$14*Assumptions!$D$30),0)","v":2098},{"$f":"VLOOKUP(B251,'23-24 Adjusted Formula counts'!$A$2:$L$319,9,FALSE)","v":78},{"$f":"ROUND((H251/$H$5*Assumptions!$D$14*Assumptions!$D$31),0)","v":15197},null,17295,null,null,17295,0,17295,null,0,17295,null,{"$f":"IFERROR(VLOOKUP($A251,#REF!, 21,FALSE),0)","v":0},null,17295,0,195,0,null,"5308100","SOUTH BEND"]
[{"$f":"VLOOKUP(B252,CCDDD!$A$3:$B$319,2,FALSE)","v":"18402"},"5308160","SOUTH KITSAP",0,0,{"$f":"VLOOKUP(B252,'23-24 Adjusted Formula counts'!$A$2:$L$319,8,FALSE)","v":11857},{"$f":"ROUND((F252/$F$5*Assumptions!$D$14*Assumptions!$D$30),0)","v":63628},{"$f":"VLOOKUP(B252,'23-24 Adjusted Formula counts'!$A$2:$L$319,9,FALSE)","v":1033},{"$f":"ROUND((H252/$H$5*Assumptions!$D$14*Assumptions!$D$31),0)","v":201267},null,264895,null,null,264895,0,264895,null,0,264895,null,{"$f":"IFERROR(VLOOKUP($A252,#REF!, 21,FALSE),0)","v":0},null,264895,0,35,0,null,"5308160","SOUTH KITSAP"]
[{"$f":"VLOOKUP(B253,CCDDD!$A$3:$B$319,2,FALSE)","v":"15206"},"5308190","SOUTH WHIDBEY",0,0,{"$f":"VLOOKUP(B253,'23-24 Adjusted Formula counts'!$A$2:$L$319,8,FALSE)","v":1792},{"$f":"ROUND((F253/$F$5*Assumptions!$D$14*Assumptions!$D$30),0)","v":9616},{"$f":"VLOOKUP(B253,'23-24 Adjusted Formula counts'!$A$2:$L$319,9,FALSE)","v":173},{"$f":"ROUND((H253/$H$5*Assumptions!$D$14*Assumptions!$D$31),0)","v":33707},null,43323,null,null,43323,0,43323,null,0,43323,null,{"$f":"IFERROR(VLOOKUP($A253,#REF!, 21,FALSE),0)","v":0},null,43323,0,138,0,null,"5308190","SOUTH WHIDBEY"]
[{"$f":"VLOOKUP(B254,CCDDD!$A$3:$B$319,2,FALSE)","v":"23042"},"5308220","SOUTHSIDE",0,0,{"$f":"VLOOKUP(B254,'23-24 Adjusted Formula counts'!$A$2:$L$319,8,FALSE)","v":355},{"$f":"ROUND((F254/$F$5*Assumptions!$D$14*Assumptions!$D$30),0)","v":1905},{"$f":"VLOOKUP(B254,'23-24 Adjusted Formula counts'!$A$2:$L$319,9,FALSE)","v":46},{"$f":"ROUND((H254/$H$5*Assumptions!$D$14*Assumptions!$D$31),0)","v":8963},null,10868,null,null,10868,0,10868,null,0,10868,null,{"$f":"IFERROR(VLOOKUP($A254,#REF!, 21,FALSE),0)","v":0},null,10868,0,228,0,null,"5308220","SOUTHSIDE"]
[{"$f":"VLOOKUP(B255,CCDDD!$A$3:$B$319,2,FALSE)","v":"32901"},"5308260","SPOKANE INTERNATIONAL ACADEMY CHARTER",0,0,{"$f":"VLOOKUP(B255,'23-24 Adjusted Formula counts'!$A$2:$L$319,8,FALSE)","v":864.96688740000002},{"$f":"ROUND((F255/$F$5*Assumptions!$D$14*Assumptions!$D$30),0)","v":4642},{"$f":"VLOOKUP(B255,'23-24 Adjusted Formula counts'!$A$2:$L$319,9,FALSE)","v":98.127989220000003},{"$f":"ROUND((H255/$H$5*Assumptions!$D$14*Assumptions!$D$31),0)","v":19119},null,23761,null,null,23761,0,23761,null,0,23761,null,{"$f":"IFERROR(VLOOKUP($A255,#REF!, 21,FALSE),0)","v":0},null,23761,0,177,0,null,"5308260","SPOKANE INTERNATIONAL ACADEMY CHARTER"]
[{"$f":"VLOOKUP(B256,CCDDD!$A$3:$B$319,2,FALSE)","v":"32081"},"5308250","SPOKANE",0,0,{"$f":"VLOOKUP(B256,'23-24 Adjusted Formula counts'!$A$2:$L$319,8,FALSE)","v":34073.850989999999},{"$f":"ROUND((F256/$F$5*Assumptions!$D$14*Assumptions!$D$30),0)","v":182849},{"$f":"VLOOKUP(B256,'23-24 Adjusted Formula counts'!$A$2:$L$319,9,FALSE)","v":4743.6844060000003},{"$f":"ROUND((H256/$H$5*Assumptions!$D$14*Assumptions!$D$31),0)","v":924245},null,1107094,null,null,1107094,0,1107094,null,0,1107094,null,{"$f":"IFERROR(VLOOKUP($A256,#REF!, 21,FALSE),0)","v":0},null,1107094,0,2,0,null,"5308250","SPOKANE"]
[{"$f":"VLOOKUP(B257,CCDDD!$A$3:$B$319,2,FALSE)","v":"22008"},"5308280","SPRAGUE",0,0,{"$f":"VLOOKUP(B257,'23-24 Adjusted Formula counts'!$A$2:$L$319,8,FALSE)","v":126},{"$f":"ROUND((F257/$F$5*Assumptions!$D$14*Assumptions!$D$30),0)","v":676},{"$f":"VLOOKUP(B257,'23-24 Adjusted Formula counts'!$A$2:$L$319,9,FALSE)","v":22},{"$f":"ROUND((H257/$H$5*Assumptions!$D$14*Assumptions!$D$31),0)","v":4286},null,4962,null,null,4962,0,4962,null,0,4962,null,{"$f":"IFERROR(VLOOKUP($A257,#REF!, 21,FALSE),0)","v":0},null,4962,0,265,0,null,"5308280","SPRAGUE"]
[{"$f":"VLOOKUP(B258,CCDDD!$A$3:$B$319,2,FALSE)","v":"38322"},"5308310","ST JOHN",0,0,{"$f":"VLOOKUP(B258,'23-24 Adjusted Formula counts'!$A$2:$L$319,8,FALSE)","v":158},{"$f":"ROUND((F258/$F$5*Assumptions!$D$14*Assumptions!$D$30),0)","v":848},{"$f":"VLOOKUP(B258,'23-24 Adjusted Formula counts'!$A$2:$L$319,9,FALSE)","v":17},{"$f":"ROUND((H258/$H$5*Assumptions!$D$14*Assumptions!$D$31),0)","v":3312},null,4160,null,null,4160,0,4160,null,0,4160,null,{"$f":"IFERROR(VLOOKUP($A258,#REF!, 21,FALSE),0)","v":0},null,4160,0,274,0,null,"5308310","ST JOHN"]
[{"$f":"VLOOKUP(B259,CCDDD!$A$3:$B$319,2,FALSE)","v":"31401"},"5308340","STANWOOD",0,0,{"$f":"VLOOKUP(B259,'23-24 Adjusted Formula counts'!$A$2:$L$319,8,FALSE)","v":5502},{"$f":"ROUND((F259/$F$5*Assumptions!$D$14*Assumptions!$D$30),0)","v":29525},{"$f":"VLOOKUP(B259,'23-24 Adjusted Formula counts'!$A$2:$L$319,9,FALSE)","v":398},{"$f":"ROUND((H259/$H$5*Assumptions!$D$14*Assumptions!$D$31),0)","v":77545},null,107070,null,null,107070,0,107070,null,0,107070,null,{"$f":"IFERROR(VLOOKUP($A259,#REF!, 21,FALSE),0)","v":0},null,107070,0,77,0,null,"5308340","STANWOOD"]
[{"$f":"VLOOKUP(B260,CCDDD!$A$3:$B$319,2,FALSE)","v":"11054"},"5308370","STAR",0,0,{"$f":"VLOOKUP(B260,'23-24 Adjusted Formula counts'!$A$2:$L$319,8,FALSE)","v":26},{"$f":"ROUND((F260/$F$5*Assumptions!$D$14*Assumptions!$D$30),0)","v":140},{"$f":"VLOOKUP(B260,'23-24 Adjusted Formula counts'!$A$2:$L$319,9,FALSE)","v":5},{"$f":"ROUND((H260/$H$5*Assumptions!$D$14*Assumptions!$D$31),0)","v":974},null,1114,null,null,1114,0,1114,null,0,1114,null,{"$f":"IFERROR(VLOOKUP($A260,#REF!, 21,FALSE),0)","v":0},null,1114,0,311,0,null,"5308370","STAR"]
[{"$f":"VLOOKUP(B261,CCDDD!$A$3:$B$319,2,FALSE)","v":"07035"},"5308400","STARBUCK",0,0,{"$f":"VLOOKUP(B261,'23-24 Adjusted Formula counts'!$A$2:$L$319,8,FALSE)","v":16},{"$f":"ROUND((F261/$F$5*Assumptions!$D$14*Assumptions!$D$30),0)","v":86},{"$f":"VLOOKUP(B261,'23-24 Adjusted Formula counts'!$A$2:$L$319,9,FALSE)","v":5},{"$f":"ROUND((H261/$H$5*Assumptions!$D$14*Assumptions!$D$31),0)","v":974},null,1060,null,null,1060,0,1060,null,0,{"$f":"+P261+R261","v":1060},null,{"$f":"IFERROR(VLOOKUP($A261,#REF!, 21,FALSE),0)","v":0},null,{"$f":"+S261-U261","v":1060},{"$f":"IF(U261>0,W261/U261,0)","v":0},312,0,null,"5308400","STARBUCK"]
[{"$f":"VLOOKUP(B262,CCDDD!$A$3:$B$319,2,FALSE)","v":"04069"},"5308430","STEHEKIN",0,0,{"$f":"VLOOKUP(B262,'23-24 Adjusted Formula counts'!$A$2:$L$319,8,FALSE)","v":15},{"$f":"ROUND((F262/$F$5*Assumptions!$D$14*Assumptions!$D$30),0)","v":80},{"$f":"VLOOKUP(B262,'23-24 Adjusted Formula counts'!$A$2:$L$319,9,FALSE)","v":2},{"$f":"ROUND((H262/$H$5*Assumptions!$D$14*Assumptions!$D$31),0)","v":390},null,470,null,null,{"$f":"K262","v":470},{"$f":"-ROUND(N262/$N$5*$M$5,0)","v":0},{"$f":"+K262+O262+M262","v":470},null,0,470,null,{"$f":"IFERROR(VLOOKUP($A262,#REF!, 21,FALSE),0)","v":0},null,470,0,315,{"$f":"(SUM(D262:E262)/S262)","v":0},null,{"$f":"+B262","v":"5308430"},{"$f":"+C262","v":"STEHEKIN"}]
[{"$f":"VLOOKUP(B263,CCDDD!$A$3:$B$319,2,FALSE)","v":"27001"},"5308460","STEILACOOM",0,0,{"$f":"VLOOKUP(B263,'23-24 Adjusted Formula counts'!$A$2:$L$319,8,FALSE)","v":4019},{"$f":"ROUND((F263/$F$5*Assumptions!$D$14*Assumptions!$D$30),0)","v":21567},{"$f":"VLOOKUP(B263,'23-24 Adjusted Formula counts'!$A$2:$L$319,9,FALSE)","v":240},{"$f":"ROUND((H263/$H$5*Assumptions!$D$14*Assumptions!$D$31),0)","v":46761},null,68328,null,null,68328,0,68328,null,0,68328,null,{"$f":"IFERROR(VLOOKUP($A263,#REF!, 21,FALSE),0)","v":0},null,68328,0,105,0,null,"5308460","STEILACOOM"]
[{"$f":"VLOOKUP(B264,CCDDD!$A$3:$B$319,2,FALSE)","v":"38304"},"5308490","STEPTOE",0,0,{"$f":"VLOOKUP(B264,'23-24 Adjusted Formula counts'!$A$2:$L$319,8,FALSE)","v":51},{"$f":"ROUND((F264/$F$5*Assumptions!$D$14*Assumptions!$D$30),0)","v":274},{"$f":"VLOOKUP(B264,'23-24 Adjusted Formula counts'!$A$2:$L$319,9,FALSE)","v":9},{"$f":"ROUND((H264/$H$5*Assumptions!$D$14*Assumptions!$D$31),0)","v":1754},null,2028,null,null,2028,0,2028,null,0,2028,null,{"$f":"IFERROR(VLOOKUP($A264,#REF!, 21,FALSE),0)","v":0},null,2028,0,{"$f":"RANK(W264,$W$7:$W$322,0)","v":303},0,null,"5308490","STEPTOE"]
[{"$f":"VLOOKUP(B265,CCDDD!$A$3:$B$319,2,FALSE)","v":"30303"},"5308520","STEVENSON-CARSON",0,0,{"$f":"VLOOKUP(B265,'23-24 Adjusted Formula counts'!$A$2:$L$319,8,FALSE)","v":921},{"$f":"ROUND((F265/$F$5*Assumptions!$D$14*Assumptions!$D$30),0)","v":4942},{"$f":"VLOOKUP(B265,'23-24 Adjusted Formula counts'!$A$2:$L$319,9,FALSE)","v":116},{"$f":"ROUND((H265/$H$5*Assumptions!$D$14*Assumptions!$D$31),0)","v":22601},null,27543,null,null,27543,0,27543,null,0,27543,null,{"$f":"IFERROR(VLOOKUP($A265,#REF!, 21,FALSE),0)","v":0},null,27543,0,171,0,null,"5308520","STEVENSON-CARSON"]
[{"$f":"VLOOKUP(B266,CCDDD!$A$3:$B$319,2,FALSE)","v":"31311"},"5308550","SULTAN",0,0,{"$f":"VLOOKUP(B266,'23-24 Adjusted Formula counts'!$A$2:$L$319,8,FALSE)","v":2532},{"$f":"ROUND((F266/$F$5*Assumptions!$D$14*Assumptions!$D$30),0)","v":13587},{"$f":"VLOOKUP(B266,'23-24 Adjusted Formula counts'!$A$2:$L$319,9,FALSE)","v":241},{"$f":"ROUND((H266/$H$5*Assumptions!$D$14*Assumptions!$D$31),0)","v":46956},null,60543,null,null,60543,0,60543,null,0,60543,null,{"$f":"IFERROR(VLOOKUP($A266,#REF!, 21,FALSE),0)","v":0},null,60543,0,112,0,null,"5308550","SULTAN"]
[{"$f":"VLOOKUP(B267,CCDDD!$A$3:$B$319,2,FALSE)","v":"17905"},"5308290","SUMMIT ATLAS CHARTER",0,0,{"$f":"VLOOKUP(B267,'23-24 Adjusted Formula counts'!$A$2:$L$319,8,FALSE)","v":636.64532099999997},{"$f":"ROUND((F267/$F$5*Assumptions!$D$14*Assumptions!$D$30),0)","v":3416},{"$f":"VLOOKUP(B267,'23-24 Adjusted Formula counts'!$A$2:$L$319,9,FALSE)","v":83.689620379999994},{"$f":"ROUND((H267/$H$5*Assumptions!$D$14*Assumptions!$D$31),0)","v":16306},null,19722,null,null,19722,0,19722,null,0,19722,null,{"$f":"IFERROR(VLOOKUP($A267,#REF!, 21,FALSE),0)","v":0},null,19722,0,188,0,null,"5308290","SUMMIT ATLAS CHARTER"]
[{"$f":"VLOOKUP(B268,CCDDD!$A$3:$B$319,2,FALSE)","v":"27905"},"5308230","SUMMIT OLYMPUS CHARTER",0,0,{"$f":"VLOOKUP(B268,'23-24 Adjusted Formula counts'!$A$2:$L$319,8,FALSE)","v":187.4332129},{"$f":"ROUND((F268/$F$5*Assumptions!$D$14*Assumptions!$D$30),0)","v":1006},{"$f":"VLOOKUP(B268,'23-24 Adjusted Formula counts'!$A$2:$L$319,9,FALSE)","v":21.615927159999998},{"$f":"ROUND((H268/$H$5*Assumptions!$D$14*Assumptions!$D$31),0)","v":4212},null,{"$f":"ROUNDDOWN(+I268+G268+E268+D268+J268,0)","v":5218},null,null,5218,0,5218,null,0,5218,null,{"$f":"IFERROR(VLOOKUP($A268,#REF!, 21,FALSE),0)","v":0},null,5218,0,261,0,null,"5308230","SUMMIT OLYMPUS CHARTER"]
[{"$f":"VLOOKUP(B269,CCDDD!$A$3:$B$319,2,FALSE)","v":"17902"},"5308240","SUMMIT SIERRA CHARTER",0,0,{"$f":"VLOOKUP(B269,'23-24 Adjusted Formula counts'!$A$2:$L$319,8,FALSE)","v":329.29930389999998},{"$f":"ROUND((F269/$F$5*Assumptions!$D$14*Assumptions!$D$30),0)","v":1767},{"$f":"VLOOKUP(B269,'23-24 Adjusted Formula counts'!$A$2:$L$319,9,FALSE)","v":33.475848149999997},{"$f":"ROUND((H269/$H$5*Assumptions!$D$14*Assumptions!$D$31),0)","v":6522},null,8289,null,null,8289,0,8289,null,0,8289,null,{"$f":"IFERROR(VLOOKUP($A269,#REF!, 21,FALSE),0)","v":0},null,8289,0,244,0,null,"5308240","SUMMIT SIERRA CHARTER"]
[{"$f":"VLOOKUP(B270,CCDDD!$A$3:$B$319,2,FALSE)","v":"33202"},"5308580","SUMMIT VALLEY",0,0,{"$f":"VLOOKUP(B270,'23-24 Adjusted Formula counts'!$A$2:$L$319,8,FALSE)","v":115},{"$f":"ROUND((F270/$F$5*Assumptions!$D$14*Assumptions!$D$30),0)","v":617},{"$f":"VLOOKUP(B270,'23-24 Adjusted Formula counts'!$A$2:$L$319,9,FALSE)","v":27},{"$f":"ROUND((H270/$H$5*Assumptions!$D$14*Assumptions!$D$31),0)","v":5261},null,5878,null,null,5878,0,5878,null,0,5878,null,{"$f":"IFERROR(VLOOKUP($A270,#REF!, 21,FALSE),0)","v":0},null,5878,0,256,0,null,"5308580","SUMMIT VALLEY"]
[{"$f":"VLOOKUP(B271,CCDDD!$A$3:$B$319,2,FALSE)","v":"27320"},"5308610","SUMNER",0,0,{"$f":"VLOOKUP(B271,'23-24 Adjusted Formula counts'!$A$2:$L$319,8,FALSE)","v":10792},{"$f":"ROUND((F271/$F$5*Assumptions!$D$14*Assumptions!$D$30),0)","v":57912},{"$f":"VLOOKUP(B271,'23-24 Adjusted Formula counts'!$A$2:$L$319,9,FALSE)","v":613},{"$f":"ROUND((H271/$H$5*Assumptions!$D$14*Assumptions!$D$31),0)","v":119435},null,177347,null,null,177347,0,177347,null,0,177347,null,{"$f":"IFERROR(VLOOKUP($A271,#REF!, 21,FALSE),0)","v":0},null,177347,0,51,0,null,"5308610","SUMNER"]
[{"$f":"VLOOKUP(B272,CCDDD!$A$3:$B$319,2,FALSE)","v":"39201"},"5308670","SUNNYSIDE",0,0,{"$f":"VLOOKUP(B272,'23-24 Adjusted Formula counts'!$A$2:$L$319,8,FALSE)","v":6305},{"$f":"ROUND((F272/$F$5*Assumptions!$D$14*Assumptions!$D$30),0)","v":33834},{"$f":"VLOOKUP(B272,'23-24 Adjusted Formula counts'!$A$2:$L$319,9,FALSE)","v":1283},{"$f":"ROUND((H272/$H$5*Assumptions!$D$14*Assumptions!$D$31),0)","v":249976},null,283810,null,null,283810,0,283810,null,0,283810,null,{"$f":"IFERROR(VLOOKUP($A272,#REF!, 21,FALSE),0)","v":0},null,283810,0,32,0,null,"5308670","SUNNYSIDE"]
[{"$f":"VLOOKUP(B273,CCDDD!$A$3:$B$319,2,FALSE)","v":"18902"},"5308690","SUQUAMISH",0,0,{"$f":"VLOOKUP(B273,'23-24 Adjusted Formula counts'!$A$2:$L$319,8,FALSE)","v":96.545791320000006},{"$f":"ROUND((F273/$F$5*Assumptions!$D$14*Assumptions!$D$30),0)","v":518},{"$f":"VLOOKUP(B273,'23-24 Adjusted Formula counts'!$A$2:$L$319,9,FALSE)","v":17.556629829999999},{"$f":"ROUND((H273/$H$5*Assumptions!$D$14*Assumptions!$D$31),0)","v":3421},null,3939,null,null,3939,0,3939,null,0,3939,null,{"$f":"IFERROR(VLOOKUP($A273,#REF!, 21,FALSE),0)","v":0},null,3939,0,276,0,null,"5308690","SUQUAMISH"]
[{"$f":"VLOOKUP(B274,CCDDD!$A$3:$B$319,2,FALSE)","v":"27010"},"5308700","TACOMA",0,0,{"$f":"VLOOKUP(B274,'23-24 Adjusted Formula counts'!$A$2:$L$319,8,FALSE)","v":33051.519099999998},{"$f":"ROUND((F274/$F$5*Assumptions!$D$14*Assumptions!$D$30),0)","v":177362},{"$f":"VLOOKUP(B274,'23-24 Adjusted Formula counts'!$A$2:$L$319,9,FALSE)","v":4078.2049240000001},{"$f":"ROUND((H274/$H$5*Assumptions!$D$14*Assumptions!$D$31),0)","v":794585},null,971947,null,null,971947,0,971947,null,0,971947,null,{"$f":"IFERROR(VLOOKUP($A274,#REF!, 21,FALSE),0)","v":0},null,971947,0,4,0,null,"5308700","TACOMA"]
[{"$f":"VLOOKUP(B275,CCDDD!$A$3:$B$319,2,FALSE)","v":"14077"},"5308730","TAHOLAH",0,0,{"$f":"VLOOKUP(B275,'23-24 Adjusted Formula counts'!$A$2:$L$319,8,FALSE)","v":351},{"$f":"ROUND((F275/$F$5*Assumptions!$D$14*Assumptions!$D$30),0)","v":1884},{"$f":"VLOOKUP(B275,'23-24 Adjusted Formula counts'!$A$2:$L$319,9,FALSE)","v":74},{"$f":"ROUND((H275/$H$5*Assumptions!$D$14*Assumptions!$D$31),0)","v":14418},null,16302,null,null,16302,0,16302,null,0,16302,null,{"$f":"IFERROR(VLOOKUP($A275,#REF!, 21,FALSE),0)","v":0},null,16302,0,199,0,null,"5308730","TAHOLAH"]
[{"$f":"VLOOKUP(B276,CCDDD!$A$3:$B$319,2,FALSE)","v":"17409"},"5308760","TAHOMA",0,0,{"$f":"VLOOKUP(B276,'23-24 Adjusted Formula counts'!$A$2:$L$319,8,FALSE)","v":9264},{"$f":"ROUND((F276/$F$5*Assumptions!$D$14*Assumptions!$D$30),0)","v":49713},{"$f":"VLOOKUP(B276,'23-24 Adjusted Formula counts'!$A$2:$L$319,9,FALSE)","v":446},{"$f":"ROUND((H276/$H$5*Assumptions!$D$14*Assumptions!$D$31),0)","v":86897},null,136610,null,null,136610,0,136610,null,0,136610,null,{"$f":"IFERROR(VLOOKUP($A276,#REF!, 21,FALSE),0)","v":0},null,136610,0,66,0,null,"5308760","TAHOMA"]
[{"$f":"VLOOKUP(B277,CCDDD!$A$3:$B$319,2,FALSE)","v":"38265"},"5308790","TEKOA",0,0,{"$f":"VLOOKUP(B277,'23-24 Adjusted Formula counts'!$A$2:$L$319,8,FALSE)","v":164},{"$f":"ROUND((F277/$F$5*Assumptions!$D$14*Assumptions!$D$30),0)","v":880},{"$f":"VLOOKUP(B277,'23-24 Adjusted Formula counts'!$A$2:$L$319,9,FALSE)","v":27},{"$f":"ROUND((H277/$H$5*Assumptions!$D$14*Assumptions!$D$31),0)","v":5261},null,6141,null,null,6141,0,6141,null,0,6141,null,{"$f":"IFERROR(VLOOKUP($A277,#REF!, 21,FALSE),0)","v":0},null,6141,0,255,0,null,"5308790","TEKOA"]
[{"$f":"VLOOKUP(B278,CCDDD!$A$3:$B$319,2,FALSE)","v":"34402"},"5308820","TENINO",0,0,{"$f":"VLOOKUP(B278,'23-24 Adjusted Formula counts'!$A$2:$L$319,8,FALSE)","v":1538},{"$f":"ROUND((F278/$F$5*Assumptions!$D$14*Assumptions!$D$30),0)","v":8253},{"$f":"VLOOKUP(B278,'23-24 Adjusted Formula counts'!$A$2:$L$319,9,FALSE)","v":213},{"$f":"ROUND((H278/$H$5*Assumptions!$D$14*Assumptions!$D$31),0)","v":41500},null,49753,null,null,49753,0,49753,null,0,49753,null,{"$f":"IFERROR(VLOOKUP($A278,#REF!, 21,FALSE),0)","v":0},null,49753,0,128,0,null,"5308820","TENINO"]
[{"$f":"VLOOKUP(B279,CCDDD!$A$3:$B$319,2,FALSE)","v":"19400"},"5308850","THORP",0,0,{"$f":"VLOOKUP(B279,'23-24 Adjusted Formula counts'!$A$2:$L$319,8,FALSE)","v":201},{"$f":"ROUND((F279/$F$5*Assumptions!$D$14*Assumptions!$D$30),0)","v":1079},{"$f":"VLOOKUP(B279,'23-24 Adjusted Formula counts'!$A$2:$L$319,9,FALSE)","v":30},{"$f":"ROUND((H279/$H$5*Assumptions!$D$14*Assumptions!$D$31),0)","v":5845},null,6924,null,null,6924,0,6924,null,0,6924,null,{"$f":"IFERROR(VLOOKUP($A279,#REF!, 21,FALSE),0)","v":0},null,6924,0,250,0,null,"5308850","THORP"]
[{"$f":"VLOOKUP(B280,CCDDD!$A$3:$B$319,2,FALSE)","v":"21237"},"5308910","TOLEDO",0,0,{"$f":"VLOOKUP(B280,'23-24 Adjusted Formula counts'!$A$2:$L$319,8,FALSE)","v":851},{"$f":"ROUND((F280/$F$5*Assumptions!$D$14*Assumptions!$D$30),0)","v":4567},{"$f":"VLOOKUP(B280,'23-24 Adjusted Formula counts'!$A$2:$L$319,9,FALSE)","v":96},{"$f":"ROUND((H280/$H$5*Assumptions!$D$14*Assumptions!$D$31),0)","v":18704},null,23271,null,null,23271,0,23271,null,0,23271,null,{"$f":"IFERROR(VLOOKUP($A280,#REF!, 21,FALSE),0)","v":0},null,23271,0,180,0,null,"5308910","TOLEDO"]
[{"$f":"VLOOKUP(B281,CCDDD!$A$3:$B$319,2,FALSE)","v":"24404"},"5308940","TONASKET",0,0,{"$f":"VLOOKUP(B281,'23-24 Adjusted Formula counts'!$A$2:$L$319,8,FALSE)","v":1132},{"$f":"ROUND((F281/$F$5*Assumptions!$D$14*Assumptions!$D$30),0)","v":6075},{"$f":"VLOOKUP(B281,'23-24 Adjusted Formula counts'!$A$2:$L$319,9,FALSE)","v":279},{"$f":"ROUND((H281/$H$5*Assumptions!$D$14*Assumptions!$D$31),0)","v":54360},null,60435,null,null,60435,0,60435,null,{"$f":"-1*(P281*Q281)","v":0},60435,null,{"$f":"IFERROR(VLOOKUP($A281,#REF!, 21,FALSE),0)","v":0},null,60435,0,113,0,null,"5308940","TONASKET"]
[{"$f":"VLOOKUP(B282,CCDDD!$A$3:$B$319,2,FALSE)","v":"39202"},"5308970","TOPPENISH",0,0,{"$f":"VLOOKUP(B282,'23-24 Adjusted Formula counts'!$A$2:$L$319,8,FALSE)","v":3529},{"$f":"ROUND((F282/$F$5*Assumptions!$D$14*Assumptions!$D$30),0)","v":18937},{"$f":"VLOOKUP(B282,'23-24 Adjusted Formula counts'!$A$2:$L$319,9,FALSE)","v":770},{"$f":"ROUND((H282/$H$5*Assumptions!$D$14*Assumptions!$D$31),0)","v":150025},null,168962,null,null,168962,0,168962,null,0,168962,null,{"$f":"IFERROR(VLOOKUP($A282,#REF!, 21,FALSE),0)","v":0},null,168962,0,55,0,null,"5308970","TOPPENISH"]
[{"$f":"VLOOKUP(B283,CCDDD!$A$3:$B$319,2,FALSE)","v":"36300"},"5309000","TOUCHET",0,0,{"$f":"VLOOKUP(B283,'23-24 Adjusted Formula counts'!$A$2:$L$319,8,FALSE)","v":226},{"$f":"ROUND((F283/$F$5*Assumptions!$D$14*Assumptions!$D$30),0)","v":1213},{"$f":"VLOOKUP(B283,'23-24 Adjusted Formula counts'!$A$2:$L$319,9,FALSE)","v":20},{"$f":"ROUND((H283/$H$5*Assumptions!$D$14*Assumptions!$D$31),0)","v":3897},null,5110,null,null,5110,0,5110,null,0,5110,null,{"$f":"IFERROR(VLOOKUP($A283,#REF!, 21,FALSE),0)","v":0},null,5110,0,264,0,null,"5309000","TOUCHET"]
[{"$f":"VLOOKUP(B284,CCDDD!$A$3:$B$319,2,FALSE)","v":"08130"},"5309030","TOUTLE LAKE",0,0,{"$f":"VLOOKUP(B284,'23-24 Adjusted Formula counts'!$A$2:$L$319,8,FALSE)","v":772},{"$f":"ROUND((F284/$F$5*Assumptions!$D$14*Assumptions!$D$30),0)","v":4143},{"$f":"VLOOKUP(B284,'23-24 Adjusted Formula counts'!$A$2:$L$319,9,FALSE)","v":86},{"$f":"ROUND((H284/$H$5*Assumptions!$D$14*Assumptions!$D$31),0)","v":16756},null,20899,null,null,20899,0,20899,null,0,20899,null,{"$f":"IFERROR(VLOOKUP($A284,#REF!, 21,FALSE),0)","v":0},null,20899,0,184,0,null,"5309030","TOUTLE LAKE"]
[{"$f":"VLOOKUP(B285,CCDDD!$A$3:$B$319,2,FALSE)","v":"20400"},"5309060","TROUT LAKE",0,0,{"$f":"VLOOKUP(B285,'23-24 Adjusted Formula counts'!$A$2:$L$319,8,FALSE)","v":202},{"$f":"ROUND((F285/$F$5*Assumptions!$D$14*Assumptions!$D$30),0)","v":1084},{"$f":"VLOOKUP(B285,'23-24 Adjusted Formula counts'!$A$2:$L$319,9,FALSE)","v":47},{"$f":"ROUND((H285/$H$5*Assumptions!$D$14*Assumptions!$D$31),0)","v":9157},null,10241,null,null,10241,0,10241,null,0,10241,null,{"$f":"IFERROR(VLOOKUP($A285,#REF!, 21,FALSE),0)","v":0},null,10241,0,232,0,null,"5309060","TROUT LAKE"]
[{"$f":"VLOOKUP(B286,CCDDD!$A$3:$B$319,2,FALSE)","v":"17406"},"5308130","TUKWILA",0,0,{"$f":"VLOOKUP(B286,'23-24 Adjusted Formula counts'!$A$2:$L$319,8,FALSE)","v":2202.7010369999998},{"$f":"ROUND((F286/$F$5*Assumptions!$D$14*Assumptions!$D$30),0)","v":11820},{"$f":"VLOOKUP(B286,'23-24 Adjusted Formula counts'!$A$2:$L$319,9,FALSE)","v":528.22944240000004},{"$f":"ROUND((H286/$H$5*Assumptions!$D$14*Assumptions!$D$31),0)","v":102919},null,114739,null,null,114739,0,114739,null,0,114739,null,{"$f":"IFERROR(VLOOKUP($A286,#REF!, 21,FALSE),0)","v":0},null,114739,0,72,0,null,"5308130","TUKWILA"]
[{"$f":"VLOOKUP(B287,CCDDD!$A$3:$B$319,2,FALSE)","v":"34033"},"5309100","TUMWATER",0,0,{"$f":"VLOOKUP(B287,'23-24 Adjusted Formula counts'!$A$2:$L$319,8,FALSE)","v":6997},{"$f":"ROUND((F287/$F$5*Assumptions!$D$14*Assumptions!$D$30),0)","v":37548},{"$f":"VLOOKUP(B287,'23-24 Adjusted Formula counts'!$A$2:$L$319,9,FALSE)","v":716},{"$f":"ROUND((H287/$H$5*Assumptions!$D$14*Assumptions!$D$31),0)","v":139503},null,177051,null,null,177051,0,177051,null,0,177051,null,{"$f":"IFERROR(VLOOKUP($A287,#REF!, 21,FALSE),0)","v":0},null,177051,0,52,0,null,"5309100","TUMWATER"]
[{"$f":"VLOOKUP(B288,CCDDD!$A$3:$B$319,2,FALSE)","v":"39002"},"5309150","UNION GAP",0,0,{"$f":"VLOOKUP(B288,'23-24 Adjusted Formula counts'!$A$2:$L$319,8,FALSE)","v":823},{"$f":"ROUND((F288/$F$5*Assumptions!$D$14*Assumptions!$D$30),0)","v":4416},{"$f":"VLOOKUP(B288,'23-24 Adjusted Formula counts'!$A$2:$L$319,9,FALSE)","v":158},{"$f":"ROUND((H288/$H$5*Assumptions!$D$14*Assumptions!$D$31),0)","v":30784},null,35200,null,null,35200,0,35200,null,0,35200,null,{"$f":"IFERROR(VLOOKUP($A288,#REF!, 21,FALSE),0)","v":0},null,35200,0,155,0,null,"5309150","UNION GAP"]
[{"$f":"VLOOKUP(B289,CCDDD!$A$3:$B$319,2,FALSE)","v":"27083"},"5309180","UNIVERSITY PLACE",0,0,{"$f":"VLOOKUP(B289,'23-24 Adjusted Formula counts'!$A$2:$L$319,8,FALSE)","v":5781},{"$f":"ROUND((F289/$F$5*Assumptions!$D$14*Assumptions!$D$30),0)","v":31022},{"$f":"VLOOKUP(B289,'23-24 Adjusted Formula counts'!$A$2:$L$319,9,FALSE)","v":458},{"$f":"ROUND((H289/$H$5*Assumptions!$D$14*Assumptions!$D$31),0)","v":89235},null,120257,null,null,120257,0,120257,null,0,120257,null,{"$f":"IFERROR(VLOOKUP($A289,#REF!, 21,FALSE),0)","v":0},null,120257,0,69,0,null,"5309180","UNIVERSITY PLACE"]
[{"$f":"VLOOKUP(B290,CCDDD!$A$3:$B$319,2,FALSE)","v":"33070"},"5309240","VALLEY",0,0,{"$f":"VLOOKUP(B290,'23-24 Adjusted Formula counts'!$A$2:$L$319,8,FALSE)","v":291},{"$f":"ROUND((F290/$F$5*Assumptions!$D$14*Assumptions!$D$30),0)","v":1562},{"$f":"VLOOKUP(B290,'23-24 Adjusted Formula counts'!$A$2:$L$319,9,FALSE)","v":71},{"$f":"ROUND((H290/$H$5*Assumptions!$D$14*Assumptions!$D$31),0)","v":13833},null,15395,null,null,15395,0,15395,null,0,15395,null,{"$f":"IFERROR(VLOOKUP($A290,#REF!, 21,FALSE),0)","v":0},null,15395,0,204,0,null,"5309240","VALLEY"]
[{"$f":"VLOOKUP(B291,CCDDD!$A$3:$B$319,2,FALSE)","v":"06037"},"5309270","VANCOUVER",0,0,{"$f":"VLOOKUP(B291,'23-24 Adjusted Formula counts'!$A$2:$L$319,8,FALSE)","v":25106.414489999999},{"$f":"ROUND((F291/$F$5*Assumptions!$D$14*Assumptions!$D$30),0)","v":134727},{"$f":"VLOOKUP(B291,'23-24 Adjusted Formula counts'!$A$2:$L$319,9,FALSE)","v":3137.170396},{"$f":"ROUND((H291/$H$5*Assumptions!$D$14*Assumptions!$D$31),0)","v":611237},null,745964,null,null,745964,0,745964,null,0,745964,null,{"$f":"IFERROR(VLOOKUP($A291,#REF!, 21,FALSE),0)","v":0},null,745964,0,8,0,null,"5309270","VANCOUVER"]
[{"$f":"VLOOKUP(B292,CCDDD!$A$3:$B$319,2,FALSE)","v":"17402"},"5309300","VASHON ISLAND",0,0,{"$f":"VLOOKUP(B292,'23-24 Adjusted Formula counts'!$A$2:$L$319,8,FALSE)","v":1443},{"$f":"ROUND((F292/$F$5*Assumptions!$D$14*Assumptions!$D$30),0)","v":7743},{"$f":"VLOOKUP(B292,'23-24 Adjusted Formula counts'!$A$2:$L$319,9,FALSE)","v":151},{"$f":"ROUND((H292/$H$5*Assumptions!$D$14*Assumptions!$D$31),0)","v":29420},null,37163,null,null,37163,0,37163,null,0,37163,null,{"$f":"IFERROR(VLOOKUP($A292,#REF!, 21,FALSE),0)","v":0},null,37163,0,152,0,null,"5309300","VASHON ISLAND"]
[{"$f":"VLOOKUP(B293,CCDDD!$A$3:$B$319,2,FALSE)","v":"35200"},"5309330","WAHKIAKUM",0,0,{"$f":"VLOOKUP(B293,'23-24 Adjusted Formula counts'!$A$2:$L$319,8,FALSE)","v":491},{"$f":"ROUND((F293/$F$5*Assumptions!$D$14*Assumptions!$D$30),0)","v":2635},{"$f":"VLOOKUP(B293,'23-24 Adjusted Formula counts'!$A$2:$L$319,9,FALSE)","v":90},{"$f":"ROUND((H293/$H$5*Assumptions!$D$14*Assumptions!$D$31),0)","v":17535},null,20170,null,null,20170,0,20170,null,0,20170,null,{"$f":"IFERROR(VLOOKUP($A293,#REF!, 21,FALSE),0)","v":0},null,20170,0,186,0,null,"5309330","WAHKIAKUM"]
[{"$f":"VLOOKUP(B294,CCDDD!$A$3:$B$319,2,FALSE)","v":"13073"},"5309360","WAHLUKE",0,0,{"$f":"VLOOKUP(B294,'23-24 Adjusted Formula counts'!$A$2:$L$319,8,FALSE)","v":2046},{"$f":"ROUND((F294/$F$5*Assumptions!$D$14*Assumptions!$D$30),0)","v":10979},{"$f":"VLOOKUP(B294,'23-24 Adjusted Formula counts'!$A$2:$L$319,9,FALSE)","v":250},{"$f":"ROUND((H294/$H$5*Assumptions!$D$14*Assumptions!$D$31),0)","v":48709},null,59688,null,null,59688,0,59688,null,0,59688,null,{"$f":"IFERROR(VLOOKUP($A294,#REF!, 21,FALSE),0)","v":0},null,59688,0,114,0,null,"5309360","WAHLUKE"]
[{"$f":"VLOOKUP(B295,CCDDD!$A$3:$B$319,2,FALSE)","v":"36401"},"5309390","WAITSBURG",0,0,{"$f":"VLOOKUP(B295,'23-24 Adjusted Formula counts'!$A$2:$L$319,8,FALSE)","v":283},{"$f":"ROUND((F295/$F$5*Assumptions!$D$14*Assumptions!$D$30),0)","v":1519},{"$f":"VLOOKUP(B295,'23-24 Adjusted Formula counts'!$A$2:$L$319,9,FALSE)","v":38},{"$f":"ROUND((H295/$H$5*Assumptions!$D$14*Assumptions!$D$31),0)","v":7404},null,8923,null,null,8923,0,8923,null,0,8923,null,{"$f":"IFERROR(VLOOKUP($A295,#REF!, 21,FALSE),0)","v":0},null,8923,0,240,0,null,"5309390","WAITSBURG"]
[{"$f":"VLOOKUP(B296,CCDDD!$A$3:$B$319,2,FALSE)","v":"36140"},"5309450","WALLA WALLA",0,0,{"$f":"VLOOKUP(B296,'23-24 Adjusted Formula counts'!$A$2:$L$319,8,FALSE)","v":6121},{"$f":"ROUND((F296/$F$5*Assumptions!$D$14*Assumptions!$D$30),0)","v":32847},{"$f":"VLOOKUP(B296,'23-24 Adjusted Formula counts'!$A$2:$L$319,9,FALSE)","v":825},{"$f":"ROUND((H296/$H$5*Assumptions!$D$14*Assumptions!$D$31),0)","v":160741},null,193588,null,null,193588,0,193588,null,0,193588,null,{"$f":"IFERROR(VLOOKUP($A296,#REF!, 21,FALSE),0)","v":0},null,193588,0,44,0,null,"5309450","WALLA WALLA"]
[{"$f":"VLOOKUP(B297,CCDDD!$A$3:$B$319,2,FALSE)","v":"39207"},"5309480","WAPATO",0,0,{"$f":"VLOOKUP(B297,'23-24 Adjusted Formula counts'!$A$2:$L$319,8,FALSE)","v":3549},{"$f":"ROUND((F297/$F$5*Assumptions!$D$14*Assumptions!$D$30),0)","v":19045},{"$f":"VLOOKUP(B297,'23-24 Adjusted Formula counts'!$A$2:$L$319,9,FALSE)","v":844},{"$f":"ROUND((H297/$H$5*Assumptions!$D$14*Assumptions!$D$31),0)","v":164442},null,183487,null,null,183487,0,183487,null,0,183487,null,{"$f":"IFERROR(VLOOKUP($A297,#REF!, 21,FALSE),0)","v":0},null,183487,0,48,0,null,"5309480","WAPATO"]
[{"$f":"VLOOKUP(B298,CCDDD!$A$3:$B$319,2,FALSE)","v":"13146"},"5309510","WARDEN",0,0,{"$f":"VLOOKUP(B298,'23-24 Adjusted Formula counts'!$A$2:$L$319,8,FALSE)","v":880},{"$f":"ROUND((F298/$F$5*Assumptions!$D$14*Assumptions!$D$30),0)","v":4722},{"$f":"VLOOKUP(B298,'23-24 Adjusted Formula counts'!$A$2:$L$319,9,FALSE)","v":121},{"$f":"ROUND((H298/$H$5*Assumptions!$D$14*Assumptions!$D$31),0)","v":23575},null,28297,null,null,28297,0,28297,null,0,28297,null,{"$f":"IFERROR(VLOOKUP($A298,#REF!, 21,FALSE),0)","v":0},null,28297,0,167,0,null,"5309510","WARDEN"]
[{"$f":"VLOOKUP(B299,CCDDD!$A$3:$B$319,2,FALSE)","v":"06112"},"5309540","WASHOUGAL",0,0,{"$f":"VLOOKUP(B299,'23-24 Adjusted Formula counts'!$A$2:$L$319,8,FALSE)","v":3813},{"$f":"ROUND((F299/$F$5*Assumptions!$D$14*Assumptions!$D$30),0)","v":20461},{"$f":"VLOOKUP(B299,'23-24 Adjusted Formula counts'!$A$2:$L$319,9,FALSE)","v":305},{"$f":"ROUND((H299/$H$5*Assumptions!$D$14*Assumptions!$D$31),0)","v":59425},null,{"$f":"ROUNDDOWN(+I299+G299+E299+D299+J299,0)","v":79886},null,null,79886,0,79886,null,0,79886,null,{"$f":"IFERROR(VLOOKUP($A299,#REF!, 21,FALSE),0)","v":0},null,79886,0,98,0,null,"5309540","WASHOUGAL"]
[{"$f":"VLOOKUP(B300,CCDDD!$A$3:$B$319,2,FALSE)","v":"01109"},"5309570","WASHTUCNA",0,0,{"$f":"VLOOKUP(B300,'23-24 Adjusted Formula counts'!$A$2:$L$319,8,FALSE)","v":67},{"$f":"ROUND((F300/$F$5*Assumptions!$D$14*Assumptions!$D$30),0)","v":360},{"$f":"VLOOKUP(B300,'23-24 Adjusted Formula counts'!$A$2:$L$319,9,FALSE)","v":9},{"$f":"ROUND((H300/$H$5*Assumptions!$D$14*Assumptions!$D$31),0)","v":1754},null,2114,null,null,2114,0,2114,null,0,2114,null,{"$f":"IFERROR(VLOOKUP($A300,#REF!, 21,FALSE),0)","v":0},null,2114,0,299,0,null,"5309570","WASHTUCNA"]
[{"$f":"VLOOKUP(B301,CCDDD!$A$3:$B$319,2,FALSE)","v":"09209"},"5309600","WATERVILLE",0,0,{"$f":"VLOOKUP(B301,'23-24 Adjusted Formula counts'!$A$2:$L$319,8,FALSE)","v":340},{"$f":"ROUND((F301/$F$5*Assumptions!$D$14*Assumptions!$D$30),0)","v":1825},{"$f":"VLOOKUP(B301,'23-24 Adjusted Formula counts'!$A$2:$L$319,9,FALSE)","v":52},{"$f":"ROUND((H301/$H$5*Assumptions!$D$14*Assumptions!$D$31),0)","v":10132},null,11957,null,null,11957,0,11957,null,0,11957,null,{"$f":"IFERROR(VLOOKUP($A301,#REF!, 21,FALSE),0)","v":0},null,11957,0,223,0,null,"5309600","WATERVILLE"]
[{"$f":"VLOOKUP(B302,CCDDD!$A$3:$B$319,2,FALSE)","v":"33049"},"5309630","WELLPINIT",0,0,{"$f":"VLOOKUP(B302,'23-24 Adjusted Formula counts'!$A$2:$L$319,8,FALSE)","v":318},{"$f":"ROUND((F302/$F$5*Assumptions!$D$14*Assumptions!$D$30),0)","v":1706},{"$f":"VLOOKUP(B302,'23-24 Adjusted Formula counts'!$A$2:$L$319,9,FALSE)","v":69},{"$f":"ROUND((H302/$H$5*Assumptions!$D$14*Assumptions!$D$31),0)","v":13444},null,15150,null,null,15150,0,15150,null,0,15150,null,{"$f":"IFERROR(VLOOKUP($A302,#REF!, 21,FALSE),0)","v":0},null,15150,0,207,0,null,"5309630","WELLPINIT"]
[{"$f":"VLOOKUP(B303,CCDDD!$A$3:$B$319,2,FALSE)","v":"04246"},"5309660","WENATCHEE",0,0,{"$f":"VLOOKUP(B303,'23-24 Adjusted Formula counts'!$A$2:$L$319,8,FALSE)","v":8123.4823219999998},{"$f":"ROUND((F303/$F$5*Assumptions!$D$14*Assumptions!$D$30),0)","v":43593},{"$f":"VLOOKUP(B303,'23-24 Adjusted Formula counts'!$A$2:$L$319,9,FALSE)","v":1064.2416089999999},{"$f":"ROUND((H303/$H$5*Assumptions!$D$14*Assumptions!$D$31),0)","v":207354},null,250947,null,null,250947,0,250947,null,0,250947,null,{"$f":"IFERROR(VLOOKUP($A303,#REF!, 21,FALSE),0)","v":0},null,250947,0,37,0,null,"5309660","WENATCHEE"]
[{"$f":"VLOOKUP(B304,CCDDD!$A$3:$B$319,2,FALSE)","v":"32363"},"5309690","WEST VALLEY (SPK)",0,0,{"$f":"VLOOKUP(B304,'23-24 Adjusted Formula counts'!$A$2:$L$319,8,FALSE)","v":3257},{"$f":"ROUND((F304/$F$5*Assumptions!$D$14*Assumptions!$D$30),0)","v":17478},{"$f":"VLOOKUP(B304,'23-24 Adjusted Formula counts'!$A$2:$L$319,9,FALSE)","v":331},{"$f":"ROUND((H304/$H$5*Assumptions!$D$14*Assumptions!$D$31),0)","v":64491},null,81969,null,null,81969,0,81969,null,0,81969,null,{"$f":"IFERROR(VLOOKUP($A304,#REF!, 21,FALSE),0)","v":0},null,81969,0,93,0,null,"5309690","WEST VALLEY (SPK)"]
[{"$f":"VLOOKUP(B305,CCDDD!$A$3:$B$319,2,FALSE)","v":"39208"},"5309720","WEST VALLEY (YAK)",0,0,{"$f":"VLOOKUP(B305,'23-24 Adjusted Formula counts'!$A$2:$L$319,8,FALSE)","v":6395},{"$f":"ROUND((F305/$F$5*Assumptions!$D$14*Assumptions!$D$30),0)","v":34317},{"$f":"VLOOKUP(B305,'23-24 Adjusted Formula counts'!$A$2:$L$319,9,FALSE)","v":732},{"$f":"ROUND((H305/$H$5*Assumptions!$D$14*Assumptions!$D$31),0)","v":142621},null,176938,null,null,176938,0,176938,null,0,176938,null,{"$f":"IFERROR(VLOOKUP($A305,#REF!, 21,FALSE),0)","v":0},null,176938,0,53,0,null,"5309720","WEST VALLEY (YAK)"]
[{"$f":"VLOOKUP(B306,CCDDD!$A$3:$B$319,2,FALSE)","v":"37902"},"5309740","WHATCOM INTERGENERATIONAL CHARTER",0,0,{"$f":"VLOOKUP(B306,'23-24 Adjusted Formula counts'!$A$2:$L$319,8,FALSE)","v":75.402548530000004},{"$f":"ROUND((F306/$F$5*Assumptions!$D$14*Assumptions!$D$30),0)","v":405},{"$f":"VLOOKUP(B306,'23-24 Adjusted Formula counts'!$A$2:$L$319,9,FALSE)","v":15.01923077},{"$f":"ROUND((H306/$H$5*Assumptions!$D$14*Assumptions!$D$31),0)","v":2926},null,3331,null,null,3331,0,3331,null,0,3331,null,{"$f":"IFERROR(VLOOKUP($A306,#REF!, 21,FALSE),0)","v":0},null,3331,0,281,0,null,"5309740","WHATCOM INTERGENERATIONAL CHARTER"]
[{"$f":"VLOOKUP(B307,CCDDD!$A$3:$B$319,2,FALSE)","v":"21303"},"5309750","WHITE PASS",0,0,{"$f":"VLOOKUP(B307,'23-24 Adjusted Formula counts'!$A$2:$L$319,8,FALSE)","v":468},{"$f":"ROUND((F307/$F$5*Assumptions!$D$14*Assumptions!$D$30),0)","v":2511},{"$f":"VLOOKUP(B307,'23-24 Adjusted Formula counts'!$A$2:$L$319,9,FALSE)","v":109},{"$f":"ROUND((H307/$H$5*Assumptions!$D$14*Assumptions!$D$31),0)","v":21237},null,23748,null,null,23748,0,23748,null,0,23748,null,{"$f":"IFERROR(VLOOKUP($A307,#REF!, 21,FALSE),0)","v":0},null,23748,0,178,0,null,"5309750","WHITE PASS"]
[{"$f":"VLOOKUP(B308,CCDDD!$A$3:$B$319,2,FALSE)","v":"27416"},"5309780","WHITE RIVER",0,0,{"$f":"VLOOKUP(B308,'23-24 Adjusted Formula counts'!$A$2:$L$319,8,FALSE)","v":4774},{"$f":"ROUND((F308/$F$5*Assumptions!$D$14*Assumptions!$D$30),0)","v":25618},{"$f":"VLOOKUP(B308,'23-24 Adjusted Formula counts'!$A$2:$L$319,9,FALSE)","v":285},{"$f":"ROUND((H308/$H$5*Assumptions!$D$14*Assumptions!$D$31),0)","v":55529},null,81147,null,null,81147,0,81147,null,0,81147,null,{"$f":"IFERROR(VLOOKUP($A308,#REF!, 21,FALSE),0)","v":0},null,81147,0,95,0,null,"5309780","WHITE RIVER"]
[{"$f":"VLOOKUP(B309,CCDDD!$A$3:$B$319,2,FALSE)","v":"20405"},"5309810","WHITE SALMON",0,0,{"$f":"VLOOKUP(B309,'23-24 Adjusted Formula counts'!$A$2:$L$319,8,FALSE)","v":1234},{"$f":"ROUND((F309/$F$5*Assumptions!$D$14*Assumptions!$D$30),0)","v":6622},{"$f":"VLOOKUP(B309,'23-24 Adjusted Formula counts'!$A$2:$L$319,9,FALSE)","v":164},{"$f":"ROUND((H309/$H$5*Assumptions!$D$14*Assumptions!$D$31),0)","v":31953},null,38575,null,null,38575,0,38575,null,0,38575,null,{"$f":"IFERROR(VLOOKUP($A309,#REF!, 21,FALSE),0)","v":0},null,38575,0,145,0,null,"5309810","WHITE SALMON"]
[{"$f":"VLOOKUP(B310,CCDDD!$A$3:$B$319,2,FALSE)","v":"17917"},"5300955","WHY NOT YOU ACADEMY CHARTER",0,0,{"$f":"VLOOKUP(B310,'23-24 Adjusted Formula counts'!$A$2:$L$319,8,FALSE)","v":164.0556071},{"$f":"ROUND((F310/$F$5*Assumptions!$D$14*Assumptions!$D$30),0)","v":880},{"$f":"VLOOKUP(B310,'23-24 Adjusted Formula counts'!$A$2:$L$319,9,FALSE)","v":23.851899970000002},{"$f":"ROUND((H310/$H$5*Assumptions!$D$14*Assumptions!$D$31),0)","v":4647},null,5527,null,null,5527,0,5527,null,0,5527,null,{"$f":"IFERROR(VLOOKUP($A310,#REF!, 21,FALSE),0)","v":0},null,5527,0,260,0,null,"5300955","WHY NOT YOU ACADEMY CHARTER"]
[{"$f":"VLOOKUP(B311,CCDDD!$A$3:$B$319,2,FALSE)","v":"22200"},"5309840","WILBUR",0,0,{"$f":"VLOOKUP(B311,'23-24 Adjusted Formula counts'!$A$2:$L$319,8,FALSE)","v":218},{"$f":"ROUND((F311/$F$5*Assumptions!$D$14*Assumptions!$D$30),0)","v":1170},{"$f":"VLOOKUP(B311,'23-24 Adjusted Formula counts'!$A$2:$L$319,9,FALSE)","v":30},{"$f":"ROUND((H311/$H$5*Assumptions!$D$14*Assumptions!$D$31),0)","v":5845},null,7015,null,null,7015,0,7015,null,0,7015,null,{"$f":"IFERROR(VLOOKUP($A311,#REF!, 21,FALSE),0)","v":0},null,7015,0,247,0,null,"5309840","WILBUR"]
[{"$f":"VLOOKUP(B312,CCDDD!$A$3:$B$319,2,FALSE)","v":"25160"},"5309870","WILLAPA VALLEY",0,0,{"$f":"VLOOKUP(B312,'23-24 Adjusted Formula counts'!$A$2:$L$319,8,FALSE)","v":332},{"$f":"ROUND((F312/$F$5*Assumptions!$D$14*Assumptions!$D$30),0)","v":1782},{"$f":"VLOOKUP(B312,'23-24 Adjusted Formula counts'!$A$2:$L$319,9,FALSE)","v":48},{"$f":"ROUND((H312/$H$5*Assumptions!$D$14*Assumptions!$D$31),0)","v":9352},null,11134,null,null,11134,0,11134,null,0,11134,null,{"$f":"IFERROR(VLOOKUP($A312,#REF!, 21,FALSE),0)","v":0},null,11134,0,226,0,null,"5309870","WILLAPA VALLEY"]
[{"$f":"VLOOKUP(B313,CCDDD!$A$3:$B$319,2,FALSE)","v":"13167"},"5309900","WILSON CREEK",0,0,{"$f":"VLOOKUP(B313,'23-24 Adjusted Formula counts'!$A$2:$L$319,8,FALSE)","v":113},{"$f":"ROUND((F313/$F$5*Assumptions!$D$14*Assumptions!$D$30),0)","v":606},{"$f":"VLOOKUP(B313,'23-24 Adjusted Formula counts'!$A$2:$L$319,9,FALSE)","v":12},{"$f":"ROUND((H313/$H$5*Assumptions!$D$14*Assumptions!$D$31),0)","v":2338},null,2944,null,null,2944,0,2944,null,0,2944,null,{"$f":"IFERROR(VLOOKUP($A313,#REF!, 21,FALSE),0)","v":0},null,2944,0,288,0,null,"5309900","WILSON CREEK"]
[{"$f":"VLOOKUP(B314,CCDDD!$A$3:$B$319,2,FALSE)","v":"21232"},"5309930","WINLOCK",0,0,{"$f":"VLOOKUP(B314,'23-24 Adjusted Formula counts'!$A$2:$L$319,8,FALSE)","v":809},{"$f":"ROUND((F314/$F$5*Assumptions!$D$14*Assumptions!$D$30),0)","v":4341},{"$f":"VLOOKUP(B314,'23-24 Adjusted Formula counts'!$A$2:$L$319,9,FALSE)","v":119},{"$f":"ROUND((H314/$H$5*Assumptions!$D$14*Assumptions!$D$31),0)","v":23186},null,27527,null,null,27527,0,27527,null,0,27527,null,{"$f":"IFERROR(VLOOKUP($A314,#REF!, 21,FALSE),0)","v":0},null,27527,0,172,0,null,"5309930","WINLOCK"]
[{"$f":"VLOOKUP(B315,CCDDD!$A$3:$B$319,2,FALSE)","v":"14117"},"5309990","WISHKAH VALLEY",0,0,{"$f":"VLOOKUP(B315,'23-24 Adjusted Formula counts'!$A$2:$L$319,8,FALSE)","v":148},{"$f":"ROUND((F315/$F$5*Assumptions!$D$14*Assumptions!$D$30),0)","v":794},{"$f":"VLOOKUP(B315,'23-24 Adjusted Formula counts'!$A$2:$L$319,9,FALSE)","v":21},{"$f":"ROUND((H315/$H$5*Assumptions!$D$14*Assumptions!$D$31),0)","v":4092},null,4886,null,null,4886,0,4886,null,0,4886,null,{"$f":"IFERROR(VLOOKUP($A315,#REF!, 21,FALSE),0)","v":0},null,4886,0,267,0,null,"5309990","WISHKAH VALLEY"]
[{"$f":"VLOOKUP(B316,CCDDD!$A$3:$B$319,2,FALSE)","v":"20094"},"5310020","WISHRAM",0,0,{"$f":"VLOOKUP(B316,'23-24 Adjusted Formula counts'!$A$2:$L$319,8,FALSE)","v":44},{"$f":"ROUND((F316/$F$5*Assumptions!$D$14*Assumptions!$D$30),0)","v":236},{"$f":"VLOOKUP(B316,'23-24 Adjusted Formula counts'!$A$2:$L$319,9,FALSE)","v":15},{"$f":"ROUND((H316/$H$5*Assumptions!$D$14*Assumptions!$D$31),0)","v":2923},null,3159,null,null,3159,0,3159,null,0,3159,null,{"$f":"IFERROR(VLOOKUP($A316,#REF!, 21,FALSE),0)","v":0},null,3159,0,283,0,null,"5310020","WISHRAM"]
[{"$f":"VLOOKUP(B317,CCDDD!$A$3:$B$319,2,FALSE)","v":"08404"},"5310050","WOODLAND",0,0,{"$f":"VLOOKUP(B317,'23-24 Adjusted Formula counts'!$A$2:$L$319,8,FALSE)","v":2666},{"$f":"ROUND((F317/$F$5*Assumptions!$D$14*Assumptions!$D$30),0)","v":14306},{"$f":"VLOOKUP(B317,'23-24 Adjusted Formula counts'!$A$2:$L$319,9,FALSE)","v":259},{"$f":"ROUND((H317/$H$5*Assumptions!$D$14*Assumptions!$D$31),0)","v":50463},null,64769,null,null,{"$f":"K317","v":64769},{"$f":"-ROUND(N317/$N$5*$M$5,0)","v":0},{"$f":"+K317+O317+M317","v":64769},null,0,64769,null,{"$f":"IFERROR(VLOOKUP($A317,#REF!, 21,FALSE),0)","v":0},null,64769,0,107,0,null,"5310050","WOODLAND"]
[{"$f":"VLOOKUP(B318,CCDDD!$A$3:$B$319,2,FALSE)","v":"39007"},"5310110","YAKIMA",0,0,{"$f":"VLOOKUP(B318,'23-24 Adjusted Formula counts'!$A$2:$L$319,8,FALSE)","v":16801},{"$f":"ROUND((F318/$F$5*Assumptions!$D$14*Assumptions!$D$30),0)","v":90158},{"$f":"VLOOKUP(B318,'23-24 Adjusted Formula counts'!$A$2:$L$319,9,FALSE)","v":3522},{"$f":"ROUND((H318/$H$5*Assumptions!$D$14*Assumptions!$D$31),0)","v":686216},null,776374,null,null,776374,0,776374,null,0,776374,null,{"$f":"IFERROR(VLOOKUP($A318,#REF!, 21,FALSE),0)","v":0},null,776374,0,6,0,null,"5310110","YAKIMA"]
[{"$f":"VLOOKUP(B319,CCDDD!$A$3:$B$319,2,FALSE)","v":"34002"},"5310140","YELM",0,0,{"$f":"VLOOKUP(B319,'23-24 Adjusted Formula counts'!$A$2:$L$319,8,FALSE)","v":6649},{"$f":"ROUND((F319/$F$5*Assumptions!$D$14*Assumptions!$D$30),0)","v":35680},{"$f":"VLOOKUP(B319,'23-24 Adjusted Formula counts'!$A$2:$L$319,9,FALSE)","v":716},{"$f":"ROUND((H319/$H$5*Assumptions!$D$14*Assumptions!$D$31),0)","v":139503},null,175183,null,null,175183,0,175183,null,0,175183,null,{"$f":"IFERROR(VLOOKUP($A319,#REF!, 21,FALSE),0)","v":0},null,175183,0,54,0,null,"5310140","YELM"]
[{"$f":"VLOOKUP(B320,CCDDD!$A$3:$B$319,2,FALSE)","v":"39205"},"5310170","ZILLAH",0,0,{"$f":"VLOOKUP(B320,'23-24 Adjusted Formula counts'!$A$2:$L$319,8,FALSE)","v":1223},{"$f":"ROUND((F320/$F$5*Assumptions!$D$14*Assumptions!$D$30),0)","v":6563},{"$f":"VLOOKUP(B320,'23-24 Adjusted Formula counts'!$A$2:$L$319,9,FALSE)","v":159},{"$f":"ROUND((H320/$H$5*Assumptions!$D$14*Assumptions!$D$31),0)","v":30979},null,37542,null,null,37542,0,37542,null,0,37542,null,{"$f":"IFERROR(VLOOKUP($A320,#REF!, 21,FALSE),0)","v":0},null,37542,0,149,0,null,"5310170","ZILLAH"]
[{"$f":"VLOOKUP(B321,CCDDD!$A$3:$B$319,2,FALSE)","v":"17919"},"5307790","IMPACRT RENTON CHARTER",0,0,{"$f":"VLOOKUP(B321,'23-24 Adjusted Formula counts'!$A$2:$L$319,8,FALSE)","v":215.98570580000001},{"$f":"ROUND((F321/$F$5*Assumptions!$D$14*Assumptions!$D$30),0)","v":1159},{"$f":"VLOOKUP(B321,'23-24 Adjusted Formula counts'!$A$2:$L$319,9,FALSE)","v":29.973472040000001},{"$f":"ROUND((H321/$H$5*Assumptions!$D$14*Assumptions!$D$31),0)","v":5840},null,6999,null,null,6999,0,6999,null,0,6999,null,{"$f":"IFERROR(VLOOKUP($A321,#REF!, 21,FALSE),0)","v":0},null,6999,0,248,0]
[{"$f":"VLOOKUP(B322,CCDDD!$A$3:$B$319,2,FALSE)","v":"06901"},"5307795","ROOTED CARTER",null,0,{"$f":"VLOOKUP(B322,'23-24 Adjusted Formula counts'!$A$2:$L$319,8,FALSE)","v":40.273363000000003},{"$f":"ROUND((F322/$F$5*Assumptions!$D$14*Assumptions!$D$30),0)","v":216},{"$f":"VLOOKUP(B322,'23-24 Adjusted Formula counts'!$A$2:$L$319,9,FALSE)","v":7.8177973569999999},{"$f":"ROUND((H322/$H$5*Assumptions!$D$14*Assumptions!$D$31),0)","v":1523},null,1739,null,null,1739,0,1739,null,0,1739,null,{"$f":"IFERROR(VLOOKUP($A322,#REF!, 21,FALSE),0)","v":0},null,1739,0,308,0]

{"sheet":"23-24 Adjusted Formula counts","index":5,"n_rows":319,"n_cols":12,"rows_kept":319,"cut":false,"hidden":true,"merged":[]}
["Source: S:\\Apportionment\\Apport\\Federal Program Alloc\\23-24\\Title I-A Final\\Title IA 23-24 Final (New model).xlsx, initial adjusted formula counts"]
["LEAID","LEANAME","SendingLEAid","NEG. adj","Adj DEL.","Adj Foster","Adj TANF","Adj - 5-17 pop","Adj poverty","Adj Total formula count","Total Formula Count DOE","Adj poverty percentage"]
["5300030","Aberdeen School District",null,0,null,25,0,3541,728,753,753,0.21265179327873501]
["5300060","Adna School District",null,0,null,1,0,736,43,44,44,5.9782608695652197E-2]
["5300090","Almira School District",null,0,null,0,0,95,8,8,8,8.42105263157895E-2]
["5300150","Anacortes School District",null,0,null,7,0,2866,281,288,288,0.100488485694348]
["5300240","Arlington School District",null,0,null,21,0,5998,465,486,486,8.1027009003000999E-2]
["5300280","Asotin-Anatone School District",null,0,null,0,0,508,64,64,64,0.12598425196850399]
["5300300","Auburn School District",null,0,null,51,0,18711,2786,2837,2837,0.15162204051092901]
["5300330","Bainbridge Island School District",null,0,null,1,0,4038,159,160,160,3.9623576027736501E-2]
["5300380","Battle Ground School District",null,0,null,30,0,16174,1098,1128,1128,6.9741560529244503E-2]
["5300390","Bellevue School District",null,0,null,12,0,22916,1597,1609,1609,7.0212951649502503E-2]
["5300420","Bellingham","5300420",0,null,35,0,12668.720939999999,1753.1538459999999,1788.1538459999999,1810,0.141147149269154]
["5300450","Benge School District",null,0,null,0,0,16,1,1,1,6.25E-2]
["5300480","Bethel School District",null,0,null,91,0,24535,2251,2342,2342,9.5455471775015302E-2]
["5300510","Bickleton School District",null,0,null,0,0,79,15,15,15,0.189873417721519]
["5300570","Blaine School District",null,0,null,4,0,2520,385,389,389,0.15436507936507901]
["5300630","Boistfort School District",null,0,null,2,0,215,27,29,29,0.13488372093023299]
["5300660","Bremerton","5300660",0,null,25,0,5044.8083969999998,809.14502760000005,834.14502760000005,917,0.165347216785312]
["5300690","Brewster School District",null,0,null,12,0,975,185,197,197,0.20205128205128201]
["5300720","Bridgeport School District",null,0,null,0,0,700,204,204,204,0.29142857142857098]
["5300750","Brinnon School District",null,0,null,0,0,118,32,32,32,0.27118644067796599]
["5300780","Burlington-Edison School District",null,0,null,10,0,3771,496,506,506,0.134181914611509]
["5300810","Camas School District",null,0,null,8,0,7573,322,330,330,4.3575861613627399E-2]
["5300840","Cape Flattery School District",null,0,null,3,0,569,129,132,132,0.23198594024604599]
["5300870","Carbonado School District",null,0,null,0,0,212,19,19,19,8.9622641509433998E-2]
["5300950","Cascade School District",null,0,null,1,0,1590,175,176,176,0.110691823899371]
["5300960","Cashmere School District",null,0,null,8,0,1530,193,201,201,0.13137254901960799]
["5300990","Castle Rock School District",null,0,null,2,0,1643,195,197,197,0.11990261716372499]
["5301000","Catalyst Public Schools","5300660",0,0,0,0,510.64581190000001,65.298342539999993,65.298342539999993,0,0.12787403914869599]
["5301050","Centerville School District",null,0,null,0,0,95,13,13,13,0.13684210526315799]
["5301080","Central Kitsap School District",null,0,null,33,0,11324,913,946,946,8.3539385376192196E-2]
["5301110","Central Valley School District",null,0,null,78,0,17283,1571,1649,1649,9.5411676213620303E-2]
["5301140","Centralia School District",null,0,null,19,0,4272,812,831,831,0.19452247191011199]
["5301170","Chehalis School District",null,0,null,15,0,2861,345,360,360,0.12583012932541099]
["5301230","Cheney School District",null,0,null,24,0,6337,783,807,807,0.12734732523275999]
["5301260","Chewelah School District",null,0,null,1,0,947,190,191,191,0.20168954593453001]
["5301290","Chimacum School District",null,0,null,5,0,1180,204,209,209,0.17711864406779701]
["5301320","Clarkston School District",null,0,null,12,0,2878,578,590,590,0.205003474635163]
["5301350","Cle Elum-Roslyn School District",null,0,null,7,0,1041,128,135,135,0.12968299711815601]
["5301410","Clover Park School District",null,0,null,36,0,13910,1888,1924,1924,0.13831775700934601]
["5301440","Colfax School District",null,0,null,0,0,604,51,51,51,8.4437086092715205E-2]
["5301470","College Place School District",null,0,null,6,0,2104,244,250,250,0.118821292775665]
["5301500","Colton School District",null,0,null,0,0,243,20,20,20,8.2304526748971193E-2]
["5301560","Columbia (Stevens) School District",null,0,null,0,0,207,43,43,43,0.20772946859903399]
["5301590","Columbia (Walla Walla) School District",null,0,null,4,0,781,90,94,94,0.120358514724712]
["5301630","Colville School District",null,0,null,5,0,2016,355,360,360,0.17857142857142899]
["5301660","Concrete School District",null,0,null,0,0,726,147,147,147,0.202479338842975]
["5301680","Conway School District",null,0,null,1,0,550,47,48,48,8.7272727272727293E-2]
["5301710","Cosmopolis School District",null,0,null,2,0,320,27,29,29,9.0624999999999997E-2]
["5303440","Coulee-Hartline School District",null,0,null,0,0,253,32,32,32,0.126482213438735]
["5301800","Coupeville School District",null,0,null,1,0,1115,122,123,123,0.110313901345291]
["5301830","Crescent School District",null,0,null,9,0,357,45,54,54,0.151260504201681]
["5301860","Creston School District",null,0,null,0,0,110,19,19,19,0.17272727272727301]
["5301890","Curlew School District",null,0,null,0,0,152,45,45,45,0.29605263157894701]
["5301920","Cusick School District",null,0,null,5,0,303,63,68,68,0.224422442244224]
["5301950","Damman School District",null,0,null,0,0,109,2,2,2,1.8348623853211E-2]
["5301980","Darrington School District",null,0,null,4,0,510,79,83,83,0.162745098039216]
["5302010","Davenport School District",null,0,null,1,0,570,67,68,68,0.119298245614035]
["5302040","Dayton School District",null,0,null,4,0,525,97,101,101,0.19238095238095199]
["5302070","Deer Park School District",null,0,null,12,0,2401,346,358,358,0.149104539775094]
["5302130","Dieringer School District",null,0,null,5,0,2313,99,104,104,4.4963251188932102E-2]
["5302160","Dixie School District",null,0,null,0,0,77,10,10,10,0.12987012987013]
["5302280","East Valley School District (Spokane)",null,0,null,54,0,4751,691,745,745,0.156809092822564]
["5305370","East Valley School District (Yakima)",null,0,null,6,0,3617,451,457,457,0.12634780204589399]
["5302310","Eastmont School District",null,0,null,13,0,6551,668,681,681,0.103953594871012]
["5302340","Easton School District",null,0,null,0,0,146,12,12,12,8.2191780821917804E-2]
["5302370","Eatonville School District",null,0,null,7,0,2240,210,217,217,9.6875000000000003E-2]
["5302400","Edmonds School District",null,0,null,23,0,24590,1911,1934,1934,7.8649857665717804E-2]
["5302460","Ellensburg School District",null,0,null,21,0,3474,433,454,454,0.13068508923431199]
["5302490","Elma School District",null,0,null,8,0,1609,284,292,292,0.181479179614668]
["5302520","Endicott School District",null,0,null,0,0,87,18,18,18,0.20689655172413801]
["5302550","Entiat School District",null,0,null,6,0,416,61,67,67,0.16105769230769201]
["5300001","Enumclaw School District",null,0,null,15,0,4771,339,354,354,7.4198281282749995E-2]
["5302610","Ephrata School District",null,0,null,11,0,2954,340,351,351,0.11882193635748101]
["5302640","Evaline School District",null,0,null,0,0,128,18,18,18,0.140625]
["5302670","Everett School District",null,0,null,36,0,23124,1895,1931,1931,8.3506313786542094E-2]
["5302700","Evergreen School District (Clark)",null,0,null,58,0,27238,2969,3027,3027,0.11113150745282301]
["5302730","Evergreen School District (Stevens)",null,0,null,0,0,57,18,18,18,0.31578947368421001]
["5302820","Federal Way School District",null,0,null,58,0,24624,4027,4085,4085,0.16589506172839499]
["5302850","Ferndale School District",null,0,null,21,0,6288,1010,1031,1031,0.16396310432569999]
["5302880","Fife Public Schools",null,0,null,4,0,4139,404,408,408,9.8574534911814393E-2]
["5302910","Finley School District",null,0,null,10,0,907,135,145,145,0.15986769570011]
["5302940","Franklin Pierce School District",null,0,null,43,0,9422,1236,1279,1279,0.135746126087879]
["5302970","Freeman School District",null,0,null,1,0,1009,57,58,58,5.7482656095143699E-2]
["5303000","Garfield School District",null,0,null,0,0,128,23,23,23,0.1796875]
["5303030","Glenwood School District",null,0,null,0,0,62,16,16,16,0.25806451612903197]
["5303090","Goldendale School District",null,0,null,9,0,1077,241,250,250,0.23212627669452199]
["5303130","Grand Coulee Dam School District",null,0,null,5,0,686,88,93,93,0.135568513119534]
["5303150","Grandview School District",null,0,null,10,0,3793,621,631,631,0.16635908252043199]
["5303180","Granger School District",null,0,null,4,0,1614,353,357,357,0.22118959107806699]
["5303210","Granite Falls School District",null,0,null,6,0,2837,209,215,215,7.5784279168135404E-2]
["5303240","Grapeview School District",null,0,null,2,0,341,46,48,48,0.14076246334310899]
["5303270","Great Northern School District",null,0,null,0,0,189,44,44,44,0.23280423280423301]
["5303300","Green Mountain School District",null,0,null,0,0,209,18,18,18,8.6124401913875603E-2]
["5303330","Griffin School District",null,0,null,5,0,913,66,71,71,7.7765607886089799E-2]
["5303360","Harrington School District",null,0,null,0,0,141,18,18,18,0.12765957446808501]
["5303510","Highland School District",null,0,null,2,0,1293,225,227,227,0.17556071152358901]
["5303540","Highline","5303540",0,null,46,0,19915.901239999999,3358.9087370000002,3404.9087370000002,3502,0.17096433124354801]
["5303570","Hockinson School District",null,0,null,5,0,2219,143,148,148,6.6696710229833298E-2]
["5303600","Hood Canal School District",null,0,null,3,0,700,137,140,140,0.2]
["5303660","Hoquiam School District",null,0,null,12,0,1840,403,415,415,0.22554347826087001]
["5303700","Impact Puget Sound (Public Schools)","5308130",0,0,0,0,511.06752590000002,102.70357,102.70357,0,0.200958904230089]
["5307790","Impact Renton","5307230",0,0,0,0,215.98570580000001,29.973472040000001,29.973472040000001,0,0.13877525799103099]
["5303710","Impact Salish Sea","5308130",0,0,0,0,298.97450270000002,56.070597669999998,56.070597669999998,0,0.18754307532676401]
["5303705","Impact Tacoma (Commencement Bay)","5308700",0,0,0,0,401.13095240000001,54.706976150000003,54.706976150000003,0,0.136381836961251]
["5300002","Inchelium School District",null,0,null,1,0,182,44,45,45,0.24725274725274701]
["5303720","Index School District",null,0,null,0,0,55,9,9,9,0.163636363636364]
["5303750","Issaquah School District",null,0,null,9,0,23245,936,945,945,4.0653904065390399E-2]
["5303780","Kahlotus School District",null,0,null,0,0,61,14,14,14,0.22950819672131101]
["5303810","Kalama School District",null,0,null,4,0,1360,122,126,126,9.2647058823529402E-2]
["5303870","Keller School District",null,0,null,1,0,100,30,31,31,0.31]
["5300003","Kelso School District",null,0,null,37,0,5497,855,892,892,0.16227032927051099]
["5303930","Kennewick School District",null,0,null,70,0,20458,2558,2628,2628,0.12845830481963]
["5303960","Kent School District",null,0,null,52,0,30689,4485,4537,4537,0.14783798755254299]
["5303990","Kettle Falls School District",null,0,null,4,0,940,165,169,169,0.17978723404255301]
["5304020","Kiona-Benton City School District",null,0,null,8,0,1733,266,274,274,0.15810732833237201]
["5304050","Kittitas School District",null,0,null,0,0,722,58,58,58,8.0332409972299207E-2]
["5304080","Klickitat School District",null,0,null,4,0,82,12,16,16,0.19512195121951201]
["5304170","La Center School District",null,0,null,16,0,1970,140,156,156,7.91878172588832E-2]
["5304110","La Conner School District",null,0,null,3,0,602,134,137,137,0.227574750830565]
["5304150","LaCrosse School District",null,0,null,0,0,87,9,9,9,0.10344827586206901]
["5301200","Lake Chelan School District",null,0,null,1,0,1264,170,171,171,0.135284810126582]
["5307050","Lake Quinault School District",null,0,null,0,0,176,41,41,41,0.232954545454545]
["5304200","Lake Stevens School District",null,0,null,15,0,10404,521,536,536,5.1518646674356003E-2]
["5304230","Lake Washington School District",null,0,null,23,0,36438,1528,1551,1551,4.25654536472913E-2]
["5304260","Lakewood School District",null,0,null,12,0,2680,297,309,309,0.11529850746268699]
["5304290","Lamont School District",null,0,null,0,0,28,9,9,9,0.32142857142857101]
["5304380","Liberty School District",null,0,null,1,0,839,67,68,68,8.1048867699642396E-2]
["5304410","Lind School District",null,0,null,1,0,310,66,67,67,0.21612903225806401]
["5304470","Longview Public Schools",null,0,null,28,0,7250,1186,1214,1214,0.16744827586206901]
["5304500","Loon Lake School District",null,0,null,9,0,257,44,53,53,0.20622568093385199]
["5304530","Lopez School District",null,0,null,0,0,289,57,57,57,0.19723183391003499]
["5304550","Lumen High School","5308250",0,0,0,0,42.079470200000003,9.1475244189999998,9.1475244189999998,0,0.21738687240611301]
["5304590","Lyle School District",null,0,null,0,0,419,69,69,69,0.164677804295943]
["5304620","Lynden School District",null,0,null,5,0,4435,415,420,420,9.4701240135287496E-2]
["5304650","Mabton School District",null,0,null,0,0,783,164,164,164,0.20945083014048499]
["5304710","Mansfield School District",null,0,null,0,0,88,27,27,27,0.30681818181818199]
["5304740","Manson School District",null,0,null,2,0,623,106,108,108,0.173354735152488]
["5304800","Mary M. Knight School District",null,0,null,0,0,207,33,33,33,0.15942028985507201]
["5304830","Mary Walker School District",null,0,null,8,0,646,150,158,158,0.24458204334365299]
["5304860","Marysville School District",null,0,null,26,0,12720,1226,1252,1252,9.8427672955974793E-2]
["5304890","McCleary School District",null,0,null,2,0,579,65,67,67,0.115716753022452]
["5304920","Mead School District",null,0,null,31,0,12203,985,1016,1016,8.3258215192985305E-2]
["5304950","Medical Lake School District",null,0,null,3,0,1829,173,176,176,9.6227446692181501E-2]
["5304980","Mercer Island School District",null,0,null,0,0,4992,184,184,184,3.6858974358974401E-2]
["5305010","Meridian School District",null,0,null,1,0,1737,237,238,238,0.13701784686240601]
["5305020","Methow Valley School District",null,0,null,0,0,860,101,101,101,0.117441860465116]
["5305040","Mill A School District",null,0,null,0,0,74,12,12,12,0.162162162162162]
["5305130","Monroe School District",null,0,null,10,0,6741,398,408,408,6.05251446372942E-2]
["5305160","Montesano School District",null,0,null,7,0,1351,159,166,166,0.122871946706144]
["5305190","Morton School District",null,0,null,0,0,332,66,66,66,0.19879518072289201]
["5305220","Moses Lake School District",null,0,null,37,0,9920,1242,1279,1279,0.12893145161290301]
["5305250","Mossyrock School District",null,0,null,2,0,698,106,108,108,0.15472779369627501]
["5305280","Mount Adams School District",null,0,null,14,0,1015,247,261,261,0.25714285714285701]
["5305310","Mount Baker School District",null,0,null,8,0,2481,416,424,424,0.17089883111648499]
["5305340","Mount Pleasant School District",null,0,null,0,0,41,6,6,6,0.146341463414634]
["5305400","Mount Vernon School District",null,0,null,7,0,6931,948,955,955,0.137786755157986]
["5305430","Mukilteo School District",null,0,null,19,0,17175,1881,1900,1900,0.11062590975254701]
["5305460","Naches Valley School District",null,0,null,5,0,1640,202,207,207,0.12621951219512201]
["5305490","Napavine School District",null,0,null,1,0,774,78,79,79,0.102067183462532]
["5305520","Naselle-Grays River Valley School District",null,0,null,0,0,343,48,48,48,0.13994169096209899]
["5305550","Nespelem School District",null,0,null,2,0,253,57,59,59,0.233201581027668]
["5305610","Newport School District",null,0,null,4,0,1342,310,314,314,0.23397913561847999]
["5305640","Nine Mile Falls School District",null,0,null,3,0,1580,149,152,152,9.6202531645569606E-2]
["5305670","Nooksack Valley School District",null,0,null,8,0,2252,294,302,302,0.13410301953818801]
["5305700","North Beach School District",null,0,null,9,0,713,161,170,170,0.23842917251051901]
["5305730","North Franklin School District",null,0,null,0,0,2246,312,312,312,0.138913624220837]
["5305760","North Kitsap School District",null,0,null,29,0,7279,601,630,630,8.6550350322846595E-2]
["5305790","North Mason School District",null,0,null,8,0,2465,394,402,402,0.163083164300203]
["5305820","North River School District",null,0,null,0,0,54,8,8,8,0.148148148148148]
["5305850","North Thurston Public Schools",null,0,null,37,0,17329,1789,1826,1826,0.105372496970396]
["5305880","Northport School District",null,0,null,3,0,227,60,63,63,0.27753303964757697]
["5305910","Northshore School District",null,0,null,17,0,26739,1028,1045,1045,3.9081491454429899E-2]
["5305940","Oak Harbor School District",null,0,null,6,0,6127,554,560,560,9.1398726946303202E-2]
["5305970","Oakesdale School District",null,0,null,0,0,127,12,12,12,9.4488188976377993E-2]
["5306000","Oakville School District",null,0,null,6,0,456,72,78,78,0.17105263157894701]
["5306060","Ocean Beach School District",null,0,null,2,0,1066,210,212,212,0.19887429643527199]
["5306090","Ocosta School District",null,0,null,4,0,669,192,196,196,0.29297458893871398]
["5306120","Odessa School District",null,0,null,1,0,304,40,41,41,0.134868421052632]
["5306150","Okanogan School District",null,0,null,5,0,982,167,172,172,0.17515274949083501]
["5306180","Olympia School District",null,0,null,31,0,10589,1159,1190,1190,0.112380772499764]
["5306220","Omak School District",null,0,null,8,0,1933,410,418,418,0.21624418003104001]
["5306240","Onalaska School District",null,0,null,4,0,932,142,146,146,0.15665236051502099]
["5306270","Onion Creek School District",null,0,null,0,0,63,15,15,15,0.238095238095238]
["5306300","Orcas Island School District",null,0,null,0,0,592,85,85,85,0.143581081081081]
["5306330","Orchard Prairie School District",null,0,null,2,0,180,7,9,9,0.05]
["5306360","Orient School District",null,0,null,0,0,127,31,31,31,0.244094488188976]
["5306390","Orondo School District",null,0,null,0,0,270,51,51,51,0.18888888888888899]
["5306420","Oroville School District",null,0,null,7,0,712,208,215,215,0.301966292134831]
["5306450","Orting School District",null,0,null,9,0,3303,198,207,207,6.2670299727520404E-2]
["5306480","Othello School District",null,0,null,15,0,4661,883,898,898,0.192662518772796]
["5306510","Palisades School District",null,0,null,0,0,48,10,10,10,0.20833333333333301]
["5306540","Palouse School District",null,0,null,0,0,240,23,23,23,9.5833333333333395E-2]
["5399999","PART D SUBPART 2",null,0,720,0,0,720,0,720,720,1]
["5306570","Pasco School District",null,0,null,42,0,20732,2762,2804,2804,0.13524985529616099]
["5306600","Pateros School District",null,0,null,6,0,295,36,42,42,0.14237288135593201]
["5306630","Paterson School District",null,0,null,0,0,88,10,10,10,0.11363636363636399]
["5306660","Pe Ell School District",null,0,null,0,0,248,37,37,37,0.149193548387097]
["5306690","Peninsula School District",null,0,null,17,0,11879,621,638,638,5.3708224598030103E-2]
["5306770","Pinnacles Prep Wenatchee","5309660",0,0,0,0,86.276984659999997,10.28775913,10.28775913,0,0.11924106031591]
["5306750","Pioneer School District",null,0,null,7,0,1504,242,249,249,0.16555851063829799]
["5306780","Pomeroy School District",null,0,null,0,0,363,59,59,59,0.16253443526170799]
["5306820","Port Angeles School District",null,0,null,37,0,4440,653,690,690,0.15540540540540501]
["5306840","Port Townsend School District",null,0,null,8,0,1377,261,269,269,0.195352214960058]
["5306870","Prescott School District",null,0,null,3,0,357,46,49,49,0.13725490196078399]
["5306890","PRIDE Prep","5308250",0,0,0,0,598.46357620000003,78.724149550000007,78.724149550000007,0,0.13154376085937999]
["5306900","Prosser School District",null,0,null,11,0,2907,358,369,369,0.126934984520124]
["5306930","Pullman","5306930",0,null,9,0,3099.440415,349.34344420000002,358.34344420000002,370,0.115615529354809]
["5306940","Pullman Community Montessori","5306930",0,0,0,0,109.5647668,7.4178082190000003,7.4178082190000003,0,6.7702496278320604E-2]
["5306960","Puyallup School District",null,0,null,51,0,25979,1842,1893,1893,7.2866546056430198E-2]
["5301380","Queets-Clearwater School District",null,0,null,0,0,33,9,9,9,0.27272727272727298]
["5306990","Quilcene School District",null,0,null,0,0,204,28,28,28,0.13725490196078399]
["5307020","Quillayute Valley School District",null,0,null,11,0,1213,272,283,283,0.233305853256389]
["5307080","Quincy School District",null,0,null,16,0,3190,426,442,442,0.138557993730408]
["5307120","Rainier Prep","5303540",0,0,0,0,373.05795599999999,56.12211757,56.12211757,0,0.15043806645068]
["5307110","Rainier School District",null,0,null,6,0,1044,155,161,161,0.15421455938697301]
["5303280","Rainier Valley Leadership Academy (Green Dot: RV)","5307710",0,0,0,0,200.3237432,50.213772229999996,50.213772229999996,0,0.25066310871685299]
["5307140","Raymond School District",null,0,null,7,0,641,103,110,110,0.171606864274571]
["5307210","Reardan-Edwall School District",null,0,null,2,0,991,115,117,117,0.118062563067608]
["5307230","Renton","5307230",0,null,49,0,17916.014289999999,2371.0265279999999,2420.0265279999999,2450,0.135076166395935]
["5307260","Republic School District",null,0,null,0,0,347,85,85,85,0.244956772334294]
["5307320","Richland School District",null,0,null,30,0,15521,1486,1516,1516,9.7674118935635601E-2]
["5307350","Ridgefield School District",null,0,null,18,0,4226,247,265,265,6.2707051585423598E-2]
["5307380","Ritzville School District",null,0,null,2,0,425,55,57,57,0.13411764705882401]
["5307440","Riverside School District",null,0,null,22,0,2065,249,271,271,0.13123486682808699]
["5304560","Riverview School District",null,0,null,3,0,3896,206,209,209,5.36447638603696E-2]
["5307470","Rochester School District",null,0,null,15,0,2522,349,364,364,0.14432989690721601]
["5307530","Roosevelt School District",null,0,null,0,0,43,10,10,10,0.232558139534884]
["5307795","Rooted","5309270",0,0,0,0,40.273363000000003,7.8177973569999999,7.8177973569999999,0,0.19411831479543501]
["5307560","Rosalia School District",null,0,null,0,0,240,38,38,38,0.15833333333333299]
["5307620","Royal School District",null,0,null,3,0,1673,209,212,212,0.126718469814704]
["5307650","San Juan Island School District",null,0,null,0,0,899,120,120,120,0.13348164627363701]
["5307680","Satsop School District",null,0,null,0,0,112,22,22,22,0.19642857142857101]
["5307700","School for the Deaf","5309270",0,0,0,0,126.5734266,19.54449339,19.54449339,0,0.15441229586000399]
["5307690","School of the Blind","5309270",0,0,0,0,66.738715830000004,4.4673127749999999,4.4673127749999999,0,6.6937349929460099E-2]
["5307710","Seattle","5307710",0,null,104,0,69797.731629999995,6817.6207590000004,6921.6207590000004,7089,9.9166843927609799E-2]
["5307740","Sedro-Woolley School District",null,0,null,14,0,5216,637,651,651,0.124808282208589]
["5307770","Selah School District",null,0,null,18,0,4248,447,465,465,0.109463276836158]
["5307800","Selkirk School District",null,0,null,0,0,299,78,78,78,0.26086956521739102]
["5307830","Sequim School District",null,0,null,3,0,3263,496,499,499,0.15292675452037999]
["5307860","Shaw Island School District",null,0,null,0,0,23,3,3,3,0.13043478260869601]
["5307900","Shelton School District",null,0,null,33,0,4156,804,837,837,0.20139557266602501]
["5307920","Shoreline School District",null,0,null,9,0,10556,801,810,810,7.6733611216369804E-2]
["5307950","Skamania School District",null,0,null,0,0,127,14,14,14,0.110236220472441]
["5307980","Skykomish School District",null,0,null,0,0,70,10,10,10,0.14285714285714299]
["5308020","Snohomish School District",null,0,null,21,0,10865,500,521,521,4.7952139898757497E-2]
["5308040","Snoqualmie Valley School District",null,0,null,13,0,7917,383,396,396,5.00189465706707E-2]
["5308070","Soap Lake School District",null,0,null,2,0,619,115,117,117,0.189014539579968]
["5308100","South Bend School District",null,0,null,4,0,391,78,82,82,0.20971867007672601]
["5308160","South Kitsap School District",null,0,null,40,0,11857,1033,1073,1073,9.0495066205616898E-2]
["5308190","South Whidbey School District",null,0,null,6,0,1792,173,179,179,9.9888392857142905E-2]
["5308220","Southside School District",null,0,null,2,0,355,46,48,48,0.13521126760563401]
["5308250","Spokane","5308250",0,null,164,0,34073.850989999999,4743.6844060000003,4907.6844060000003,5102,0.14403081138312199]
["5308260","Spokane International","5308250",0,0,0,0,864.96688740000002,98.127989220000003,98.127989220000003,0,0.11344710491169099]
["5308280","Sprague School District",null,0,null,1,0,126,22,23,23,0.182539682539683]
["5308310","St. John School District",null,0,null,5,0,158,17,22,22,0.139240506329114]
["5308340","Stanwood-Camano School District",null,0,null,6,0,5502,398,404,404,7.3427844420210803E-2]
["5308370","Star School District",null,0,null,0,0,26,5,5,5,0.19230769230769201]
["5308400","Starbuck School District",null,0,null,1,0,16,5,6,6,0.375]
["5308430","Stehekin School District",null,0,null,0,0,15,2,2,2,0.133333333333333]
["5308460","Steilacoom Historical School District",null,0,null,23,0,4019,240,263,263,6.5439163971137096E-2]
["5308490","Steptoe School District",null,0,null,0,0,51,9,9,9,0.17647058823529399]
["5308520","Stevenson-Carson School District",null,0,null,14,0,921,116,130,130,0.14115092290988099]
["5308550","Sultan School District",null,0,null,12,0,2532,241,253,253,9.9921011058451803E-2]
["5308580","Summit Valley School District",null,0,null,0,0,115,27,27,27,0.23478260869565201]
["5308290","Summit: Atlas","5307710",0,0,0,0,636.64532099999997,83.689620379999994,83.689620379999994,0,0.131454072818464]
["5308230","Summit: Olympus","5308700",0,0,0,0,187.4332129,21.615927159999998,21.615927159999998,0,0.11532602376067699]
["5308240","Summit: Sierra","5307710",0,0,0,0,329.29930389999998,33.475848149999997,33.475848149999997,0,0.101657816312946]
["5308610","Sumner School District",null,0,null,39,0,10792,613,652,652,6.0415122312824303E-2]
["5308670","Sunnyside School District",null,0,null,17,0,6305,1283,1300,1300,0.20618556701030899]
["5308690","Suquamish","5300660",0,0,0,0,96.545791320000006,17.556629829999999,17.556629829999999,0,0.18184769729585201]
["5308700","Tacoma","5308700",0,null,113,0,33051.519099999998,4078.2049240000001,4191.2049239999997,4275,0.12680823873816499]
["5308730","Taholah School District",null,0,null,0,0,351,74,74,74,0.210826210826211]
["5308760","Tahoma School District",null,0,null,4,0,9264,446,450,450,4.8575129533678797E-2]
["5308790","Tekoa School District",null,0,null,0,0,164,27,27,27,0.16463414634146301]
["5308820","Tenino School District",null,0,null,2,0,1538,213,215,215,0.13979193758127401]
["5308850","Thorp School District",null,0,null,1,0,201,30,31,31,0.154228855721393]
["5308910","Toledo School District",null,0,null,3,0,851,96,99,99,0.116333725029377]
["5308940","Tonasket School District",null,0,null,2,0,1132,279,281,281,0.248233215547703]
["5308970","Toppenish School District",null,0,null,15,0,3529,770,785,785,0.22244261830546899]
["5309000","Touchet School District",null,0,null,0,0,226,20,20,20,8.8495575221238895E-2]
["5309030","Toutle Lake School District",null,0,null,1,0,772,86,87,87,0.112694300518135]
["5309060","Trout Lake School District",null,0,null,1,0,202,47,48,48,0.237623762376238]
["5308130","Tukwila","5308130",0,null,6,0,2202.7010369999998,528.22944240000004,534.22944240000004,698,0.242533795343369]
["5309100","Tumwater School District",null,0,null,22,0,6997,716,738,738,0.105473774474775]
["5309150","Union Gap School District",null,0,null,0,0,823,158,158,158,0.19198055893074101]
["5309180","University Place School District",null,0,null,10,0,5781,458,468,468,8.0954852101712493E-2]
["5309240","Valley School District",null,0,null,1,0,291,71,72,72,0.247422680412371]
["5309270","Vancouver","5309270",0,null,106,0,25106.414489999999,3137.170396,3243.170396,3275,0.12917696380635299]
["5309300","Vashon Island School District",null,0,null,0,0,1443,151,151,151,0.104643104643105]
["5309330","Wahkiakum School District",null,0,null,2,0,491,90,92,92,0.18737270875763701]
["5309360","Wahluke School District",null,0,null,1,0,2046,250,251,251,0.122678396871945]
["5309390","Waitsburg School District",null,0,null,0,0,283,38,38,38,0.13427561837455801]
["5309450","Walla Walla Public Schools",null,0,null,22,0,6121,825,847,847,0.13837608233948701]
["5309480","Wapato School District",null,0,null,25,0,3549,844,869,869,0.244857706396168]
["5309510","Warden School District",null,0,null,4,0,880,121,125,125,0.142045454545455]
["5309540","Washougal School District",null,0,null,8,0,3813,305,313,313,8.20875950694991E-2]
["5309570","Washtucna School District",null,0,null,0,0,67,9,9,9,0.134328358208955]
["5309600","Waterville School District",null,0,null,0,0,340,52,52,52,0.152941176470588]
["5309630","Wellpinit School District",null,0,null,12,0,318,69,81,81,0.25471698113207503]
["5309660","Wenatchee","5309660",0,null,42,0,8123.4823219999998,1064.2416089999999,1106.2416089999999,1139,0.13617825032346101]
["5309690","West Valley School District (Spokane)",null,0,null,34,0,3257,331,365,365,0.112066318698189]
["5309720","West Valley School District (Yakima)",null,0,null,28,0,6395,732,760,760,0.118842845973417]
["5309740","Whatcom Intergenerational","5300420",0,0,0,0,75.402548530000004,15.01923077,15.01923077,0,0.19918730946601501]
["5309750","White Pass School District",null,0,null,3,0,468,109,112,112,0.23931623931623899]
["5309780","White River School District",null,0,null,3,0,4774,285,288,288,6.0326770004189401E-2]
["5309810","White Salmon Valley School District",null,0,null,0,0,1234,164,164,164,0.13290113452187999]
["5300955","Why Not You (Cascade Midway)","5303540",0,0,0,0,164.0556071,23.851899970000002,23.851899970000002,0,0.14538911764514301]
["5309840","Wilbur School District",null,0,null,0,0,218,30,30,30,0.13761467889908299]
["5309870","Willapa Valley School District",null,0,null,3,0,332,48,51,51,0.15361445783132499]
["5309900","Wilson Creek School District",null,0,null,0,0,113,12,12,12,0.106194690265487]
["5309930","Winlock School District",null,0,null,0,0,809,119,119,119,0.147095179233622]
["5309990","Wishkah Valley School District",null,0,null,0,0,148,21,21,21,0.141891891891892]
["5310020","Wishram School District",null,0,null,0,0,44,15,15,15,0.34090909090909099]
["5310050","Woodland School District",null,0,null,7,0,2666,259,266,266,9.9774943735933999E-2]
["5310110","Yakima School District",null,0,null,66,0,16801,3522,3588,3588,0.21355871674305099]
["5310140","Yelm Community Schools",null,0,null,27,0,6649,716,743,743,0.111746127237179]
["5310170","Zillah School District",null,0,null,13,0,1223,159,172,172,0.140637775960752]

{"sheet":"CCDDD","index":6,"n_rows":319,"n_cols":7,"rows_kept":319,"cut":false,"hidden":true,"merged":[]}
[]
["Fed Code","CCDDD","Fed Code","District","Fed Code"]
[{"$f":"C3","v":"5300030"},"14005","5300030","ABERDEEN",{"$f":"C3","v":"5300030"},{"$f":"B3","v":"14005"},{"$f":"TEXT(C3,\"0000000\")","v":"5300030"}]
[{"$f":"C4","v":"5300060"},"21226","5300060","ADNA",{"$f":"C4","v":"5300060"},{"$f":"B4","v":"21226"},{"$f":"TEXT(C4,\"0000000\")","v":"5300060"}]
["5300090","22017","5300090","ALMIRA","5300090","22017","5300090"]
["5300150","29103","5300150","ANACORTES","5300150","29103","5300150"]
["5300240","31016","5300240","ARLINGTON","5300240","31016","5300240"]
["5300280","02420","5300280","ASOTIN-ANATONE","5300280","02420","5300280"]
["5300300","17408","5300300","AUBURN","5300300","17408","5300300"]
["5300330","18303","5300330","BAINBRIDGE ISLAND","5300330","18303","5300330"]
["5300380","06119","5300380","BATTLE GROUND","5300380","06119","5300380"]
["5300390","17405","5300390","BELLEVUE","5300390","17405","5300390"]
["5300420","37501","5300420","BELLINGHAM","5300420","37501","5300420"]
["5300450","01122","5300450","BENGE","5300450","01122","5300450"]
["5300480","27403","5300480","BETHEL","5300480","27403","5300480"]
["5300510","20203","5300510","BICKLETON","5300510","20203","5300510"]
["5300570","37503","5300570","BLAINE","5300570","37503","5300570"]
["5300630","21234","5300630","BOISTFORT","5300630","21234","5300630"]
["5300660","18100","5300660","BREMERTON","5300660","18100","5300660"]
["5300690","24111","5300690","BREWSTER","5300690","24111","5300690"]
["5300720","09075","5300720","BRIDGEPORT","5300720","09075","5300720"]
["5300750","16046","5300750","BRINNON","5300750","16046","5300750"]
["5300780","29100","5300780","BURLINGTON-EDISON","5300780","29100","5300780"]
["5300810","06117","5300810","CAMAS","5300810","06117","5300810"]
["5300840","05401","5300840","CAPE FLATTERY","5300840","05401","5300840"]
["5300870","27019","5300870","CARBONADO","5300870","27019","5300870"]
["5300950","04228","5300950","CASCADE","5300950","04228","5300950"]
["5300960","04222","5300960","CASHMERE","5300960","04222","5300960"]
["5300990","08401","5300990","CASTLE ROCK","5300990","08401","5300990"]
["5301000","18901","5301000","CATALYST BREMERTON CHARTER","5301000","18901","5301000"]
["5301050","20215","5301050","CENTERVILLE","5301050","20215","5301050"]
["5301080","18401","5301080","CENTRAL KITSAP","5301080","18401","5301080"]
["5301110","32356","5301110","CENTRAL VALLEY","5301110","32356","5301110"]
["5301140","21401","5301140","CENTRALIA","5301140","21401","5301140"]
["5301170","21302","5301170","CHEHALIS","5301170","21302","5301170"]
["5301230","32360","5301230","CHENEY","5301230","32360","5301230"]
["5301260","33036","5301260","CHEWELAH","5301260","33036","5301260"]
["5301290","16049","5301290","CHIMACUM","5301290","16049","5301290"]
["5301320","02250","5301320","CLARKSTON","5301320","02250","5301320"]
["5301350","19404","5301350","CLE ELUM-ROSLYN","5301350","19404","5301350"]
["5301410","27400","5301410","CLOVER PARK","5301410","27400","5301410"]
["5301440","38300","5301440","COLFAX","5301440","38300","5301440"]
["5301470","36250","5301470","COLLEGE PLACE","5301470","36250","5301470"]
["5301500","38306","5301500","COLTON","5301500","38306","5301500"]
["5301560","33206","5301560","COLUMBIA (STEV)","5301560","33206","5301560"]
["5301590","36400","5301590","COLUMBIA (WALLA)","5301590","36400","5301590"]
["5301630","33115","5301630","COLVILLE","5301630","33115","5301630"]
["5301660","29011","5301660","CONCRETE","5301660","29011","5301660"]
["5301680","29317","5301680","CONWAY","5301680","29317","5301680"]
["5301710","14099","5301710","COSMOPOLIS","5301710","14099","5301710"]
["5303440","13151","5303440","COULEE-HARTLINE","5303440","13151","5303440"]
["5301800","15204","5301800","COUPEVILLE","5301800","15204","5301800"]
["5301830","05313","5301830","CRESCENT","5301830","05313","5301830"]
["5301860","22073","5301860","CRESTON","5301860","22073","5301860"]
["5301890","10050","5301890","CURLEW","5301890","10050","5301890"]
["5301920","26059","5301920","CUSICK","5301920","26059","5301920"]
["5301950","19007","5301950","DAMMAN","5301950","19007","5301950"]
["5301980","31330","5301980","DARRINGTON","5301980","31330","5301980"]
["5302010","22207","5302010","DAVENPORT","5302010","22207","5302010"]
["5302040","07002","5302040","DAYTON","5302040","07002","5302040"]
["5302070","32414","5302070","DEER PARK","5302070","32414","5302070"]
["5302130","27343","5302130","DIERINGER","5302130","27343","5302130"]
["5302160","36101","5302160","DIXIE","5302160","36101","5302160"]
["5302280","32361","5302280","EAST VALLEY (SPK)","5302280","32361","5302280"]
["5305370","39090","5305370","EAST VALLEY (YAK)","5305370","39090","5305370"]
["5302310","09206","5302310","EASTMONT","5302310","09206","5302310"]
["5302340","19028","5302340","EASTON","5302340","19028","5302340"]
[{"$f":"C68","v":"5302370"},"27404","5302370","EATONVILLE",{"$f":"C68","v":"5302370"},{"$f":"B68","v":"27404"},{"$f":"TEXT(C68,\"0000000\")","v":"5302370"}]
["5302400","31015","5302400","EDMONDS","5302400","31015","5302400"]
["5302460","19401","5302460","ELLENSBURG","5302460","19401","5302460"]
["5302490","14068","5302490","ELMA","5302490","14068","5302490"]
["5302520","38308","5302520","ENDICOTT","5302520","38308","5302520"]
["5302550","04127","5302550","ENTIAT","5302550","04127","5302550"]
["5300001","17216","5300001","ENUMCLAW","5300001","17216","5300001"]
["5302610","13165","5302610","EPHRATA","5302610","13165","5302610"]
["5302640","21036","5302640","EVALINE","5302640","21036","5302640"]
["5302670","31002","5302670","EVERETT","5302670","31002","5302670"]
["5302700","06114","5302700","EVERGREEN (CLARK)","5302700","06114","5302700"]
["5302730","33205","5302730","EVERGREEN (STEV)","5302730","33205","5302730"]
["5302820","17210","5302820","FEDERAL WAY","5302820","17210","5302820"]
["5302850","37502","5302850","FERNDALE","5302850","37502","5302850"]
["5302880","27417","5302880","FIFE","5302880","27417","5302880"]
["5302910","03053","5302910","FINLEY","5302910","03053","5302910"]
["5302940","27402","5302940","FRANKLIN PIERCE","5302940","27402","5302940"]
["5302970","32358","5302970","FREEMAN","5302970","32358","5302970"]
["5303000","38302","5303000","GARFIELD","5303000","38302","5303000"]
["5303030","20401","5303030","GLENWOOD","5303030","20401","5303030"]
["5303090","20404","5303090","GOLDENDALE","5303090","20404","5303090"]
["5303130","13301","5303130","GRAND COULEE","5303130","13301","5303130"]
["5303150","39200","5303150","GRANDVIEW","5303150","39200","5303150"]
["5303180","39204","5303180","GRANGER","5303180","39204","5303180"]
["5303210","31332","5303210","GRANITE FALLS","5303210","31332","5303210"]
["5303240","23054","5303240","GRAPEVIEW","5303240","23054","5303240"]
["5303270","32312","5303270","GREAT NORTHERN","5303270","32312","5303270"]
["5303280","17910","5303280","RAINIER VALLEY CHARTER","5303280","17910","5303280"]
["5303300","06103","5303300","GREEN MOUNTAIN","5303300","06103","5303300"]
["5303330","34324","5303330","GRIFFIN","5303330","34324","5303330"]
["5303360","22204","5303360","HARRINGTON","5303360","22204","5303360"]
["5303510","39203","5303510","HIGHLAND","5303510","39203","5303510"]
["5303540","17401","5303540","HIGHLINE","5303540","17401","5303540"]
["5303570","06098","5303570","HOCKINSON","5303570","06098","5303570"]
["5303600","23404","5303600","HOOD CANAL","5303600","23404","5303600"]
["5303660","14028","5303660","HOQUIAM","5303660","14028","5303660"]
["5303705","27902","5303705","IMPACT COMMENCEMENT BAY CHARTER","5303705","27902","5303705"]
["5303700","17911","5303700","IMPACT PUGET SOUND CHARTER","5303700","17911","5303700"]
["5303710","17916","5303710","IMPACT SALISH SEA CHARTER","5303710","17916","5303710"]
["5300002","10070","5300002","INCHELIUM","5300002","10070","5300002"]
["5303720","31063","5303720","INDEX","5303720","31063","5303720"]
["5303750","17411","5303750","ISSAQUAH","5303750","17411","5303750"]
["5303780","11056","5303780","KAHLOTUS","5303780","11056","5303780"]
["5303810","08402","5303810","KALAMA","5303810","08402","5303810"]
["5303870","10003","5303870","KELLER","5303870","10003","5303870"]
["5300003","08458","5300003","KELSO","5300003","08458","5300003"]
["5303930","03017","5303930","KENNEWICK","5303930","03017","5303930"]
["5303960","17415","5303960","KENT","5303960","17415","5303960"]
["5303990","33212","5303990","KETTLE FALLS","5303990","33212","5303990"]
["5304020","03052","5304020","KIONA-BENTON","5304020","03052","5304020"]
["5304050","19403","5304050","KITTITAS","5304050","19403","5304050"]
["5304080","20402","5304080","KLICKITAT","5304080","20402","5304080"]
["5304170","06101","5304170","LA CENTER","5304170","06101","5304170"]
["5304110","29311","5304110","LA CONNER","5304110","29311","5304110"]
["5304150","38126","5304150","LACROSSE","5304150","38126","5304150"]
["5301200","04129","5301200","LAKE CHELAN","5301200","04129","5301200"]
["5307050","14097","5307050","QUINAULT","5307050","14097","5307050"]
["5304200","31004","5304200","LAKE STEVENS","5304200","31004","5304200"]
["5304230","17414","5304230","LAKE WASHINGTON","5304230","17414","5304230"]
["5304260","31306","5304260","LAKEWOOD","5304260","31306","5304260"]
["5304290","38264","5304290","LAMONT","5304290","38264","5304290"]
["5304380","32362","5304380","LIBERTY","5304380","32362","5304380"]
["5304410","01158","5304410","LIND","5304410","01158","5304410"]
["5304470","08122","5304470","LONGVIEW","5304470","08122","5304470"]
[{"$f":"C132","v":"5304500"},"33183","5304500","LOON LAKE",{"$f":"C132","v":"5304500"},{"$f":"B132","v":"33183"},{"$f":"TEXT(C132,\"0000000\")","v":"5304500"}]
["5304530","28144","5304530","LOPEZ","5304530","28144","5304530"]
["5304550","32903","5304550","LUMEN CHARTER","5304550","32903","5304550"]
["5304590","20406","5304590","LYLE","5304590","20406","5304590"]
["5304620","37504","5304620","LYNDEN","5304620","37504","5304620"]
["5304650","39120","5304650","MABTON","5304650","39120","5304650"]
["5304710","09207","5304710","MANSFIELD","5304710","09207","5304710"]
["5304740","04019","5304740","MANSON","5304740","04019","5304740"]
["5304800","23311","5304800","MARY M KNIGHT","5304800","23311","5304800"]
["5304830","33207","5304830","MARY WALKER","5304830","33207","5304830"]
["5304860","31025","5304860","MARYSVILLE","5304860","31025","5304860"]
["5304890","14065","5304890","MCCLEARY","5304890","14065","5304890"]
["5304920","32354","5304920","MEAD","5304920","32354","5304920"]
["5304950","32326","5304950","MEDICAL LAKE","5304950","32326","5304950"]
["5304980","17400","5304980","MERCER ISLAND","5304980","17400","5304980"]
["5305010","37505","5305010","MERIDIAN","5305010","37505","5305010"]
["5305020","24350","5305020","METHOW VALLEY","5305020","24350","5305020"]
["5305040","30031","5305040","MILL A","5305040","30031","5305040"]
["5305130","31103","5305130","MONROE","5305130","31103","5305130"]
["5305160","14066","5305160","MONTESANO","5305160","14066","5305160"]
["5305190","21214","5305190","MORTON","5305190","21214","5305190"]
["5305220","13161","5305220","MOSES LAKE","5305220","13161","5305220"]
["5305250","21206","5305250","MOSSYROCK","5305250","21206","5305250"]
["5305280","39209","5305280","MOUNT ADAMS","5305280","39209","5305280"]
["5305310","37507","5305310","MOUNT BAKER","5305310","37507","5305310"]
["5305340","30029","5305340","MOUNT PLEASANT","5305340","30029","5305340"]
["5305400","29320","5305400","MOUNT VERNON","5305400","29320","5305400"]
["5305430","31006","5305430","MUKILTEO","5305430","31006","5305430"]
["5305460","39003","5305460","NACHES VALLEY","5305460","39003","5305460"]
["5305490","21014","5305490","NAPAVINE","5305490","21014","5305490"]
["5305520","25155","5305520","NASELLE-GRAYS","5305520","25155","5305520"]
["5305550","24014","5305550","NESPELEM","5305550","24014","5305550"]
["5305610","26056","5305610","NEWPORT","5305610","26056","5305610"]
["5305640","32325","5305640","NINE MILE FALLS","5305640","32325","5305640"]
["5305670","37506","5305670","NOOKSACK VALLEY","5305670","37506","5305670"]
["5305700","14064","5305700","NORTH BEACH","5305700","14064","5305700"]
["5305730","11051","5305730","NORTH FRANKLIN","5305730","11051","5305730"]
["5305760","18400","5305760","NORTH KITSAP","5305760","18400","5305760"]
["5305790","23403","5305790","NORTH MASON","5305790","23403","5305790"]
["5305820","25200","5305820","NORTH RIVER","5305820","25200","5305820"]
["5305850","34003","5305850","NORTH THURSTON","5305850","34003","5305850"]
["5305880","33211","5305880","NORTHPORT","5305880","33211","5305880"]
["5305910","17417","5305910","NORTHSHORE","5305910","17417","5305910"]
["5305940","15201","5305940","OAK HARBOR","5305940","15201","5305940"]
["5305970","38324","5305970","OAKESDALE","5305970","38324","5305970"]
["5306000","14400","5306000","OAKVILLE","5306000","14400","5306000"]
["5306060","25101","5306060","OCEAN BEACH","5306060","25101","5306060"]
["5306090","14172","5306090","OCOSTA","5306090","14172","5306090"]
["5306120","22105","5306120","ODESSA","5306120","22105","5306120"]
["5306150","24105","5306150","OKANOGAN","5306150","24105","5306150"]
["5306180","34111","5306180","OLYMPIA","5306180","34111","5306180"]
["5306220","24019","5306220","OMAK","5306220","24019","5306220"]
["5306240","21300","5306240","ONALASKA","5306240","21300","5306240"]
["5306270","33030","5306270","ONION CREEK","5306270","33030","5306270"]
["5306300","28137","5306300","ORCAS ISLAND","5306300","28137","5306300"]
["5306330","32123","5306330","ORCHARD PRAIRIE","5306330","32123","5306330"]
["5306360","10065","5306360","ORIENT","5306360","10065","5306360"]
["5306390","09013","5306390","ORONDO","5306390","09013","5306390"]
["5306420","24410","5306420","OROVILLE","5306420","24410","5306420"]
["5306450","27344","5306450","ORTING","5306450","27344","5306450"]
["5306480","01147","5306480","OTHELLO","5306480","01147","5306480"]
["5306510","09102","5306510","PALISADES","5306510","09102","5306510"]
["5306540","38301","5306540","PALOUSE","5306540","38301","5306540"]
["5306570","11001","5306570","PASCO","5306570","11001","5306570"]
[{"$f":"C196","v":"5306600"},"24122","5306600","PATEROS",{"$f":"C196","v":"5306600"},{"$f":"B196","v":"24122"},{"$f":"TEXT(C196,\"0000000\")","v":"5306600"}]
["5306630","03050","5306630","PATERSON","5306630","03050","5306630"]
["5306660","21301","5306660","PE ELL","5306660","21301","5306660"]
["5306690","27401","5306690","PENINSULA","5306690","27401","5306690"]
["5306770","04901","5306770","PINNACLE PREP CHARTER","5306770","04901","5306770"]
["5306750","23402","5306750","PIONEER","5306750","23402","5306750"]
["5306780","12110","5306780","POMEROY","5306780","12110","5306780"]
["5306820","05121","5306820","PORT ANGELES","5306820","05121","5306820"]
["5306840","16050","5306840","PORT TOWNSEND","5306840","16050","5306840"]
["5306870","36402","5306870","PRESCOTT","5306870","36402","5306870"]
["5306890","32907","5306890","PRIDE PREP CHARTER","5306890","32907","5306890"]
["5306900","03116","5306900","PROSSER","5306900","03116","5306900"]
["5306940","38901","5306940","PULLMAN MONTESSORI CHARTER","5306940","38901","5306940"]
["5306930","38267","5306930","PULLMAN","5306930","38267","5306930"]
["5306960","27003","5306960","PUYALLUP","5306960","27003","5306960"]
["5301380","16020","5301380","QUEETS-CLEARWATER","5301380","16020","5301380"]
["5306990","16048","5306990","QUILCENE","5306990","16048","5306990"]
["5307020","05402","5307020","QUILLAYUTE VALLEY","5307020","05402","5307020"]
["5307080","13144","5307080","QUINCY","5307080","13144","5307080"]
["5307120","17908","5307120","RAINIER PREP CHARTER","5307120","17908","5307120"]
["5307110","34307","5307110","RAINIER","5307110","34307","5307110"]
["5307140","25116","5307140","RAYMOND","5307140","25116","5307140"]
["5307210","22009","5307210","REARDAN-EDWALL","5307210","22009","5307210"]
["5307230","17403","5307230","RENTON","5307230","17403","5307230"]
["5307260","10309","5307260","REPUBLIC","5307260","10309","5307260"]
["5307320","03400","5307320","RICHLAND","5307320","03400","5307320"]
["5307350","06122","5307350","RIDGEFIELD","5307350","06122","5307350"]
["5307380","01160","5307380","RITZVILLE","5307380","01160","5307380"]
["5307440","32416","5307440","RIVERSIDE","5307440","32416","5307440"]
["5304560","17407","5304560","RIVERVIEW","5304560","17407","5304560"]
["5307470","34401","5307470","ROCHESTER","5307470","34401","5307470"]
["5307530","20403","5307530","ROOSEVELT","5307530","20403","5307530"]
["5307560","38320","5307560","ROSALIA","5307560","38320","5307560"]
["5307620","13160","5307620","ROYAL","5307620","13160","5307620"]
["5307650","28149","5307650","SAN JUAN ISLAND","5307650","28149","5307650"]
["5307680","14104","5307680","SATSOP","5307680","14104","5307680"]
["5307700","34975","5307700","SCHOOL FOR THE DEAF","5307700","34975","5307700"]
["5307690","34974","5307690","SCHOOL OF THE BLIND","5307690","34974","5307690"]
["5307710","17001","5307710","SEATTLE","5307710","17001","5307710"]
["5307740","29101","5307740","SEDRO-WOOLLEY","5307740","29101","5307740"]
["5307770","39119","5307770","SELAH","5307770","39119","5307770"]
["5307800","26070","5307800","SELKIRK","5307800","26070","5307800"]
["5307830","05323","5307830","SEQUIM","5307830","05323","5307830"]
["5307860","28010","5307860","SHAW ISLAND","5307860","28010","5307860"]
["5307900","23309","5307900","SHELTON","5307900","23309","5307900"]
["5307920","17412","5307920","SHORELINE","5307920","17412","5307920"]
["5307950","30002","5307950","SKAMANIA","5307950","30002","5307950"]
["5307980","17404","5307980","SKYKOMISH","5307980","17404","5307980"]
["5308020","31201","5308020","SNOHOMISH","5308020","31201","5308020"]
["5308040","17410","5308040","SNOQUALMIE VALLEY","5308040","17410","5308040"]
["5308070","13156","5308070","SOAP LAKE","5308070","13156","5308070"]
["5308100","25118","5308100","SOUTH BEND","5308100","25118","5308100"]
["5308160","18402","5308160","SOUTH KITSAP","5308160","18402","5308160"]
["5308190","15206","5308190","SOUTH WHIDBEY","5308190","15206","5308190"]
["5308220","23042","5308220","SOUTHSIDE","5308220","23042","5308220"]
["5308260","32901","5308260","SPOKANE INTERNATIONAL ACADEMY CHARTER","5308260","32901","5308260"]
["5308250","32081","5308250","SPOKANE","5308250","32081","5308250"]
["5308280","22008","5308280","SPRAGUE","5308280","22008","5308280"]
["5308310","38322","5308310","ST JOHN","5308310","38322","5308310"]
["5308340","31401","5308340","STANWOOD","5308340","31401","5308340"]
["5308370","11054","5308370","STAR","5308370","11054","5308370"]
["5308400","07035","5308400","STARBUCK","5308400","07035","5308400"]
["5308430","04069","5308430","STEHEKIN","5308430","04069","5308430"]
["5308460","27001","5308460","STEILACOOM","5308460","27001","5308460"]
[{"$f":"C260","v":"5308490"},"38304","5308490","STEPTOE",{"$f":"C260","v":"5308490"},{"$f":"B260","v":"38304"},{"$f":"TEXT(C260,\"0000000\")","v":"5308490"}]
["5308520","30303","5308520","STEVENSON-CARSON","5308520","30303","5308520"]
["5308550","31311","5308550","SULTAN","5308550","31311","5308550"]
["5308290","17905","5308290","SUMMIT ATLAS CHARTER","5308290","17905","5308290"]
["5308230","27905","5308230","SUMMIT OLYMPUS CHARTER","5308230","27905","5308230"]
["5308240","17902","5308240","SUMMIT SIERRA CHARTER","5308240","17902","5308240"]
["5308580","33202","5308580","SUMMIT VALLEY","5308580","33202","5308580"]
["5308610","27320","5308610","SUMNER","5308610","27320","5308610"]
["5308670","39201","5308670","SUNNYSIDE","5308670","39201","5308670"]
["5308690","18902","5308690","SUQUAMISH","5308690","18902","5308690"]
["5308700","27010","5308700","TACOMA","5308700","27010","5308700"]
["5308730","14077","5308730","TAHOLAH","5308730","14077","5308730"]
["5308760","17409","5308760","TAHOMA","5308760","17409","5308760"]
["5308790","38265","5308790","TEKOA","5308790","38265","5308790"]
["5308820","34402","5308820","TENINO","5308820","34402","5308820"]
["5308850","19400","5308850","THORP","5308850","19400","5308850"]
["5308910","21237","5308910","TOLEDO","5308910","21237","5308910"]
["5308940","24404","5308940","TONASKET","5308940","24404","5308940"]
["5308970","39202","5308970","TOPPENISH","5308970","39202","5308970"]
["5309000","36300","5309000","TOUCHET","5309000","36300","5309000"]
["5309030","08130","5309030","TOUTLE LAKE","5309030","08130","5309030"]
["5309060","20400","5309060","TROUT LAKE","5309060","20400","5309060"]
["5308130","17406","5308130","TUKWILA","5308130","17406","5308130"]
["5309100","34033","5309100","TUMWATER","5309100","34033","5309100"]
["5309150","39002","5309150","UNION GAP","5309150","39002","5309150"]
["5309180","27083","5309180","UNIVERSITY PLACE","5309180","27083","5309180"]
["5309240","33070","5309240","VALLEY","5309240","33070","5309240"]
["5309270","06037","5309270","VANCOUVER","5309270","06037","5309270"]
["5309300","17402","5309300","VASHON ISLAND","5309300","17402","5309300"]
["5309330","35200","5309330","WAHKIAKUM","5309330","35200","5309330"]
["5309360","13073","5309360","WAHLUKE","5309360","13073","5309360"]
["5309390","36401","5309390","WAITSBURG","5309390","36401","5309390"]
["5309450","36140","5309450","WALLA WALLA","5309450","36140","5309450"]
["5309480","39207","5309480","WAPATO","5309480","39207","5309480"]
["5309510","13146","5309510","WARDEN","5309510","13146","5309510"]
["5309540","06112","5309540","WASHOUGAL","5309540","06112","5309540"]
["5309570","01109","5309570","WASHTUCNA","5309570","01109","5309570"]
["5309600","09209","5309600","WATERVILLE","5309600","09209","5309600"]
["5309630","33049","5309630","WELLPINIT","5309630","33049","5309630"]
["5309660","04246","5309660","WENATCHEE","5309660","04246","5309660"]
["5309690","32363","5309690","WEST VALLEY (SPK)","5309690","32363","5309690"]
["5309720","39208","5309720","WEST VALLEY (YAK)","5309720","39208","5309720"]
["5309740","37902","5309740","WHATCOM INTERGENERATIONAL CHARTER","5309740","37902","5309740"]
["5309750","21303","5309750","WHITE PASS","5309750","21303","5309750"]
["5309780","27416","5309780","WHITE RIVER","5309780","27416","5309780"]
["5309810","20405","5309810","WHITE SALMON","5309810","20405","5309810"]
["5300955","17917","5300955","WHY NOT YOU ACADEMY CHARTER","5300955","17917","5300955"]
["5309840","22200","5309840","WILBUR","5309840","22200","5309840"]
["5309870","25160","5309870","WILLAPA VALLEY","5309870","25160","5309870"]
["5309890","36901","5309890","WILLOW CHARTER","5309890","36901","5309890"]
["5309900","13167","5309900","WILSON CREEK","5309900","13167","5309900"]
["5309930","21232","5309930","WINLOCK","5309930","21232","5309930"]
["5309990","14117","5309990","WISHKAH VALLEY","5309990","14117","5309990"]
["5310020","20094","5310020","WISHRAM","5310020","20094","5310020"]
["5310050","08404","5310050","WOODLAND","5310050","08404","5310050"]
["5310110","39007","5310110","YAKIMA","5310110","39007","5310110"]
["5310140","34002","5310140","YELM","5310140","34002","5310140"]
["5310170","39205","5310170","ZILLAH","5310170","39205","5310170"]
["5307790","17919","5307790","IMPACRT RENTON CHARTER","5307790","17919","5307790"]
["5307795","06901","5307795","ROOTED CARTER","5307795","06901","5307795"]