{"text_format":"1","workbook":"xlsx","n_sheets":7,"sheets":["District","Allocation 2024-25 Prelim","24-25 Adjusted Formula counts","Assumptions","Allocation 2023-24 Final","23-24 Adjusted Formula counts","CCDDD"],"not_rendered":{"charts":0,"images":0,"macros":1,"external_links":2,"defined_names":14,"comments":0,"pivot_tables":0},"unopened":[],"bounds":{"document_bytes":16777216,"sheet_cells":100000,"rows_first":2000,"rows_last":500,"rows_between":2000,"halvings":0,"cell_chars":16384,"cell_head_chars":4096},"cells_cut":0,"cells_raw":0,"read":"whole","date_system":"1900"}

{"sheet":"District","index":0,"n_rows":24,"n_cols":17,"rows_kept":24,"cut":false,"hidden":false,"merged":[[3,3,3,10],[4,3,4,6]]}
[]
[null,null,null,"2024-2025","2023-2024","2022-23","2021-22","2021-22","2020-21","2020-21","2019-20","2019-20","2018-19","2017-18","2016-17","2015-16","2014-15"]
[null,null,null,"Preliminary","Final","Preliminary","Final","Preliminary","Final","Preliminary","Final","Preliminary","Final","2nd Revised","Revised"]
[null,null,"Select District Name","ARLINGTON"]
[null,null,"District Code (CCDDD)",{"$f":"VLOOKUP(D4,CCDDD!D:F,3,FALSE)","v":"31016"}]
[]
[null,null,"Eisenhower 2001-02 Allocations",{"$f":"VLOOKUP($D$5,'Allocation 2024-25 Prelim'!$A$7:$S$323,4,FALSE)","v":0},{"$f":"VLOOKUP($D$5,'Allocation 2023-24 Final'!$A$7:$L$322,4,FALSE)","v":0},{"$f":"VLOOKUP($D$5,'[1]Allocation 2022-23 P'!$A$7:$M$321,3,FALSE)","v":0},{"$f":"VLOOKUP($D$5,'[2]Allocation 2021-22 Final'!$A$7:$U$321,3,FALSE)","v":0},{"$f":"VLOOKUP($D$5,'[1]Allocation 2021-22 Preliminary'!$A$7:$M$321,3,FALSE)","v":0},{"$f":"IFERROR(VLOOKUP($D$5,'[1]Allocation 2020-21 Final'!$A$7:$M$317,3,FALSE),0)","v":0},{"$f":"IFERROR(VLOOKUP($D$5,'[1]Allocation 2020-21 Preliminary'!$A$7:$M$318,3,FALSE),0)","v":0},{"$f":"IFERROR(VLOOKUP($D$5,'[1]Allocation 2019-20 Final'!$A$7:$M$314,3,FALSE),0)","v":0},{"$f":"IFERROR(VLOOKUP($D$5,'[1]Allocation 2019-20 Preliminary'!$A$7:$M$316,3,FALSE),0)","v":0},{"$f":"IFERROR(VLOOKUP($D$5,'[1]Allocation 2018-19 Final'!$A$7:$M$316,3,FALSE),0)","v":0},{"$f":"VLOOKUP($D$5,'[1]Allocation 2017-18 2ndRev_Final'!$A$7:$M$315,3,FALSE)","v":0},{"$f":"VLOOKUP($D$5,'[1]Allocation 2016-17 rev_Final'!$A$7:$M$314,3,FALSE)","v":17804},{"$f":"VLOOKUP($D$5,'[1]Allocation 2015-16 Final'!$A$7:$M$313,3,FALSE)","v":17804},{"$f":"VLOOKUP($D$5,'[1]Allocation 2014-15 Final'!$A$7:$M$304,3,FALSE)","v":17804}]
[null,null,"Class Size Reduction allocations 2001-02",{"$f":"VLOOKUP($D$5,'Allocation 2024-25 Prelim'!$A$7:$S$323,5,FALSE)","v":0},{"$f":"VLOOKUP($D$5,'Allocation 2023-24 Final'!$A$7:$L$322,5,FALSE)","v":0},{"$f":"VLOOKUP($D$5,'[1]Allocation 2022-23 P'!$A$7:$M$321,4,FALSE)","v":0},{"$f":"VLOOKUP($D$5,'[2]Allocation 2021-22 Final'!$A$7:$U$321,4,FALSE)","v":0},{"$f":"VLOOKUP($D$5,'[1]Allocation 2021-22 Preliminary'!$A$7:$M$321,4,FALSE)","v":0},{"$f":"IFERROR(VLOOKUP($D$5,'[1]Allocation 2020-21 Final'!$A$7:$M$317,4,FALSE),0)","v":0},{"$f":"IFERROR(VLOOKUP($D$5,'[1]Allocation 2020-21 Preliminary'!$A$7:$M$318,4,FALSE),0)","v":0},{"$f":"IFERROR(VLOOKUP($D$5,'[1]Allocation 2019-20 Final'!$A$7:$M$314,4,FALSE),0)","v":0},{"$f":"IFERROR(VLOOKUP($D$5,'[1]Allocation 2019-20 Preliminary'!$A$7:$M$316,4,FALSE),0)","v":0},{"$f":"IFERROR(VLOOKUP($D$5,'[1]Allocation 2018-19 Final'!$A$7:$M$316,4,FALSE),0)","v":0},{"$f":"VLOOKUP($D$5,'[1]Allocation 2017-18 2ndRev_Final'!$A$7:$M$315,4,FALSE)","v":0},{"$f":"VLOOKUP($D$5,'[1]Allocation 2016-17 rev_Final'!$A$7:$M$314,4,FALSE)","v":75126},{"$f":"VLOOKUP($D$5,'[1]Allocation 2015-16 Final'!$A$7:$M$313,4,FALSE)","v":75126},{"$f":"VLOOKUP($D$5,'[1]Allocation 2014-15 Final'!$A$7:$M$304,4,FALSE)","v":75126}]
[]
[null,null,"Census Population Ages 5-17",{"$f":"VLOOKUP($D$5,'Allocation 2024-25 Prelim'!$A$7:$S$323,6,FALSE)","v":5915},{"$f":"VLOOKUP($D$5,'Allocation 2023-24 Final'!$A$7:$L$322,6,FALSE)","v":5998},{"$f":"VLOOKUP($D$5,'[1]Allocation 2022-23 P'!$A$7:$M$321,5,FALSE)","v":6040},{"$f":"VLOOKUP($D$5,'[2]Allocation 2021-22 Final'!$A$7:$U$321,5,FALSE)","v":5966},{"$f":"VLOOKUP($D$5,'[1]Allocation 2021-22 Preliminary'!$A$7:$M$321,5,FALSE)","v":5966},{"$f":"IFERROR(VLOOKUP($D$5,'[1]Allocation 2020-21 Final'!$A$7:$M$317,5,FALSE),0)","v":5983},{"$f":"IFERROR(VLOOKUP($D$5,'[1]Allocation 2020-21 Preliminary'!$A$7:$M$318,5,FALSE),0)","v":5983},{"$f":"IFERROR(VLOOKUP($D$5,'[1]Allocation 2019-20 Final'!$A$7:$M$314,5,FALSE),0)","v":5918},{"$f":"IFERROR(VLOOKUP($D$5,'[1]Allocation 2019-20 Preliminary'!$A$7:$M$316,5,FALSE),0)","v":5918},{"$f":"IFERROR(VLOOKUP($D$5,'[1]Allocation 2018-19 Final'!$A$7:$M$315,5,FALSE),0)","v":5859},{"$f":"VLOOKUP($D$5,'[1]Allocation 2017-18 2ndRev_Final'!$A$7:$M$315,5,FALSE)","v":5850},{"$f":"VLOOKUP($D$5,'[1]Allocation 2016-17 rev_Final'!$A$7:$M$314,5,FALSE)","v":5816},{"$f":"VLOOKUP($D$5,'[1]Allocation 2015-16 Final'!$A$7:$M$313,5,FALSE)","v":5755},{"$f":"VLOOKUP($D$5,'[1]Allocation 2014-15 Final'!$A$7:$M$304,5,FALSE)","v":5684}]
{"$rows_left_out":15}
{"sheet":"Allocation 2024-25 Prelim","index":1,"n_rows":322,"n_cols":29,"rows_kept":322,"cut":false,"hidden":true,"merged":[[0,1,0,2],[1,10,1,11],[3,27,3,28]]}
[null,"2024-25",null,null,null,null,null,null,null,null,{"$f":"IF(K5=Assumptions!$C$22+J5,\"Rounding OK\",\"Rounding Error = \"&FIXED(K5-Assumptions!$C$22-J5,TRUE))","v":"Rounding OK"},null,null,null,null,null,null,{"$f":"R5","v":0},{"$f":"IF(S5=Assumptions!$C22+R5,\"Rounding OK\",\"Rounding Error = \"&FIXED(S5-(Assumptions!$C22+R5),TRUE))","v":"Rounding OK"}]
[null,"ESEA -- Title 2 Distributions ",null,null,null,null,null,null,null,null,"Allocation including private participation",null,null,null,null,null,null,null,"\\"]
[1,2,3,4,5,6,7,8,9,10,null,12,13,14,15,16,17,18,19,null,18]
["CCDDD","LEAID","District Name","Eisenhower 2001-02 Allocations","Class Size Reduction Allocations 2001-02","Census Population Ages 5-17","20%  based on Total Pop","Census Poverty Ages 5-17","80% based on Low Inc Pop","MOE","Total Final Allocation",null,"Alloc to non-Census LEA","Realloc Pool","Realloc","Final Alloc Before MOE","MOE","MOE Reduction","Final Alloc",null,"Prior Year Allocation",null,null,null,"Rank Order",null,null,"do not delete Y & Z"]
[null,null,"State Totals",{"$f":"SUM(D7:D308)","v":0},{"$f":"SUM(E7:E308)","v":0},{"$f":"SUM(F7:F322)","v":1220024.0000000002},{"$f":"SUM(G7:G322)","v":6559349},{"$f":"SUM(H7:H322)","v":132429.00000000003},{"$f":"SUM(I7:I322)","v":26237405},null,{"$f":"SUM(K7:K322)","v":32796764},null,{"$f":"SUM(M7:M322)","v":0},{"$f":"SUM(N7:N322)","v":32796764},{"$f":"SUM(O7:O322)","v":0},{"$f":"SUM(P7:P322)","v":32796764},null,{"$f":"SUM(R7:R322)","v":0},{"$f":"SUM(S7:S322)","v":32796764},null,{"$f":"SUM(U7:U322)","v":33292231.489999998},null,{"$f":"SUM(W7:W320)","v":-499571.49},{"$f":"MIN(X7:X316)","v":-0.66962524654832345},{"$f":"\"Lose =  \"& PROPER(VLOOKUP(X5,$X$7:$AC$316,6,FALSE))","v":"Lose =  Steptoe"},null,null,{"$f":"+B5","v":0},{"$f":"+C5","v":"State Totals"}]
[null,null,null,null,null,null,null,null,null,null,null,null,null,null,null,null,null,null,null,null,null,null,null,{"$f":"MAX(X7:X309)","v":1.8801886792452831},{"$f":"\"Win =  \"&PROPER(VLOOKUP(X6,$X$7:$AC$309,6,FALSE))","v":"Win =  Starbuck"}]
[{"$f":"VLOOKUP(B7,CCDDD!$A$3:$B$319,2,FALSE)","v":"14005"},"5300030","ABERDEEN",0,0,{"$f":"VLOOKUP(B7,'24-25 Adjusted Formula counts'!$A$3:$L$320,8,FALSE)","v":3494},{"$f":"ROUND((F7/$F$5*Assumptions!$C$22*Assumptions!$C$30),0)","v":18785},{"$f":"VLOOKUP(B7,'24-25 Adjusted Formula counts'!$A$3:$L$320,9,FALSE)","v":804},{"$f":"ROUND((H7/$H$5*Assumptions!$C$22*Assumptions!$C$31),0)","v":159292},null,{"$f":"ROUNDDOWN(+I7+G7+E7+D7+J7,0)","v":178077},null,null,{"$f":"K7","v":178077},{"$f":"-ROUND(N7/$N$5*$M$5,0)","v":0},{"$f":"+K7+O7+M7","v":178077},null,{"$f":"-1*(P7*Q7)","v":0},{"$f":"+P7+R7","v":178077},null,{"$f":"IFERROR(VLOOKUP($A7, 'Allocation 2023-24 Final'!$A$7:$S$323,19,FALSE),0)","v":160843},null,{"$f":"+S7-U7","v":17234},{"$f":"IF(U7>0,W7/U7,0)","v":0.10714796416381192},{"$f":"RANK(W7,$W$7:$W$322,0)","v":24},{"$f":"(SUM(D7:E7)/S7)","v":0},null,{"$f":"+B7","v":"5300030"},"ABERDEEN"]
[{"$f":"VLOOKUP(B8,CCDDD!$A$3:$B$319,2,FALSE)","v":"21226"},"5300060","ADNA",0,0,{"$f":"VLOOKUP(B8,'24-25 Adjusted Formula counts'!$A$3:$L$320,8,FALSE)","v":737},{"$f":"ROUND((F8/$F$5*Assumptions!$C$22*Assumptions!$C$30),0)","v":3962},{"$f":"VLOOKUP(B8,'24-25 Adjusted Formula counts'!$A$3:$L$320,9,FALSE)","v":38},{"$f":"ROUND((H8/$H$5*Assumptions!$C$22*Assumptions!$C$31),0)","v":7529},null,11491,null,null,11491,0,{"$f":"+K8+O8+M9","v":11491},null,0,11491,null,{"$f":"IFERROR(VLOOKUP($A8, 'Allocation 2023-24 Final'!$A$7:$S$323,19,FALSE),0)","v":12328},null,-837,-6.7894224529526287E-2,{"$f":"RANK(W8,$W$7:$W$322,0)","v":167},0,null,"5300060","ADNA"]
[{"$f":"VLOOKUP(B9,CCDDD!$A$3:$B$319,2,FALSE)","v":"22017"},"5300090","ALMIRA",0,0,{"$f":"VLOOKUP(B9,'24-25 Adjusted Formula counts'!$A$3:$L$320,8,FALSE)","v":98},{"$f":"ROUND((F9/$F$5*Assumptions!$C$22*Assumptions!$C$30),0)","v":527},{"$f":"VLOOKUP(B9,'24-25 Adjusted Formula counts'!$A$3:$L$320,9,FALSE)","v":6},{"$f":"ROUND((H9/$H$5*Assumptions!$C$22*Assumptions!$C$31),0)","v":1189},null,1716,null,null,1716,0,{"$f":"+K9+O9+M10","v":1716},null,0,1716,null,{"$f":"IFERROR(VLOOKUP($A9, 'Allocation 2023-24 Final'!$A$7:$S$323,19,FALSE),0)","v":2069},null,-353,-0.17061382310294829,149,0,null,"5300090","ALMIRA"]
[{"$f":"VLOOKUP(B10,CCDDD!$A$3:$B$319,2,FALSE)","v":"29103"},"5300150","ANACORTES",0,0,{"$f":"VLOOKUP(B10,'24-25 Adjusted Formula counts'!$A$3:$L$320,8,FALSE)","v":2828},{"$f":"ROUND((F10/$F$5*Assumptions!$C$22*Assumptions!$C$30),0)","v":15204},{"$f":"VLOOKUP(B10,'24-25 Adjusted Formula counts'!$A$3:$L$320,9,FALSE)","v":255},{"$f":"ROUND((H10/$H$5*Assumptions!$C$22*Assumptions!$C$31),0)","v":50522},null,65726,null,null,65726,0,{"$f":"+K10+O10+M11","v":65726},null,0,65726,null,{"$f":"IFERROR(VLOOKUP($A10, 'Allocation 2023-24 Final'!$A$7:$S$323,19,FALSE),0)","v":70129},null,-4403,-6.2784297508876499E-2,230,0,null,"5300150","ANACORTES"]
{"$rows_left_out":313}
{"sheet":"24-25 Adjusted Formula counts","index":2,"n_rows":319,"n_cols":12,"rows_kept":319,"cut":false,"hidden":true,"merged":[]}
["Source: S:\\Apportionment_NEW\\Federal Funding & Allocations\\Federal progran allocation\\24-25\\Title I-A prelim\\Title IA 24-25-preliminary.xlsx, initial adjusted formula counts"]
["LEAID","LEANAME","SendingLEAid","NEG. adj","Adj DEL.","Adj Foster","Adj TANF","Adj - 5-17 pop","Adj poverty","Adj Total formula count","Total Formula Count DOE","Adj poverty percentage"]
["5300030","Aberdeen School District",null,0,null,25,0,3494,804,829,829,0.237263880938752]
["5300060","Adna School District",null,0,null,1,0,737,38,39,39,5.2917232021709601E-2]
["5300090","Almira School District",null,0,null,0,0,98,6,6,6,6.1224489795918401E-2]
["5300150","Anacortes School District",null,0,null,7,0,2828,255,262,262,9.2644978783592596E-2]
["5300240","Arlington School District",null,0,null,21,0,5915,554,575,575,9.7210481825866404E-2]
["5300280","Asotin-Anatone School District",null,0,null,0,0,493,48,48,48,9.7363083164300201E-2]
["5300300","Auburn School District",null,0,null,51,0,18293,2918,2969,2969,0.16230252008965201]
["5300330","Bainbridge Island School District",null,0,null,1,0,3975,141,142,142,3.57232704402516E-2]
{"$rows_left_out":310}
{"sheet":"Assumptions","index":3,"n_rows":55,"n_cols":39,"rows_kept":55,"cut":false,"hidden":true,"merged":[[0,0,0,17],[29,25,29,26],[30,25,30,26],[45,1,45,25]]}
["Assumptions and Factors — Title II Part A 2021-22 Final"]
[null,"Caution: Yellow Cells below are inputs into the calculations in this model"]
[null,"Section 2121","Preliminary","Final","Preliminary","Final","Preliminary","Final","Preliminary","Final","Preliminary","Final","Preliminary","Final","Preliminary","2nd Revised Final","Revised Final","Final","Preliminary","2nd Revised Final","Revised Final","Final","Preliminary","Final","Preliminary","Final","Preliminary","Final","Final","Re-Revised 012312","Revised","Final"]
[null,"Funding","2024-2025","2023-2024","2023-2024","2022-23","2022-23","2021-22","2021-22","2020-21","2020-21","2019-20","2019-20","2018-19","2018-19","2017-18","2017-18","2017-18","2017-18","2016-17","2016-17","2016-17","2016-17","2015-16","2015-16","2014-15","2014-15","2013-14","2012-13","2011-12","2011-12","2011-12","2010-11","2009-10","2008-09","2007-08","2006-07"]
[null,"Total State Allocation",35590627,35045173,35061559,34114260,33959443,34561891,34516008,33915395,33876016,34072983,34010371,33288630,33249165,33521152,33328186,33521152,33504996,36716833,36578861,36716833,36710950,37458839,36365865,37535132,37524189,37529639,39717936,39836692,39465046,39890148,47747805,48045249,48000430,47422445,47044832]
[null,"State Admin - Higher Ed",0,0,0,0,0,0,0,0,0,0,0,0,0,0,0,0,0,-57834,-57834,-57834,-57834,-57834,-57834,-57834,null,-57834,{"$f":"Z51","v":-57834},-57834,-57834,-57834,{"$f":"ROUNDDOWN(AG8*AD54*-1,0)","v":-59087},{"$f":"ROUNDDOWN(AH8*AE54*-1,0)","v":-59456}]
[null,"State Admin - OSPI",0,0,0,0,0,0,0,0,0,0,0,0,0,0,0,0,0,-309334,-307954,-309334,{"$f":"W8-W6","v":-309276},{"$f":"X8-X6","v":-316754},-317373,-317517,null,-317462,-339345,-340532,-336816,-341067,{"$f":"ROUNDUP(AG8*AD55*-1,0)","v":-418391},{"$f":"ROUNDUP(AH8*AE55*-1,0)","v":-420996}]
["Note below","Total reserve for State Admin 1%",{"$f":"ROUND(-C5*0.01,0)","v":-355906},-350452,-350616,{"$f":"ROUND(-F5*0.01,0)","v":-341143},-339594,-345619,-345160,-339154,-338760,-340730,-340104,-332886,-332492,-335212,-333282,-335212,-335050,-367168,-365789,-367168,-367110,-374588,-363659,-375351,-375242,-375296,-397179,{"$f":"ROUND(-AD5*0.01,0)+1","v":-398366},{"$f":"ROUND(-AE5*0.01,0)","v":-394650},{"$f":"ROUND(-AF5*0.01,0)","v":-398901},{"$f":"ROUND(-AG5*0.01,0)","v":-477478},{"$f":"ROUND(-AH5*0.01,0)","v":-480452},{"$f":"ROUND(-AI5*0.01,0)","v":-480004},-474224,-470448]
[null,"       Subtotal",{"$f":"+C8+C5","v":35234721},34694721,34710943,{"$f":"+F8+F5","v":33773117},33619849,34216272,34170848,33576241,33537256,33732253,33670267,32955744,32916673,33185940,32994904,33185940,33169946,36349665,36213072,36349665,36343840,37084251,36002206,37159781,37148947,37154343,39320757,39438326,39070396,39491247,47270327,47564797,47520426,46948221,46574384]
[2.5000000000000001E-2,"Reserve for SAHE (Subgrants)",null,null,null,null,null,null,null,null,null,null,null,null,0,0,0,0,0,{"$f":"ROUND(-T9*$A10,0)","v":-908742},{"$f":"ROUND(-U9*$A10,0)","v":-905327},{"$f":"ROUND(-V9*$A10,0)","v":-908742},{"$f":"ROUND(-W9*$A10,0)","v":-908596},-927106,{"$f":"ROUND(-Y9*$A10,0)","v":-900055},{"$f":"ROUND(-Z9*$A10,0)","v":-928995},{"$f":"ROUND(-AA9*$A10,0)","v":-928724},{"$f":"ROUND(-AB9*$A10,0)","v":-928859},-983019,{"$f":"ROUND(-AD9*$A10,0)","v":-985958},-976760,-987281,-1181758,-1189120,-1188011,-1173706,-1164360]
{"$rows_left_out":46}
{"sheet":"Allocation 2023-24 Final","index":4,"n_rows":322,"n_cols":29,"rows_kept":322,"cut":false,"hidden":true,"merged":[[0,1,0,2],[1,10,1,11],[3,27,3,28]]}
[null,"2023-24",null,null,null,null,null,null,null,null,{"$f":"IF(K5=Assumptions!$D$14+J5,\"Rounding OK\",\"Rounding Error = \"&FIXED(K5-Assumptions!$D$14-J5,TRUE))","v":"Rounding OK"},null,null,null,null,null,null,{"$f":"R5","v":-682.51},{"$f":"IF(S5=Assumptions!$D14+R5,\"Rounding OK\",\"Rounding Error = \"&FIXED(S5-(Assumptions!$D14+R5),TRUE))","v":"Rounding OK"}]
[null,"ESEA -- Title 2 Distributions ",null,null,null,null,null,null,null,null,"Allocation including private participation",null,null,null,null,null,null,null,"\\"]
[1,2,3,4,5,6,7,8,9,10,null,12,13,14,15,16,17,18,19,null,18]
["CCDDD","LEAID","District Name","Eisenhower 2001-02 Allocations","Class Size Reduction Allocations 2001-02","Census Population Ages 5-17","20%  based on Total Pop","Census Poverty Ages 5-17","80% based on Low Inc Pop","MOE","Total Final Allocation",null,"Alloc to non-Census LEA","Realloc Pool","Realloc","Final Alloc Before MOE","MOE","MOE Reduction","Final Alloc",null,"Prior Year Allocation",null,null,null,"Rank Order",null,null,"do not delete Y & Z"]
[null,null,"State Totals",{"$f":"SUM(D7:D308)","v":0},{"$f":"SUM(E7:E308)","v":0},{"$f":"SUM(F7:F322)","v":1240828.0900243395},{"$f":"SUM(G7:G322)","v":6658588},{"$f":"SUM(H7:H322)","v":136700.56195772006},{"$f":"SUM(I7:I322)","v":26634335},null,{"$f":"SUM(K7:K322)","v":33292914},null,{"$f":"SUM(M7:M322)","v":0},{"$f":"SUM(N7:N322)","v":33292914},{"$f":"SUM(O7:O322)","v":0},{"$f":"SUM(P7:P322)","v":33292914},null,{"$f":"SUM(R7:R322)","v":-682.51},{"$f":"SUM(S7:S322)","v":33292231.489999998},null,{"$f":"SUM(U7:U322)","v":0},null,{"$f":"SUM(W7:W320)","v":33283493.489999998},{"$f":"MIN(X7:X316)","v":0},{"$f":"\"Lose =  \"& PROPER(VLOOKUP(X5,$X$7:$AC$316,6,FALSE))","v":"Lose =  Aberdeen"},null,null,{"$f":"+B5","v":0},{"$f":"+C5","v":"State Totals"}]
[null,null,null,null,null,null,null,null,null,null,null,null,null,null,null,null,null,null,null,null,null,null,null,{"$f":"MAX(X7:X309)","v":0},{"$f":"\"Win =  \"&PROPER(VLOOKUP(X6,$X$7:$AC$309,6,FALSE))","v":"Win =  Aberdeen"}]
[{"$f":"VLOOKUP(B7,CCDDD!$A$3:$B$319,2,FALSE)","v":"14005"},"5300030","ABERDEEN",0,0,{"$f":"VLOOKUP(B7,'23-24 Adjusted Formula counts'!$A$2:$L$319,8,FALSE)","v":3541},{"$f":"ROUND((F7/$F$5*Assumptions!$D$14*Assumptions!$D$30),0)","v":19002},{"$f":"VLOOKUP(B7,'23-24 Adjusted Formula counts'!$A$2:$L$319,9,FALSE)","v":728},{"$f":"ROUND((H7/$H$5*Assumptions!$D$14*Assumptions!$D$31),0)","v":141841},null,{"$f":"ROUNDDOWN(+I7+G7+E7+D7+J7,0)","v":160843},null,null,{"$f":"K7","v":160843},{"$f":"-ROUND(N7/$N$5*$M$5,0)","v":0},{"$f":"+K7+O7+M7","v":160843},null,{"$f":"-1*(P7*Q7)","v":0},{"$f":"+P7+R7","v":160843},null,{"$f":"IFERROR(VLOOKUP($A7,#REF!, 21,FALSE),0)","v":0},null,{"$f":"+S7-U7","v":160843},{"$f":"IF(U7>0,W7/U7,0)","v":0},{"$f":"RANK(W7,$W$7:$W$322,0)","v":57},{"$f":"(SUM(D7:E7)/S7)","v":0},null,{"$f":"+B7","v":"5300030"},{"$f":"+C7","v":"ABERDEEN"}]
[{"$f":"VLOOKUP(B8,CCDDD!$A$3:$B$319,2,FALSE)","v":"21226"},"5300060","ADNA",0,0,{"$f":"VLOOKUP(B8,'23-24 Adjusted Formula counts'!$A$2:$L$319,8,FALSE)","v":736},{"$f":"ROUND((F8/$F$5*Assumptions!$D$14*Assumptions!$D$30),0)","v":3950},{"$f":"VLOOKUP(B8,'23-24 Adjusted Formula counts'!$A$2:$L$319,9,FALSE)","v":43},{"$f":"ROUND((H8/$H$5*Assumptions!$D$14*Assumptions!$D$31),0)","v":8378},null,12328,null,null,12328,0,{"$f":"+K8+O8+M9","v":12328},null,0,12328,null,{"$f":"IFERROR(VLOOKUP($A8,#REF!, 21,FALSE),0)","v":0},null,12328,0,{"$f":"RANK(W8,$W$7:$W$322,0)","v":221},0,null,"5300060","ADNA"]
[{"$f":"VLOOKUP(B9,CCDDD!$A$3:$B$319,2,FALSE)","v":"22017"},"5300090","ALMIRA",0,0,{"$f":"VLOOKUP(B9,'23-24 Adjusted Formula counts'!$A$2:$L$319,8,FALSE)","v":95},{"$f":"ROUND((F9/$F$5*Assumptions!$D$14*Assumptions!$D$30),0)","v":510},{"$f":"VLOOKUP(B9,'23-24 Adjusted Formula counts'!$A$2:$L$319,9,FALSE)","v":8},{"$f":"ROUND((H9/$H$5*Assumptions!$D$14*Assumptions!$D$31),0)","v":1559},null,2069,null,null,2069,0,{"$f":"+K9+O9+M10","v":2069},null,0,2069,null,{"$f":"IFERROR(VLOOKUP($A9,#REF!, 21,FALSE),0)","v":0},null,2069,0,300,0,null,"5300090","ALMIRA"]
[{"$f":"VLOOKUP(B10,CCDDD!$A$3:$B$319,2,FALSE)","v":"29103"},"5300150","ANACORTES",0,0,{"$f":"VLOOKUP(B10,'23-24 Adjusted Formula counts'!$A$2:$L$319,8,FALSE)","v":2866},{"$f":"ROUND((F10/$F$5*Assumptions!$D$14*Assumptions!$D$30),0)","v":15380},{"$f":"VLOOKUP(B10,'23-24 Adjusted Formula counts'!$A$2:$L$319,9,FALSE)","v":281},{"$f":"ROUND((H10/$H$5*Assumptions!$D$14*Assumptions!$D$31),0)","v":54749},null,70129,null,null,70129,0,{"$f":"+K10+O10+M11","v":70129},null,0,70129,null,{"$f":"IFERROR(VLOOKUP($A10,#REF!, 21,FALSE),0)","v":0},null,70129,0,103,0,null,"5300150","ANACORTES"]
{"$rows_left_out":313}
{"sheet":"23-24 Adjusted Formula counts","index":5,"n_rows":319,"n_cols":12,"rows_kept":319,"cut":false,"hidden":true,"merged":[]}
["Source: S:\\Apportionment\\Apport\\Federal Program Alloc\\23-24\\Title I-A Final\\Title IA 23-24 Final (New model).xlsx, initial adjusted formula counts"]
["LEAID","LEANAME","SendingLEAid","NEG. adj","Adj DEL.","Adj Foster","Adj TANF","Adj - 5-17 pop","Adj poverty","Adj Total formula count","Total Formula Count DOE","Adj poverty percentage"]
["5300030","Aberdeen School District",null,0,null,25,0,3541,728,753,753,0.21265179327873501]
["5300060","Adna School District",null,0,null,1,0,736,43,44,44,5.9782608695652197E-2]
["5300090","Almira School District",null,0,null,0,0,95,8,8,8,8.42105263157895E-2]
["5300150","Anacortes School District",null,0,null,7,0,2866,281,288,288,0.100488485694348]
["5300240","Arlington School District",null,0,null,21,0,5998,465,486,486,8.1027009003000999E-2]
["5300280","Asotin-Anatone School District",null,0,null,0,0,508,64,64,64,0.12598425196850399]
["5300300","Auburn School District",null,0,null,51,0,18711,2786,2837,2837,0.15162204051092901]
["5300330","Bainbridge Island School District",null,0,null,1,0,4038,159,160,160,3.9623576027736501E-2]
{"$rows_left_out":310}
{"sheet":"CCDDD","index":6,"n_rows":319,"n_cols":7,"rows_kept":319,"cut":false,"hidden":true,"merged":[]}
[]
["Fed Code","CCDDD","Fed Code","District","Fed Code"]
[{"$f":"C3","v":"5300030"},"14005","5300030","ABERDEEN",{"$f":"C3","v":"5300030"},{"$f":"B3","v":"14005"},{"$f":"TEXT(C3,\"0000000\")","v":"5300030"}]
[{"$f":"C4","v":"5300060"},"21226","5300060","ADNA",{"$f":"C4","v":"5300060"},{"$f":"B4","v":"21226"},{"$f":"TEXT(C4,\"0000000\")","v":"5300060"}]
["5300090","22017","5300090","ALMIRA","5300090","22017","5300090"]
["5300150","29103","5300150","ANACORTES","5300150","29103","5300150"]
["5300240","31016","5300240","ARLINGTON","5300240","31016","5300240"]
["5300280","02420","5300280","ASOTIN-ANATONE","5300280","02420","5300280"]
["5300300","17408","5300300","AUBURN","5300300","17408","5300300"]
["5300330","18303","5300330","BAINBRIDGE ISLAND","5300330","18303","5300330"]
{"$rows_left_out":309}