{"text_format":"1","workbook":"xlsx","n_sheets":8,"sheets":["District","2024-25 Final","Assumptions","Enrollment","Rural and Low Income 24-25","other funds ftr 2023","CCDDD","2023-24 Final"],"not_rendered":{"charts":0,"images":0,"macros":1,"external_links":6,"defined_names":126,"comments":1,"pivot_tables":0},"unopened":[],"bounds":{"document_bytes":16777216,"sheet_cells":100000,"rows_first":2000,"rows_last":500,"rows_between":2000,"halvings":0,"cell_chars":16384,"cell_head_chars":4096},"cells_cut":0,"cells_raw":0,"read":"whole","date_system":"1900"}

{"sheet":"District","index":0,"n_rows":83,"n_cols":32,"rows_kept":83,"cut":false,"hidden":false,"merged":[[2,20,2,21],[6,5,7,5],[8,5,9,5],[10,5,11,5],[12,2,15,2],[12,5,13,5],[14,5,15,5],[2,10,2,11],[2,12,2,13],[2,14,2,15],[2,16,2,17],[2,18,2,19],[16,2,19,2],[16,5,17,5],[18,5,19,5],[20,2,23,2],[20,5,21,5],[22,5,23,5],[27,14,28,15],[30,14,30,15],[30,16,30,17],[32,5,34,5],[1,6,1,9],[2,7,2,8]]}
[null,null,null,null,null,null,null,null,null,null,null,null,null,null,null,null,null,null,null,null,null,null,null,null,"Do Not",null,null,null,null,null,null,"Aberdeen"]
[null,null,null,null,null,"District Name","ABERDEEN",null,null,null,"<- Please select distrtict from this drop-down",null,null,null,null,null,null,null,null,null,null,null,null," <<- Please Select District From Drop Down","Change",null,null,null,null,null,null,"Brewster"]
[null,null,null,null,null,"CCDDD",{"$f":"VLOOKUP(G2,CCDDD!B:C,2,0)","v":"14005"},"2024-2025",null,"2022-23","2021-22",null,"2020-21",null,"2011-12",null,"2010-11",null,"2009-10",null,"2008-09",null,"2007-08",null,null,null,null,null,null,null,null,"Bridgeport"]
[null,null,null,null,null,null,null,null,null,null,null,null,null,null,null,null,null,null,null,null,null,"%%",null,null,null,null,null,null,null,null,null,"Burlington"]
[null,null,null,null,null,null,null,"Prelim 2024-2025","% of PY","Final 23-24","Final 2021-22","% of PY","Final 2020-21",null,"Prelim 2011-12","% of PY","Final 2010-11","% of PY","Final 2009-10","% of PY","Final 2008-09","of Prior Year","2007-08",null,null,null,null,null,null,null,null,"Cascade"]
[null,null,null,null,null,"Regular Allocation",null,null,null,null,null,null,null,null,null,null,null,null,null,null,null,null,null,null,null,null,null,null,null,null,null,"Cashmere"]
[null,2,null,null,null,"K-12 Migrant Students","Average Number",{"$f":"IFERROR(VLOOKUP($G$3,'2024-25 Final'!$B$19:$AA$156,4,0),0)","v":128},{"$f":"H7/J7","v":1.1228070175438596},{"$f":"IFERROR(VLOOKUP($G$3,'2023-24 Final'!$B$19:$Z$156,4,0),0)","v":114},338,{"$f":"IFERROR(K7/M7-1,0)","v":0.13043478260869557},299,null,{"$f":"VLOOKUP($G$2,#REF!,$B7,FALSE)","v":{"$error":"#REF!"}},{"$f":"IF(Q7=0,0,O7/Q7)","v":{"$error":"#REF!"}},{"$f":"VLOOKUP($G$2,#REF!,$B7,FALSE)","v":{"$error":"#REF!"}},{"$f":"IF(S7>0,Q7/S7,\"-\")","v":{"$error":"#REF!"}},{"$f":"VLOOKUP($G$2,#REF!,$B7,FALSE)","v":{"$error":"#REF!"}},{"$f":"IF(U7>0,S7/U7,\"-\")","v":{"$error":"#REF!"}},{"$f":"VLOOKUP($G$2,#REF!,$B7,FALSE)","v":{"$error":"#REF!"}},{"$f":"IF(W7>0,U7/W7,\"-\")","v":{"$error":"#REF!"}},{"$f":"VLOOKUP($G$2,#REF!,$B7,FALSE)","v":{"$error":"#REF!"}},null,1,3,null,null,null,null,null,"Centralia"]
[null,3,null,null,null,null,"Regular Dollars",{"$f":"IFERROR(VLOOKUP($G$3,'2024-25 Final'!$B$19:$AA$156,5,0),0)","v":58300},1.2853300410070991,{"$f":"IFERROR(VLOOKUP($G$3,'2023-24 Final'!$B$19:$Z$156,5,0),0)","v":45358},159039,0.3281029486676299,119749,null,{"$f":"VLOOKUP($G$2,#REF!,$B8,FALSE)","v":{"$error":"#REF!"}},{"$error":"#REF!"},{"$f":"VLOOKUP($G$2,#REF!,$B8,FALSE)","v":{"$error":"#REF!"}},{"$f":"IF(S8>0,Q8/S8,\"-\")","v":{"$error":"#REF!"}},{"$f":"VLOOKUP($G$2,#REF!,$B8,FALSE)","v":{"$error":"#REF!"}},{"$f":"IF(U8>0,S8/U8,\"-\")","v":{"$error":"#REF!"}},{"$f":"VLOOKUP($G$2,#REF!,$B8,FALSE)","v":{"$error":"#REF!"}},{"$error":"#REF!"},{"$f":"VLOOKUP($G$2,#REF!,$B8,FALSE)","v":{"$error":"#REF!"}},null,2,3,null,null,null,null,null,"College Place"]
[null,4,null,null,null,"Needs Support","Average Number",{"$f":"IFERROR(VLOOKUP($G$3,'2024-25 Final'!$B$19:$AA$156,6,0),0)","v":37},0.97368421052631582,{"$f":"IFERROR(VLOOKUP($G$3,'2023-24 Final'!$B$19:$Z$156,6,0),0)","v":38},59,-1.6666666666666718E-2,60,null,{"$f":"VLOOKUP($G$2,#REF!,$B9,FALSE)","v":{"$error":"#REF!"}},{"$f":"IF(Q9=0,0,O9/Q9)","v":{"$error":"#REF!"}},{"$f":"VLOOKUP($G$2,#REF!,$B9,FALSE)","v":{"$error":"#REF!"}},{"$error":"#REF!"},{"$f":"VLOOKUP($G$2,#REF!,$B9,FALSE)","v":{"$error":"#REF!"}},{"$error":"#REF!"},{"$f":"VLOOKUP($G$2,#REF!,$B9,FALSE)","v":{"$error":"#REF!"}},{"$error":"#REF!"},{"$f":"VLOOKUP($G$2,#REF!,$B9,FALSE)","v":{"$error":"#REF!"}},null,1,4,null,null,null,null,null,"Columbia"]
[null,5,null,null,null,null,"Regular Dollars",{"$f":"IFERROR(VLOOKUP($G$3,'2024-25 Final'!$B$19:$AA$156,7,0),0)","v":4213},1.1145502645502645,{"$f":"IFERROR(VLOOKUP($G$3,'2023-24 Final'!$B$19:$Z$156,7,0),0)","v":3780},6940,0.15531879473947052,6007,null,{"$f":"VLOOKUP($G$2,#REF!,$B10,FALSE)","v":{"$error":"#REF!"}},{"$f":"IF(Q10=0,0,O10/Q10)","v":{"$error":"#REF!"}},{"$f":"VLOOKUP($G$2,#REF!,$B10,FALSE)","v":{"$error":"#REF!"}},{"$error":"#REF!"},{"$f":"VLOOKUP($G$2,#REF!,$B10,FALSE)","v":{"$error":"#REF!"}},{"$error":"#REF!"},{"$f":"VLOOKUP($G$2,#REF!,$B10,FALSE)","v":{"$error":"#REF!"}},{"$error":"#REF!"},{"$f":"VLOOKUP($G$2,#REF!,$B10,FALSE)","v":{"$error":"#REF!"}},null,2,4,null,null,null,null,null,"Conway"]
{"$rows_left_out":74}
{"sheet":"2024-25 Final","index":1,"n_rows":164,"n_cols":27,"rows_kept":164,"cut":false,"hidden":true,"merged":[[1,3,1,6],[13,4,13,7],[14,4,14,5],[14,6,14,7],[14,8,14,9]]}
[null,null,null,null,null,null,null,null,null,"From Assumptions Page:"]
[null,null,null,"Constant Dollar Multipliers - Do Not Change Here",null,null,null,null,null,"Target Amounts",null,null,null,null,{"$f":"Assumptions!C24","v":22016123}]
[null,null,null,0,null,2.0369691980863958E+66,455.471309402006,"Use CTRL K",null,"Actual Amounts",null,null,null,null,{"$f":"O18","v":22016123}]
[null,null,null,null,null,null,null,null,null,"Difference",null,null,null,null,{"$f":"O3-O2","v":0}]
[]
[null,null,null,null,null,null,null,null,null,22016123]
[null,null,null,null,null,null,null,"Put total here",null,{"$f":"Assumptions!C24","v":22016123}]
[]
[]
[null,null,null,null,null,null,null,null,null,"Go to H9 & Control K to set dollar amount"]
{"$rows_left_out":155}
{"sheet":"Assumptions","index":2,"n_rows":60,"n_cols":38,"rows_kept":60,"cut":false,"hidden":true,"merged":[[6,35,21,35]]}
["Assumptions and Factors — Title I Part C Migrant - Final"]
[null,"Caution: Yellow Cells below drive are inputs into the calculations in this model"]
[null,null,null,null,null,null,null,null,null,null,null,null,null,null,null,null,null,null,null,null,null,null,null,null,null,null,null,null,null,null,null,null,null,null,null,null,null,"Row Headings on Allocation Table"]
["Funding",null,"Final 2024-25","Preliminary 2024-25","FINAL 2023-24","Preliminary 2023-24","Final 2022-23","Preliminary 2022-23","Final 2021-22","Preliminary 2021-22","Final 2020-21","Preliminary 2020-21","Final 2019-20","Preliminary 2019-20","Final 2018-19","Preliminary 2018-19","Final 2017-18","Preliminary 2017-18","2nd Rev Final 2016-17","Rev Final 2016-17","Final 2016-17","Final 2015-16","Preliminary 2015-16","Final 2014-15","Preliminary 2014-15","Revised Final 2013-14","Final 2013-14","Final 2012-13","Preliminary 2012-13","Final 2011-12","Preliminary \n2011-12","Final\n2010-11","Final 2009-10","Final 2008-09","Source: "]
[null,"Total State Allocation",37992820,"37,838,194",38616843,38616843,38126160,"38,168,234",36172055,36170767,33650164,32545772,29253692,28509499,27865765,26740196,24667573,24540413,14921087,14921087,14921087,14921087,14875015,14875015,14875015,14839257,14839257,15628872,15628872,15659257,15659257,15691456,14450894,15015291]
[null,"State Allocation under $14B rule",27985938,27866779,28466965,28448427,29491607,29524149,29680217,29680217,28007581,32545800,23817704,23834846,21267203,21267203,13112612,13104377,13566765,13616032,13566765,14077428,14055099,14085411,14041918,14645076,14645076,14620622,14620622,14680941,14680941,14980942]
["General Admin","State Admin",{"$f":"ROUND(C6*0.01,0)","v":279859},{"$f":"ROUND(D6*0.01,0)","v":278668},{"$f":"ROUND(E6*0.01,0)","v":284670},284484,294916,295241,296802,296802,280076,325458,{"$f":"ROUND(M6*0.01,0)","v":238177},238348,212672,212672,131126,131044,135668,136160,135668,140774,140551,140854,140419,146451,{"$f":"ROUND(AA6*0.01,0)","v":146451},{"$f":"ROUND(AB6*0.01,0)","v":146206},{"$f":"ROUND(AC6*0.01,0)","v":146206},{"$f":"ROUND(AD6*0.01,0)","v":146809},{"$f":"ROUND(14680941*0.01,0)","v":146809},{"$f":"ROUND(14680942*0.01,0)","v":146809},{"$f":"ROUND(13563693*0.01,0)","v":135637},{"$f":"ROUND(14649429*0.01,0)","v":146494},0.01]
[null,"State Level Activities (Unallocated Balance)",{"$f":"C5-C7-C18-C24","v":13417269},{"$f":"D5-D7-D18-D24","v":13356610},{"$f":"E5-E7-E18-E24","v":15061378},15162254,14955548,14972053,13087588,13086382,13179990,{"$f":"L5-L7-L18-L24","v":12692851},10935689,11551691,11233633,10783406,9920983,12702535,3078585,3078093,4570694,2999662,2953813,3913523,2273028,14692806,14692806,15482666,15482666,15512448,15512448,15544647,14315257,536592]
[]
["Other Admin","Director salary"]
{"$rows_left_out":51}
{"sheet":"Enrollment","index":3,"n_rows":147,"n_cols":11,"rows_kept":147,"cut":false,"hidden":true,"merged":[]}
["CO_DIST_NUM","DIST_TITLE","MSDR_ID","ESD","STUDENTS","NEEDY","PRIORITY"]
["14005","ABERDEEN","WAABER",189,128,37,59,null,null,null,{"$f":"TEXT(A2, \"00000\")","v":"14005"}]
["29103","ANACORTES","WAANAC",189,16,2,11,null,null,null,{"$f":"TEXT(A3, \"00000\")","v":"29103"}]
["31016","ARLINGTON","WAARLI",189,43,12,30,null,null,null,"31016"]
["17408","AUBURN","WAAURN",189,34,5,23,null,null,null,"17408"]
["06119","BATTLE GROUND","WABATT",189,25,11,12,null,null,null,"06119"]
["17405","BELLEVUE","WABELV",189,10,4,6,null,null,null,"17405"]
["37501","BELLINGHAM","WABELH",189,106,34,57,null,null,null,"37501"]
["27403","BETHEL","WABETH",189,22,9,12,null,null,null,"27403"]
["18100","BREMERTON","WABREM",189,54,14,36,null,null,null,"18100"]
{"$rows_left_out":138}
{"sheet":"Rural and Low Income 24-25","index":4,"n_rows":141,"n_cols":4,"rows_kept":141,"cut":false,"hidden":true,"merged":[]}
["CoDis","Local Education Agency (LEA)",null,"Ask Tony May for the list of current year REAP amd RLIS districts"]
["13146","Warden School District"]
["25118","South Bend School District"]
["01109","Washtucna School District"]
["01122","Benge School District"]
["01158","Lind School District"]
["01160","Ritzville School District"]
["02420","Asotin-Anatone School District"]
["03050","Paterson School District"]
["04019","Manson School District"]
{"$rows_left_out":132}
{"sheet":"other funds ftr 2023","index":5,"n_rows":147,"n_cols":9,"rows_kept":147,"cut":false,"hidden":true,"merged":[]}
["CCDDD","Migrant Districts","Title III 22-23","Title I A 22-23","LAP 22-23","TBIP 22-23","Title I C 22-23","other funds as % of Revs","\"Other Funds\" Factor"]
["14005","ABERDEEN",{"$f":"IFERROR(VLOOKUP(A2,'[2]Allocations 2023-24'!$B$9:$AC$326,20,FALSE),0)","v":70178},{"$f":"IFERROR(VLOOKUP(A2,'[3]State Reservations'!$C$4:$AE$328,29,FALSE),0)","v":1488763.6166806188},{"$f":"IFERROR(VLOOKUP(A2,[4]Sheet1!$A$3:$D$379,3,FALSE),0)","v":2365860.29},{"$f":"IFERROR(VLOOKUP(A2,[4]Sheet1!$A$3:$D$379,4,FALSE),0)","v":750457.29},{"$f":"IFERROR(VLOOKUP(A2,'[5]2023-24 Final'!$B$19:$S$156,18,FALSE),0)","v":67521},{"$f":"IF(G2=0,0,(SUM(C2:F2)/SUM(C2:G2)))","v":0.98576341360975217},{"$f":"_xlfn.IFS(H2=0%,0,'other funds ftr 2023'!H2<Assumptions!$E$57,Assumptions!$B$57,'other funds ftr 2023'!H2<Assumptions!$E$58,Assumptions!$B$58,'other funds ftr 2023'!H2<=Assumptions!$E$59,Assumptions!$B$59,'other funds ftr 2023'!H2<=Assumptions!$E$60,Assumptions!$B$60)","v":0.95}]
["29103","ANACORTES",{"$f":"IFERROR(VLOOKUP(A3,'[2]Allocations 2023-24'!$B$9:$AC$326,20,FALSE),0)","v":0},{"$f":"IFERROR(VLOOKUP(A3,'[3]State Reservations'!$C$4:$AE$328,29,FALSE),0)","v":443268.4706631907},{"$f":"IFERROR(VLOOKUP(A3,[4]Sheet1!$A$3:$D$379,3,FALSE),0)","v":632190.82999999996},{"$f":"IFERROR(VLOOKUP(A3,[4]Sheet1!$A$3:$D$379,4,FALSE),0)","v":119993.18},{"$f":"IFERROR(VLOOKUP(A3,'[5]2023-24 Final'!$B$19:$S$156,18,FALSE),0)","v":8356},0.99305869651674439,{"$f":"_xlfn.IFS(H3=0%,0,'other funds ftr 2023'!H3<Assumptions!$E$57,Assumptions!$B$57,'other funds ftr 2023'!H3<Assumptions!$E$58,Assumptions!$B$58,'other funds ftr 2023'!H3<=Assumptions!$E$59,Assumptions!$B$59,'other funds ftr 2023'!H3<=Assumptions!$E$60,Assumptions!$B$60)","v":0.95}]
["31016","ARLINGTON",{"$f":"IFERROR(VLOOKUP(A4,'[2]Allocations 2023-24'!$B$9:$AC$326,20,FALSE),0)","v":46187},{"$f":"IFERROR(VLOOKUP(A4,'[3]State Reservations'!$C$4:$AE$328,29,FALSE),0)","v":748015.54424413445},{"$f":"IFERROR(VLOOKUP(A4,[4]Sheet1!$A$3:$D$379,3,FALSE),0)","v":1574889.53},{"$f":"IFERROR(VLOOKUP(A4,[4]Sheet1!$A$3:$D$379,4,FALSE),0)","v":637210.68000000005},{"$f":"IFERROR(VLOOKUP(A4,'[5]2023-24 Final'!$B$19:$S$156,18,FALSE),0)","v":0},0,{"$f":"_xlfn.IFS(H4=0%,0,'other funds ftr 2023'!H4<Assumptions!$E$57,Assumptions!$B$57,'other funds ftr 2023'!H4<Assumptions!$E$58,Assumptions!$B$58,'other funds ftr 2023'!H4<=Assumptions!$E$59,Assumptions!$B$59,'other funds ftr 2023'!H4<=Assumptions!$E$60,Assumptions!$B$60)","v":0}]
["17408","AUBURN",{"$f":"IFERROR(VLOOKUP(A5,'[2]Allocations 2023-24'!$B$9:$AC$326,20,FALSE),0)","v":664936},{"$f":"IFERROR(VLOOKUP(A5,'[3]State Reservations'!$C$4:$AE$328,29,FALSE),0)","v":6019160.810362963},{"$f":"IFERROR(VLOOKUP(A5,[4]Sheet1!$A$3:$D$379,3,FALSE),0)","v":11605143.449999999},{"$f":"IFERROR(VLOOKUP(A5,[4]Sheet1!$A$3:$D$379,4,FALSE),0)","v":9226404.2699999996},{"$f":"IFERROR(VLOOKUP(A5,'[5]2023-24 Final'!$B$19:$S$156,18,FALSE),0)","v":26459},0.99903932537430085,{"$f":"_xlfn.IFS(H5=0%,0,'other funds ftr 2023'!H5<Assumptions!$E$57,Assumptions!$B$57,'other funds ftr 2023'!H5<Assumptions!$E$58,Assumptions!$B$58,'other funds ftr 2023'!H5<=Assumptions!$E$59,Assumptions!$B$59,'other funds ftr 2023'!H5<=Assumptions!$E$60,Assumptions!$B$60)","v":0.95}]
["06119","BATTLE GROUND",{"$f":"IFERROR(VLOOKUP(A6,'[2]Allocations 2023-24'!$B$9:$AC$326,20,FALSE),0)","v":152512},{"$f":"IFERROR(VLOOKUP(A6,'[3]State Reservations'!$C$4:$AE$328,29,FALSE),0)","v":1916487.172334651},{"$f":"IFERROR(VLOOKUP(A6,[4]Sheet1!$A$3:$D$379,3,FALSE),0)","v":3273032.78},{"$f":"IFERROR(VLOOKUP(A6,[4]Sheet1!$A$3:$D$379,4,FALSE),0)","v":2270199.0099999998},{"$f":"IFERROR(VLOOKUP(A6,'[5]2023-24 Final'!$B$19:$S$156,18,FALSE),0)","v":0},0,{"$f":"_xlfn.IFS(H6=0%,0,'other funds ftr 2023'!H6<Assumptions!$E$57,Assumptions!$B$57,'other funds ftr 2023'!H6<Assumptions!$E$58,Assumptions!$B$58,'other funds ftr 2023'!H6<=Assumptions!$E$59,Assumptions!$B$59,'other funds ftr 2023'!H6<=Assumptions!$E$60,Assumptions!$B$60)","v":0}]
["17405","BELLEVUE",{"$f":"IFERROR(VLOOKUP(A7,'[2]Allocations 2023-24'!$B$9:$AC$326,20,FALSE),0)","v":441184},{"$f":"IFERROR(VLOOKUP(A7,'[3]State Reservations'!$C$4:$AE$328,29,FALSE),0)","v":2855318.4568691906},{"$f":"IFERROR(VLOOKUP(A7,[4]Sheet1!$A$3:$D$379,3,FALSE),0)","v":3359491.53},{"$f":"IFERROR(VLOOKUP(A7,[4]Sheet1!$A$3:$D$379,4,FALSE),0)","v":7058559.0199999996},{"$f":"IFERROR(VLOOKUP(A7,'[5]2023-24 Final'!$B$19:$S$156,18,FALSE),0)","v":0},0,{"$f":"_xlfn.IFS(H7=0%,0,'other funds ftr 2023'!H7<Assumptions!$E$57,Assumptions!$B$57,'other funds ftr 2023'!H7<Assumptions!$E$58,Assumptions!$B$58,'other funds ftr 2023'!H7<=Assumptions!$E$59,Assumptions!$B$59,'other funds ftr 2023'!H7<=Assumptions!$E$60,Assumptions!$B$60)","v":0}]
["37501","BELLINGHAM",{"$f":"IFERROR(VLOOKUP(A8,'[2]Allocations 2023-24'!$B$9:$AC$326,20,FALSE),0)","v":129950},{"$f":"IFERROR(VLOOKUP(A8,'[3]State Reservations'!$C$4:$AE$328,29,FALSE),0)","v":3226284.028935092},{"$f":"IFERROR(VLOOKUP(A8,[4]Sheet1!$A$3:$D$379,3,FALSE),0)","v":3634033.15},{"$f":"IFERROR(VLOOKUP(A8,[4]Sheet1!$A$3:$D$379,4,FALSE),0)","v":1653590.51},{"$f":"IFERROR(VLOOKUP(A8,'[5]2023-24 Final'!$B$19:$S$156,18,FALSE),0)","v":83056},0.99048277512984839,{"$f":"_xlfn.IFS(H8=0%,0,'other funds ftr 2023'!H8<Assumptions!$E$57,Assumptions!$B$57,'other funds ftr 2023'!H8<Assumptions!$E$58,Assumptions!$B$58,'other funds ftr 2023'!H8<=Assumptions!$E$59,Assumptions!$B$59,'other funds ftr 2023'!H8<=Assumptions!$E$60,Assumptions!$B$60)","v":0.95}]
["27403","BETHEL",{"$f":"IFERROR(VLOOKUP(A9,'[2]Allocations 2023-24'!$B$9:$AC$326,20,FALSE),0)","v":206337},{"$f":"IFERROR(VLOOKUP(A9,'[3]State Reservations'!$C$4:$AE$328,29,FALSE),0)","v":4319027.8985339506},{"$f":"IFERROR(VLOOKUP(A9,[4]Sheet1!$A$3:$D$379,3,FALSE),0)","v":10244625.859999999},{"$f":"IFERROR(VLOOKUP(A9,[4]Sheet1!$A$3:$D$379,4,FALSE),0)","v":2812213.1},{"$f":"IFERROR(VLOOKUP(A9,'[5]2023-24 Final'!$B$19:$S$156,18,FALSE),0)","v":0},0,{"$f":"_xlfn.IFS(H9=0%,0,'other funds ftr 2023'!H9<Assumptions!$E$57,Assumptions!$B$57,'other funds ftr 2023'!H9<Assumptions!$E$58,Assumptions!$B$58,'other funds ftr 2023'!H9<=Assumptions!$E$59,Assumptions!$B$59,'other funds ftr 2023'!H9<=Assumptions!$E$60,Assumptions!$B$60)","v":0}]
["18100","BREMERTON",{"$f":"IFERROR(VLOOKUP(A10,'[2]Allocations 2023-24'!$B$9:$AC$326,20,FALSE),0)","v":71170},{"$f":"IFERROR(VLOOKUP(A10,'[3]State Reservations'!$C$4:$AE$328,29,FALSE),0)","v":1594584.509282483},{"$f":"IFERROR(VLOOKUP(A10,[4]Sheet1!$A$3:$D$379,3,FALSE),0)","v":3523524.54},{"$f":"IFERROR(VLOOKUP(A10,[4]Sheet1!$A$3:$D$379,4,FALSE),0)","v":1003811.54},{"$f":"IFERROR(VLOOKUP(A10,'[5]2023-24 Final'!$B$19:$S$156,18,FALSE),0)","v":34580},0.99444736205869488,{"$f":"_xlfn.IFS(H10=0%,0,'other funds ftr 2023'!H10<Assumptions!$E$57,Assumptions!$B$57,'other funds ftr 2023'!H10<Assumptions!$E$58,Assumptions!$B$58,'other funds ftr 2023'!H10<=Assumptions!$E$59,Assumptions!$B$59,'other funds ftr 2023'!H10<=Assumptions!$E$60,Assumptions!$B$60)","v":0.95}]
{"$rows_left_out":138}
{"sheet":"CCDDD","index":6,"n_rows":163,"n_cols":3,"rows_kept":163,"cut":false,"hidden":true,"merged":[]}
["14005","ABERDEEN",{"$f":"A1","v":"14005"}]
["29103","ANACORTES",{"$f":"A2","v":"29103"}]
["31016","ARLINGTON","31016"]
["17408","AUBURN","17408"]
["06119","BATTLE GROUND","06119"]
["17405","BELLEVUE","17405"]
["37501","BELLINGHAM","37501"]
["27403","BETHEL","27403"]
["37503","BLAINE","37503"]
["18100","BREMERTON","18100"]
{"$rows_left_out":154}
{"sheet":"2023-24 Final","index":7,"n_rows":164,"n_cols":26,"rows_kept":164,"cut":false,"hidden":true,"merged":[[1,3,1,6],[13,4,13,7],[14,4,14,5],[14,6,14,7],[14,8,14,9]]}
[null,null,null,null,null,null,null,null,null,"From Assumptions Page:"]
[null,null,null,"Constant Dollar Multipliers - Do Not Change Here",null,null,null,null,null,"Target Amounts",null,null,null,null,{"$f":"[5]Assumptions!C24","v":21091065}]
[null,null,null,0,null,2.0369691980863958E+66,397.87670409510707,"Use CTRL K",null,"Actual Amounts",null,null,null,null,{"$f":"O18","v":21091064}]
[null,null,null,null,null,null,null,null,null,"Difference",null,null,null,null,{"$f":"O3-O2","v":-1}]
[]
[null,null,null,null,null,null,null,null,null,{"$f":"O18","v":21091064}]
[null,null,null,null,null,null,null,"Put total here",null,{"$f":"[5]Assumptions!C24","v":21091065}]
[]
[]
[null,null,null,null,null,null,null,null,null,"Go to H9 & Control K to set dollar amount"]
{"$rows_left_out":154}