{"text_format":"1","workbook":"xlsx","n_sheets":7,"sheets":["District","Allocation 2025-26 Final","Allocation 2024-25 Final","25-26 Adjusted Formula counts","24-25 Adjusted Formula counts","Assumptions","CCDDD"],"not_rendered":{"charts":0,"images":0,"macros":1,"external_links":2,"defined_names":15,"comments":0,"pivot_tables":0},"unopened":[],"bounds":{"document_bytes":16777216,"sheet_cells":100000,"rows_first":2000,"rows_last":500,"rows_between":2000,"halvings":0,"cell_chars":16384,"cell_head_chars":4096},"cells_cut":0,"cells_raw":0,"read":"whole","date_system":"1900"}

{"sheet":"District","index":0,"n_rows":24,"n_cols":17,"rows_kept":24,"cut":false,"hidden":false,"merged":[[3,3,3,10],[4,3,4,6]]}
[]
[null,null,null,"2025-2026","2024-2025","2022-23","2021-22","2021-22","2020-21","2020-21","2019-20","2019-20","2018-19","2017-18","2016-17","2015-16","2014-15"]
[null,null,null,"Final","Final","Preliminary","Final","Preliminary","Final","Preliminary","Final","Preliminary","Final","2nd Revised","Revised"]
[null,null,"Select District Name","ABERDEEN"]
[null,null,"District Code (CCDDD)",{"$f":"VLOOKUP(D4,CCDDD!D:F,3,FALSE)","v":"14005"}]
[]
[null,null,"Eisenhower 2001-02 Allocations",{"$f":"VLOOKUP($D$5,'Allocation 2025-26 Final'!$A$7:$S$322,4,FALSE)","v":0},{"$f":"VLOOKUP($D$5,'Allocation 2024-25 Final'!$A$7:$S$322,4,FALSE)","v":0},{"$f":"VLOOKUP($D$5,'[1]Allocation 2022-23 P'!$A$7:$M$321,3,FALSE)","v":0},{"$f":"VLOOKUP($D$5,'[2]Allocation 2021-22 Final'!$A$7:$U$321,3,FALSE)","v":0},{"$f":"VLOOKUP($D$5,'[1]Allocation 2021-22 Preliminary'!$A$7:$M$321,3,FALSE)","v":0},{"$f":"IFERROR(VLOOKUP($D$5,'[1]Allocation 2020-21 Final'!$A$7:$M$317,3,FALSE),0)","v":0},{"$f":"IFERROR(VLOOKUP($D$5,'[1]Allocation 2020-21 Preliminary'!$A$7:$M$318,3,FALSE),0)","v":0},{"$f":"IFERROR(VLOOKUP($D$5,'[1]Allocation 2019-20 Final'!$A$7:$M$314,3,FALSE),0)","v":0},{"$f":"IFERROR(VLOOKUP($D$5,'[1]Allocation 2019-20 Preliminary'!$A$7:$M$316,3,FALSE),0)","v":0},{"$f":"IFERROR(VLOOKUP($D$5,'[1]Allocation 2018-19 Final'!$A$7:$M$316,3,FALSE),0)","v":0},{"$f":"VLOOKUP($D$5,'[1]Allocation 2017-18 2ndRev_Final'!$A$7:$M$315,3,FALSE)","v":0},{"$f":"VLOOKUP($D$5,'[1]Allocation 2016-17 rev_Final'!$A$7:$M$314,3,FALSE)","v":24422},{"$f":"VLOOKUP($D$5,'[1]Allocation 2015-16 Final'!$A$7:$M$313,3,FALSE)","v":24422},{"$f":"VLOOKUP($D$5,'[1]Allocation 2014-15 Final'!$A$7:$M$304,3,FALSE)","v":24422}]
[null,null,"Class Size Reduction allocations 2001-02",{"$f":"VLOOKUP($D$5,'Allocation 2025-26 Final'!$A$7:$S$322,5,FALSE)","v":0},{"$f":"VLOOKUP($D$5,'Allocation 2024-25 Final'!$A$7:$S$322,5,FALSE)","v":0},{"$f":"VLOOKUP($D$5,'[1]Allocation 2022-23 P'!$A$7:$M$321,4,FALSE)","v":0},{"$f":"VLOOKUP($D$5,'[2]Allocation 2021-22 Final'!$A$7:$U$321,4,FALSE)","v":0},{"$f":"VLOOKUP($D$5,'[1]Allocation 2021-22 Preliminary'!$A$7:$M$321,4,FALSE)","v":0},{"$f":"IFERROR(VLOOKUP($D$5,'[1]Allocation 2020-21 Final'!$A$7:$M$317,4,FALSE),0)","v":0},{"$f":"IFERROR(VLOOKUP($D$5,'[1]Allocation 2020-21 Preliminary'!$A$7:$M$318,4,FALSE),0)","v":0},{"$f":"IFERROR(VLOOKUP($D$5,'[1]Allocation 2019-20 Final'!$A$7:$M$314,4,FALSE),0)","v":0},{"$f":"IFERROR(VLOOKUP($D$5,'[1]Allocation 2019-20 Preliminary'!$A$7:$M$316,4,FALSE),0)","v":0},{"$f":"IFERROR(VLOOKUP($D$5,'[1]Allocation 2018-19 Final'!$A$7:$M$316,4,FALSE),0)","v":0},{"$f":"VLOOKUP($D$5,'[1]Allocation 2017-18 2ndRev_Final'!$A$7:$M$315,4,FALSE)","v":0},{"$f":"VLOOKUP($D$5,'[1]Allocation 2016-17 rev_Final'!$A$7:$M$314,4,FALSE)","v":128290},{"$f":"VLOOKUP($D$5,'[1]Allocation 2015-16 Final'!$A$7:$M$313,4,FALSE)","v":128290},{"$f":"VLOOKUP($D$5,'[1]Allocation 2014-15 Final'!$A$7:$M$304,4,FALSE)","v":128290}]
[]
[null,null,"Census Population Ages 5-17",{"$f":"VLOOKUP($D$5,'Allocation 2025-26 Final'!$A$7:$S$322,6,FALSE)","v":3496},{"$f":"VLOOKUP($D$5,'Allocation 2024-25 Final'!$A$7:$S$322,6,FALSE)","v":3502},{"$f":"VLOOKUP($D$5,'[1]Allocation 2022-23 P'!$A$7:$M$321,5,FALSE)","v":3433},{"$f":"VLOOKUP($D$5,'[2]Allocation 2021-22 Final'!$A$7:$U$321,5,FALSE)","v":3402},{"$f":"VLOOKUP($D$5,'[1]Allocation 2021-22 Preliminary'!$A$7:$M$321,5,FALSE)","v":3384},{"$f":"IFERROR(VLOOKUP($D$5,'[1]Allocation 2020-21 Final'!$A$7:$M$317,5,FALSE),0)","v":3343},{"$f":"IFERROR(VLOOKUP($D$5,'[1]Allocation 2020-21 Preliminary'!$A$7:$M$318,5,FALSE),0)","v":3341},{"$f":"IFERROR(VLOOKUP($D$5,'[1]Allocation 2019-20 Final'!$A$7:$M$314,5,FALSE),0)","v":3269},{"$f":"IFERROR(VLOOKUP($D$5,'[1]Allocation 2019-20 Preliminary'!$A$7:$M$316,5,FALSE),0)","v":3269},{"$f":"IFERROR(VLOOKUP($D$5,'[1]Allocation 2018-19 Final'!$A$7:$M$315,5,FALSE),0)","v":3257},{"$f":"VLOOKUP($D$5,'[1]Allocation 2017-18 2ndRev_Final'!$A$7:$M$315,5,FALSE)","v":3229},{"$f":"VLOOKUP($D$5,'[1]Allocation 2016-17 rev_Final'!$A$7:$M$314,5,FALSE)","v":3239},{"$f":"VLOOKUP($D$5,'[1]Allocation 2015-16 Final'!$A$7:$M$313,5,FALSE)","v":3253},{"$f":"VLOOKUP($D$5,'[1]Allocation 2014-15 Final'!$A$7:$M$304,5,FALSE)","v":3252}]
{"$rows_left_out":15}
{"sheet":"Allocation 2025-26 Final","index":1,"n_rows":320,"n_cols":29,"rows_kept":320,"cut":false,"hidden":true,"merged":[[0,1,0,2],[1,10,1,11],[3,27,3,28]]}
[null,"2024-25",null,null,null,null,null,null,null,null,{"$f":"IF(K5=Assumptions!$C$22+J5,\"Rounding OK\",\"Rounding Error = \"&FIXED(K5-Assumptions!$C$22-J5,TRUE))","v":"Rounding OK"},null,null,null,null,null,null,{"$f":"R5","v":0},{"$f":"IF(S5=Assumptions!$C22+R5,\"Rounding OK\",\"Rounding Error = \"&FIXED(S5-(Assumptions!$C22+R5),TRUE))","v":"Rounding OK"}]
[null,"ESEA -- Title 2 Distributions ",null,null,null,null,null,null,null,null,"Allocation including private participation",null,null,null,null,null,null,null,"\\"]
[1,2,3,4,5,6,7,8,9,10,null,12,13,14,15,16,17,18,19,null,18]
["CCDDD","LEAID","District Name","Eisenhower 2001-02 Allocations","Class Size Reduction Allocations 2001-02","Census Population Ages 5-17","20%  based on Total Pop","Census Poverty Ages 5-17","80% based on Low Inc Pop","MOE","Total Final Allocation",null,"Alloc to non-Census LEA","Realloc Pool","Realloc","Final Alloc Before MOE","MOE","MOE Reduction","Final Alloc",null,"Prior Year Allocation",null,null,null,"Rank Order",null,null,"do not delete Y & Z"]
[null,null,"State Totals",{"$f":"SUM(D7:D306)","v":0},{"$f":"SUM(E7:E306)","v":0},{"$f":"SUM(F7:F320)","v":1226172},{"$f":"SUM(G7:G320)","v":6656531},{"$f":"SUM(H7:H320)","v":133531.99999999997},{"$f":"SUM(I7:I320)","v":26626119},null,{"$f":"SUM(K7:K320)","v":33282640},null,{"$f":"SUM(M7:M320)","v":0},{"$f":"SUM(N7:N320)","v":33282640},{"$f":"SUM(O7:O320)","v":0},{"$f":"SUM(P7:P320)","v":33282640},null,{"$f":"SUM(R7:R320)","v":0},{"$f":"SUM(S7:S320)","v":33282640},null,{"$f":"SUM(U7:U320)","v":32921865},null,{"$f":"SUM(W7:W318)","v":355449},{"$f":"MIN(X7:X314)","v":-0.84143556280587273},{"$f":"\"Lose =  \"& PROPER(VLOOKUP(X5,$X$7:$AC$314,6,FALSE))","v":"Lose =  Starbuck"},null,null,{"$f":"+B5","v":0},{"$f":"+C5","v":"State Totals"}]
[null,null,null,null,null,null,null,null,null,null,null,null,null,null,null,null,null,null,null,null,null,null,null,{"$f":"MAX(X7:X307)","v":1.8836477987421383},{"$f":"\"Win =  \"&PROPER(VLOOKUP(X6,$X$7:$AC$307,6,FALSE))","v":"Win =  Shaw Island"}]
[{"$f":"VLOOKUP(B7,CCDDD!$A$3:$B$319,2,FALSE)","v":"14005"},"5300030","ABERDEEN",0,0,{"$f":"VLOOKUP(B7,'25-26 Adjusted Formula counts'!$A$3:$L$320,8,FALSE)","v":3496},{"$f":"ROUND((F7/$F$5*Assumptions!$C$22*Assumptions!$C$30),0)","v":18979},{"$f":"VLOOKUP(B7,'25-26 Adjusted Formula counts'!$A$3:$L$320,9,FALSE)","v":690},{"$f":"ROUND((H7/$H$5*Assumptions!$C$22*Assumptions!$C$31),0)","v":137585},null,{"$f":"ROUNDDOWN(+I7+G7+E7+D7+J7,0)","v":156564},null,null,{"$f":"K7","v":156564},{"$f":"-ROUND(N7/$N$5*$M$5,0)","v":0},{"$f":"+K7+O7+M7","v":156564},null,{"$f":"-1*(P7*Q7)","v":0},{"$f":"+P7+R7","v":156564},null,{"$f":"IFERROR(VLOOKUP($A7, 'Allocation 2024-25 Final'!$A$7:$S$323,19,FALSE),0)","v":178831},null,{"$f":"+S7-U7","v":-22267},{"$f":"IF(U7>0,W7/U7,0)","v":-0.12451420614994045},{"$f":"RANK(W7,$W$7:$W$320,0)","v":302},{"$f":"(SUM(D7:E7)/S7)","v":0},null,{"$f":"+B7","v":"5300030"},"ABERDEEN"]
[{"$f":"VLOOKUP(B8,CCDDD!$A$3:$B$319,2,FALSE)","v":"21226"},"5300060","ADNA",0,0,{"$f":"VLOOKUP(B8,'25-26 Adjusted Formula counts'!$A$3:$L$320,8,FALSE)","v":748},{"$f":"ROUND((F8/$F$5*Assumptions!$C$22*Assumptions!$C$30),0)","v":4061},{"$f":"VLOOKUP(B8,'25-26 Adjusted Formula counts'!$A$3:$L$320,9,FALSE)","v":66},{"$f":"ROUND((H8/$H$5*Assumptions!$C$22*Assumptions!$C$31),0)","v":13160},null,17221,null,null,17221,0,{"$f":"+K8+O8+M9","v":17221},null,0,17221,null,{"$f":"IFERROR(VLOOKUP($A8, 'Allocation 2024-25 Final'!$A$7:$S$323,19,FALSE),0)","v":11537},null,5684,0.49267573892693073,57,0,null,"5300060","ADNA"]
[{"$f":"VLOOKUP(B9,CCDDD!$A$3:$B$319,2,FALSE)","v":"22017"},"5300090","ALMIRA",0,0,{"$f":"VLOOKUP(B9,'25-26 Adjusted Formula counts'!$A$3:$L$320,8,FALSE)","v":99},{"$f":"ROUND((F9/$F$5*Assumptions!$C$22*Assumptions!$C$30),0)","v":537},{"$f":"VLOOKUP(B9,'25-26 Adjusted Formula counts'!$A$3:$L$320,9,FALSE)","v":18},{"$f":"ROUND((H9/$H$5*Assumptions!$C$22*Assumptions!$C$31),0)","v":3589},null,4126,null,null,4126,0,{"$f":"+K9+O9+M10","v":4126},null,0,4126,null,{"$f":"IFERROR(VLOOKUP($A9, 'Allocation 2024-25 Final'!$A$7:$S$323,19,FALSE),0)","v":1722},null,2404,1.3960511033681766,90,0,null,"5300090","ALMIRA"]
[{"$f":"VLOOKUP(B10,CCDDD!$A$3:$B$319,2,FALSE)","v":"29103"},"5300150","ANACORTES",0,0,{"$f":"VLOOKUP(B10,'25-26 Adjusted Formula counts'!$A$3:$L$320,8,FALSE)","v":2787},{"$f":"ROUND((F10/$F$5*Assumptions!$C$22*Assumptions!$C$30),0)","v":15130},{"$f":"VLOOKUP(B10,'25-26 Adjusted Formula counts'!$A$3:$L$320,9,FALSE)","v":225},{"$f":"ROUND((H10/$H$5*Assumptions!$C$22*Assumptions!$C$31),0)","v":44865},null,59995,null,null,59995,0,{"$f":"+K10+O10+M11","v":59995},null,0,59995,null,{"$f":"IFERROR(VLOOKUP($A10, 'Allocation 2024-25 Final'!$A$7:$S$323,19,FALSE),0)","v":65989},null,-5994,-9.0833320704965984E-2,260,0,null,"5300150","ANACORTES"]
{"$rows_left_out":311}
{"sheet":"Allocation 2024-25 Final","index":2,"n_rows":321,"n_cols":29,"rows_kept":321,"cut":false,"hidden":true,"merged":[[0,1,0,2],[1,10,1,11],[3,27,3,28]]}
[null,"2024-25",null,null,null,null,null,null,null,null,{"$f":"IF(K5=Assumptions!$D$22+J5,\"Rounding OK\",\"Rounding Error = \"&FIXED(K5-Assumptions!$D$22-J5,TRUE))","v":"Rounding OK"},null,null,null,null,null,null,{"$f":"R5","v":0},{"$f":"IF(S5=Assumptions!$D22+R5,\"Rounding OK\",\"Rounding Error = \"&FIXED(S5-(Assumptions!$D22+R5),TRUE))","v":"Rounding OK"}]
[null,"ESEA -- Title 2 Distributions ",null,null,null,null,null,null,null,null,"Allocation including private participation",null,null,null,null,null,null,null,"\\"]
[1,2,3,4,5,6,7,8,9,10,null,12,13,14,15,16,17,18,19,null,18]
["CCDDD","LEAID","District Name","Eisenhower 2001-02 Allocations","Class Size Reduction Allocations 2001-02","Census Population Ages 5-17","20%  based on Total Pop","Census Poverty Ages 5-17","80% based on Low Inc Pop","MOE","Total Final Allocation",null,"Alloc to non-Census LEA","Realloc Pool","Realloc","Final Alloc Before MOE","MOE","MOE Reduction","Final Alloc",null,"Prior Year Allocation",null,null,null,"Rank Order",null,null,"do not delete Y & Z"]
[null,null,"State Totals",{"$f":"SUM(D7:D307)","v":0},{"$f":"SUM(E7:E307)","v":0},{"$f":"SUM(F7:F321)","v":1219961.0000000002},{"$f":"SUM(G7:G321)","v":6585479},{"$f":"SUM(H7:H321)","v":132429.00000000003},{"$f":"SUM(I7:I321)","v":26341924},null,{"$f":"SUM(K7:K321)","v":32927405},null,{"$f":"SUM(M7:M321)","v":0},{"$f":"SUM(N7:N321)","v":32927405},{"$f":"SUM(O7:O321)","v":0},{"$f":"SUM(P7:P321)","v":32927405},null,{"$f":"SUM(R7:R321)","v":0},{"$f":"SUM(S7:S321)","v":32927405},null,{"$f":"SUM(U7:U321)","v":0},null,{"$f":"SUM(W7:W319)","v":32914512},{"$f":"MIN(X7:X315)","v":0},{"$f":"\"Lose =  \"& PROPER(VLOOKUP(X5,$X$7:$AC$315,6,FALSE))","v":"Lose =  Aberdeen"},null,null,{"$f":"+B5","v":0},{"$f":"+C5","v":"State Totals"}]
[null,null,null,null,null,null,null,null,null,null,null,null,null,null,null,null,null,null,null,null,null,null,null,{"$f":"MAX(X7:X308)","v":0},{"$f":"\"Win =  \"&PROPER(VLOOKUP(X6,$X$7:$AC$308,6,FALSE))","v":"Win =  Aberdeen"}]
[{"$f":"VLOOKUP(B7,CCDDD!$A$3:$B$319,2,FALSE)","v":"14005"},"5300030","ABERDEEN",0,0,{"$f":"VLOOKUP(B7,'24-25 Adjusted Formula counts'!$A$3:$L$320,8,FALSE)","v":3502},{"$f":"ROUND((F7/$F$5*Assumptions!$D$22*Assumptions!$D$30),0)","v":18904},{"$f":"VLOOKUP(B7,'24-25 Adjusted Formula counts'!$A$3:$L$320,9,FALSE)","v":804},{"$f":"ROUND((H7/$H$5*Assumptions!$D$22*Assumptions!$D$31),0)","v":159927},null,{"$f":"ROUNDDOWN(+I7+G7+E7+D7+J7,0)","v":178831},null,null,{"$f":"K7","v":178831},{"$f":"-ROUND(N7/$N$5*$M$5,0)","v":0},{"$f":"+K7+O7+M7","v":178831},null,{"$f":"-1*(P7*Q7)","v":0},{"$f":"+P7+R7","v":178831},null,{"$f":"IFERROR(VLOOKUP($A7,#REF!, 19,FALSE),0)","v":0},null,{"$f":"+S7-U7","v":178831},{"$f":"IF(U7>0,W7/U7,0)","v":0},{"$f":"RANK(W7,$W$7:$W$321,0)","v":46},{"$f":"(SUM(D7:E7)/S7)","v":0},null,{"$f":"+B7","v":"5300030"},"ABERDEEN"]
[{"$f":"VLOOKUP(B8,CCDDD!$A$3:$B$319,2,FALSE)","v":"21226"},"5300060","ADNA",0,0,{"$f":"VLOOKUP(B8,'24-25 Adjusted Formula counts'!$A$3:$L$320,8,FALSE)","v":737},{"$f":"ROUND((F8/$F$5*Assumptions!$D$22*Assumptions!$D$30),0)","v":3978},{"$f":"VLOOKUP(B8,'24-25 Adjusted Formula counts'!$A$3:$L$320,9,FALSE)","v":38},{"$f":"ROUND((H8/$H$5*Assumptions!$D$22*Assumptions!$D$31),0)","v":7559},null,11537,null,null,11537,0,{"$f":"+K8+O8+M9","v":11537},null,0,11537,null,{"$f":"IFERROR(VLOOKUP($A8,#REF!, 19,FALSE),0)","v":0},null,11537,0,223,0,null,"5300060","ADNA"]
[{"$f":"VLOOKUP(B9,CCDDD!$A$3:$B$319,2,FALSE)","v":"22017"},"5300090","ALMIRA",0,0,{"$f":"VLOOKUP(B9,'24-25 Adjusted Formula counts'!$A$3:$L$320,8,FALSE)","v":98},{"$f":"ROUND((F9/$F$5*Assumptions!$D$22*Assumptions!$D$30),0)","v":529},{"$f":"VLOOKUP(B9,'24-25 Adjusted Formula counts'!$A$3:$L$320,9,FALSE)","v":6},{"$f":"ROUND((H9/$H$5*Assumptions!$D$22*Assumptions!$D$31),0)","v":1193},null,1722,null,null,1722,0,{"$f":"+K9+O9+M10","v":1722},null,0,1722,null,{"$f":"IFERROR(VLOOKUP($A9,#REF!, 19,FALSE),0)","v":0},null,1722,0,303,0,null,"5300090","ALMIRA"]
[{"$f":"VLOOKUP(B10,CCDDD!$A$3:$B$319,2,FALSE)","v":"29103"},"5300150","ANACORTES",0,0,{"$f":"VLOOKUP(B10,'24-25 Adjusted Formula counts'!$A$3:$L$320,8,FALSE)","v":2828},{"$f":"ROUND((F10/$F$5*Assumptions!$D$22*Assumptions!$D$30),0)","v":15266},{"$f":"VLOOKUP(B10,'24-25 Adjusted Formula counts'!$A$3:$L$320,9,FALSE)","v":255},{"$f":"ROUND((H10/$H$5*Assumptions!$D$22*Assumptions!$D$31),0)","v":50723},null,65989,null,null,65989,0,{"$f":"+K10+O10+M11","v":65989},null,0,65989,null,{"$f":"IFERROR(VLOOKUP($A10,#REF!, 19,FALSE),0)","v":0},null,65989,0,103,0,null,"5300150","ANACORTES"]
{"$rows_left_out":312}
{"sheet":"25-26 Adjusted Formula counts","index":3,"n_rows":317,"n_cols":14,"rows_kept":317,"cut":false,"hidden":true,"merged":[]}
["Source: S:\\Apportionment_NEW\\Federal Funding & Allocations\\Federal progran allocation\\25-26\\final\\Title I-A 25-26 final.xlsx, initial adjusted formula counts"]
["LEAID","LEANAME","SendingLEAid","NEG. adj","Adj DEL.","Adj Foster","Adj TANF","Adj - 5-17 pop","Adj poverty","Adj Total formula count","Total Formula Count DOE","Adj poverty percentage"]
["5300030","Aberdeen School District",null,0,null,14,0,3496,690,704,704,0.20137299771167,null,{"$f":"VLOOKUP(A3, 'Allocation 2024-25 Final'!$B$7:$C$321,2,FALSE)","v":"ABERDEEN"}]
["5300060","Adna School District",null,0,null,3,0,748,66,69,69,9.22459893048128E-2,null,{"$f":"VLOOKUP(A4, 'Allocation 2024-25 Final'!$B$7:$C$321,2,FALSE)","v":"ADNA"}]
["5300090","Almira School District",null,0,null,0,0,99,18,18,18,0.18181818181818199,null,{"$f":"VLOOKUP(A5, 'Allocation 2024-25 Final'!$B$7:$C$321,2,FALSE)","v":"ALMIRA"}]
["5300150","Anacortes School District",null,0,null,8,0,2787,225,233,233,8.3602439899533601E-2,null,{"$f":"VLOOKUP(A6, 'Allocation 2024-25 Final'!$B$7:$C$321,2,FALSE)","v":"ANACORTES"}]
["5300240","Arlington School District",null,0,null,10,0,5958,533,543,543,9.1137965760322195E-2,null,{"$f":"VLOOKUP(A7, 'Allocation 2024-25 Final'!$B$7:$C$321,2,FALSE)","v":"ARLINGTON"}]
["5300280","Asotin-Anatone School District",null,0,null,0,0,489,28,28,28,5.72597137014315E-2,null,{"$f":"VLOOKUP(A8, 'Allocation 2024-25 Final'!$B$7:$C$321,2,FALSE)","v":"ASOTIN-ANATONE"}]
["5300300","Auburn School District",null,0,null,41,0,18383,2769,2810,2810,0.152858619376598,null,{"$f":"VLOOKUP(A9, 'Allocation 2024-25 Final'!$B$7:$C$321,2,FALSE)","v":"AUBURN"}]
["5300330","Bainbridge Island School District",null,0,null,0,0,3972,150,150,150,3.7764350453172203E-2,null,{"$f":"VLOOKUP(A10, 'Allocation 2024-25 Final'!$B$7:$C$321,2,FALSE)","v":"BAINBRIDGE ISLAND"}]
{"$rows_left_out":308}
{"sheet":"24-25 Adjusted Formula counts","index":4,"n_rows":318,"n_cols":14,"rows_kept":318,"cut":false,"hidden":true,"merged":[]}
["Source: S:\\Apportionment_NEW\\Federal Funding & Allocations\\Federal progran allocation\\24-25\\Title I-A Final, initial adjusted formula counts"]
["LEAID","LEANAME","SendingLEAid","NEG. adj","Adj DEL.","Adj Foster","Adj TANF","Adj - 5-17 pop","Adj poverty","Adj Total formula count","Total Formula Count DOE","Adj poverty percentage"]
["5300030","Aberdeen School District",null,0,null,16,0,3502,804,820,820,0.23415191319246101,null,{"$f":"VLOOKUP(A3, 'Allocation 2024-25 Final'!$B$7:$C$321,2,FALSE)","v":"ABERDEEN"}]
["5300060","Adna School District",null,0,null,0,0,737,38,38,38,5.1560379918588903E-2,null,{"$f":"VLOOKUP(A4, 'Allocation 2024-25 Final'!$B$7:$C$321,2,FALSE)","v":"ADNA"}]
["5300090","Almira School District",null,0,null,0,0,98,6,6,6,6.1224489795918401E-2,null,{"$f":"VLOOKUP(A5, 'Allocation 2024-25 Final'!$B$7:$C$321,2,FALSE)","v":"ALMIRA"}]
["5300150","Anacortes School District",null,0,null,12,0,2828,255,267,267,9.4413012729844398E-2,null,{"$f":"VLOOKUP(A6, 'Allocation 2024-25 Final'!$B$7:$C$321,2,FALSE)","v":"ANACORTES"}]
["5300240","Arlington School District",null,0,null,9,0,5915,554,563,563,9.5181741335587502E-2,null,{"$f":"VLOOKUP(A7, 'Allocation 2024-25 Final'!$B$7:$C$321,2,FALSE)","v":"ARLINGTON"}]
["5300280","Asotin-Anatone School District",null,0,null,0,0,493,48,48,48,9.7363083164300201E-2,null,{"$f":"VLOOKUP(A8, 'Allocation 2024-25 Final'!$B$7:$C$321,2,FALSE)","v":"ASOTIN-ANATONE"}]
["5300300","Auburn School District",null,0,null,102,0,18293,2918,3020,3020,0.16509047176515601,null,{"$f":"VLOOKUP(A9, 'Allocation 2024-25 Final'!$B$7:$C$321,2,FALSE)","v":"AUBURN"}]
["5300330","Bainbridge Island School District",null,0,null,1,0,3975,141,142,142,3.57232704402516E-2,null,{"$f":"VLOOKUP(A10, 'Allocation 2024-25 Final'!$B$7:$C$321,2,FALSE)","v":"BAINBRIDGE ISLAND"}]
{"$rows_left_out":309}
{"sheet":"Assumptions","index":5,"n_rows":55,"n_cols":41,"rows_kept":55,"cut":false,"hidden":true,"merged":[[0,0,0,19],[29,27,29,28],[30,27,30,28],[45,1,45,27]]}
["Assumptions and Factors — Title II Part A 2021-22 Final"]
[null,"Caution: Yellow Cells below are inputs into the calculations in this model"]
[null,"Section 2121","Final","Final","Preliminary","Final","Preliminary","Final","Preliminary","Final","Preliminary","Final","Preliminary","Final","Preliminary","Final","Preliminary","2nd Revised Final","Revised Final","Final","Preliminary","2nd Revised Final","Revised Final","Final","Preliminary","Final","Preliminary","Final","Preliminary","Final","Final","Re-Revised 012312","Revised","Final"]
[null,"Funding","2025-2026","2024-2025","2024-2025","2023-2024","2023-2024","2022-23","2022-23","2021-22","2021-22","2020-21","2020-21","2019-20","2019-20","2018-19","2018-19","2017-18","2017-18","2017-18","2017-18","2016-17","2016-17","2016-17","2016-17","2015-16","2015-16","2014-15","2014-15","2013-14","2012-13","2011-12","2011-12","2011-12","2010-11","2009-10","2008-09","2007-08","2006-07"]
[null,"Total State Allocation",36117894,35732398,35590627,35045173,35061559,34114260,33959443,34561891,34516008,33915395,33876016,34072983,34010371,33288630,33249165,33521152,33328186,33521152,33504996,36716833,36578861,36716833,36710950,37458839,36365865,37535132,37524189,37529639,39717936,39836692,39465046,39890148,47747805,48045249,48000430,47422445,47044832]
[null,"State Admin - Higher Ed",0,0,0,0,0,0,0,0,0,0,0,0,0,0,0,0,0,0,0,-57834,-57834,-57834,-57834,-57834,-57834,-57834,null,-57834,{"$f":"AB51","v":-57834},-57834,-57834,-57834,{"$f":"ROUNDDOWN(AI8*AF54*-1,0)","v":-59087},{"$f":"ROUNDDOWN(AJ8*AG54*-1,0)","v":-59456}]
[null,"State Admin - OSPI",0,0,0,0,0,0,0,0,0,0,0,0,0,0,0,0,0,0,0,-309334,-307954,-309334,{"$f":"Y8-Y6","v":-309276},{"$f":"Z8-Z6","v":-316754},-317373,-317517,null,-317462,-339345,-340532,-336816,-341067,{"$f":"ROUNDUP(AI8*AF55*-1,0)","v":-418391},{"$f":"ROUNDUP(AJ8*AG55*-1,0)","v":-420996}]
["Note below","Total reserve for State Admin 1%",{"$f":"ROUND(-C5*0.01,0)","v":-361179},-357324,{"$f":"ROUND(-E5*0.01,0)","v":-355906},-350452,-350616,{"$f":"ROUND(-H5*0.01,0)","v":-341143},-339594,-345619,-345160,-339154,-338760,-340730,-340104,-332886,-332492,-335212,-333282,-335212,-335050,-367168,-365789,-367168,-367110,-374588,-363659,-375351,-375242,-375296,-397179,{"$f":"ROUND(-AF5*0.01,0)+1","v":-398366},{"$f":"ROUND(-AG5*0.01,0)","v":-394650},{"$f":"ROUND(-AH5*0.01,0)","v":-398901},{"$f":"ROUND(-AI5*0.01,0)","v":-477478},{"$f":"ROUND(-AJ5*0.01,0)","v":-480452},{"$f":"ROUND(-AK5*0.01,0)","v":-480004},-474224,-470448]
[null,"       Subtotal",{"$f":"+C8+C5","v":35756715},35375074,{"$f":"+E8+E5","v":35234721},34694721,34710943,{"$f":"+H8+H5","v":33773117},33619849,34216272,34170848,33576241,33537256,33732253,33670267,32955744,32916673,33185940,32994904,33185940,33169946,36349665,36213072,36349665,36343840,37084251,36002206,37159781,37148947,37154343,39320757,39438326,39070396,39491247,47270327,47564797,47520426,46948221,46574384]
[2.5000000000000001E-2,"Reserve for SAHE (Subgrants)",null,null,null,null,null,null,null,null,null,null,null,null,null,null,0,0,0,0,0,{"$f":"ROUND(-V9*$A10,0)","v":-908742},{"$f":"ROUND(-W9*$A10,0)","v":-905327},{"$f":"ROUND(-X9*$A10,0)","v":-908742},{"$f":"ROUND(-Y9*$A10,0)","v":-908596},-927106,{"$f":"ROUND(-AA9*$A10,0)","v":-900055},{"$f":"ROUND(-AB9*$A10,0)","v":-928995},{"$f":"ROUND(-AC9*$A10,0)","v":-928724},{"$f":"ROUND(-AD9*$A10,0)","v":-928859},-983019,{"$f":"ROUND(-AF9*$A10,0)","v":-985958},-976760,-987281,-1181758,-1189120,-1188011,-1173706,-1164360]
{"$rows_left_out":46}
{"sheet":"CCDDD","index":6,"n_rows":319,"n_cols":7,"rows_kept":319,"cut":false,"hidden":true,"merged":[]}
[]
["Fed Code","CCDDD","Fed Code","District","Fed Code"]
[{"$f":"C3","v":"5300030"},"14005","5300030","ABERDEEN",{"$f":"C3","v":"5300030"},{"$f":"B3","v":"14005"},{"$f":"TEXT(C3,\"0000000\")","v":"5300030"}]
[{"$f":"C4","v":"5300060"},"21226","5300060","ADNA",{"$f":"C4","v":"5300060"},{"$f":"B4","v":"21226"},{"$f":"TEXT(C4,\"0000000\")","v":"5300060"}]
["5300090","22017","5300090","ALMIRA","5300090","22017","5300090"]
["5300150","29103","5300150","ANACORTES","5300150","29103","5300150"]
["5300240","31016","5300240","ARLINGTON","5300240","31016","5300240"]
["5300280","02420","5300280","ASOTIN-ANATONE","5300280","02420","5300280"]
["5300300","17408","5300300","AUBURN","5300300","17408","5300300"]
["5300330","18303","5300330","BAINBRIDGE ISLAND","5300330","18303","5300330"]
{"$rows_left_out":309}