{"text_format":"1","workbook":"xlsx","n_sheets":8,"sheets":["District","2026-27 Final","Assumptions","Enrollment","Rural and Low Income 26-27","other funds ftr 2026","CCDDD","2025-26 Final"],"not_rendered":{"charts":0,"images":0,"macros":1,"external_links":6,"defined_names":127,"comments":1,"pivot_tables":0},"unopened":[],"bounds":{"document_bytes":16777216,"sheet_cells":100000,"rows_first":2000,"rows_last":500,"rows_between":2000,"halvings":0,"cell_chars":16384,"cell_head_chars":4096},"cells_cut":0,"cells_raw":0,"read":"whole","date_system":"1900"}

{"sheet":"District","index":0,"n_rows":83,"n_cols":32,"rows_kept":83,"cut":false,"hidden":false,"merged":[[27,14,28,15],[30,14,30,15],[30,16,30,17],[32,5,34,5],[1,6,1,9],[2,7,2,8],[16,2,19,2],[16,5,17,5],[18,5,19,5],[20,2,23,2],[20,5,21,5],[22,5,23,5],[2,20,2,21],[6,5,7,5],[8,5,9,5],[10,5,11,5],[12,2,15,2],[12,5,13,5],[14,5,15,5],[2,10,2,11],[2,12,2,13],[2,14,2,15],[2,16,2,17],[2,18,2,19]]}
[null,null,null,null,null,null,null,null,null,null,null,null,null,null,null,null,null,null,null,null,null,null,null,null,"Do Not",null,null,null,null,null,null,"Aberdeen"]
[null,null,null,null,null,"District Name","ABERDEEN",null,null,null,"<- Please select distrtict from this drop-down",null,null,null,null,null,null,null,null,null,null,null,null," <<- Please Select District From Drop Down","Change",null,null,null,null,null,null,"Brewster"]
[null,null,null,null,null,"CCDDD",{"$f":"VLOOKUP(G2,CCDDD!B:C,2,0)","v":"14005"},null,null,null,"2021-22",null,"2020-21",null,"2011-12",null,"2010-11",null,"2009-10",null,"2008-09",null,"2007-08",null,null,null,null,null,null,null,null,"Bridgeport"]
[null,null,null,null,null,null,null,null,null,null,null,null,null,null,null,null,null,null,null,null,null,"%%",null,null,null,null,null,null,null,null,null,"Burlington"]
[null,null,null,null,null,null,null,"Prelim 2025-2026","% of PY","Final 25-26","Final 2021-22","% of PY","Final 2020-21",null,"Prelim 2011-12","% of PY","Final 2010-11","% of PY","Final 2009-10","% of PY","Final 2008-09","of Prior Year","2007-08",null,null,null,null,null,null,null,null,"Cascade"]
[null,null,null,null,null,"Regular Allocation",null,null,null,null,null,null,null,null,null,null,null,null,null,null,null,null,null,null,null,null,null,null,null,null,null,"Cashmere"]
[null,2,null,null,null,"K-12 Migrant Students","Average Number",{"$f":"IFERROR(VLOOKUP($G$3,'2026-27 Final'!$B$19:$AA$162,4,0),0)","v":159},{"$f":"H7/J7","v":0.95209580838323349},{"$f":"IFERROR(VLOOKUP($G$3,'2025-26 Final'!$B$19:$AA$164,4,0),0)","v":167},338,{"$f":"IFERROR(K7/M7-1,0)","v":0.13043478260869557},299,null,{"$f":"VLOOKUP($G$2,#REF!,$B7,FALSE)","v":{"$error":"#REF!"}},{"$f":"IF(Q7=0,0,O7/Q7)","v":{"$error":"#REF!"}},{"$f":"VLOOKUP($G$2,#REF!,$B7,FALSE)","v":{"$error":"#REF!"}},{"$f":"IF(S7>0,Q7/S7,\"-\")","v":{"$error":"#REF!"}},{"$f":"VLOOKUP($G$2,#REF!,$B7,FALSE)","v":{"$error":"#REF!"}},{"$f":"IF(U7>0,S7/U7,\"-\")","v":{"$error":"#REF!"}},{"$f":"VLOOKUP($G$2,#REF!,$B7,FALSE)","v":{"$error":"#REF!"}},{"$f":"IF(W7>0,U7/W7,\"-\")","v":{"$error":"#REF!"}},{"$f":"VLOOKUP($G$2,#REF!,$B7,FALSE)","v":{"$error":"#REF!"}},null,1,3,null,null,null,null,null,"Centralia"]
[null,3,null,null,null,null,"Regular Dollars",{"$f":"IFERROR(VLOOKUP($G$3,'2026-27 Final'!$B$19:$AA$162,5,0),0)","v":78380},0.99927330214057142,{"$f":"IFERROR(VLOOKUP($G$3,'2025-26 Final'!$B$19:$AA$164,5,0),0)","v":78437},159039,0.3281029486676299,119749,null,{"$f":"VLOOKUP($G$2,#REF!,$B8,FALSE)","v":{"$error":"#REF!"}},{"$error":"#REF!"},{"$f":"VLOOKUP($G$2,#REF!,$B8,FALSE)","v":{"$error":"#REF!"}},{"$f":"IF(S8>0,Q8/S8,\"-\")","v":{"$error":"#REF!"}},{"$f":"VLOOKUP($G$2,#REF!,$B8,FALSE)","v":{"$error":"#REF!"}},{"$f":"IF(U8>0,S8/U8,\"-\")","v":{"$error":"#REF!"}},{"$f":"VLOOKUP($G$2,#REF!,$B8,FALSE)","v":{"$error":"#REF!"}},{"$error":"#REF!"},{"$f":"VLOOKUP($G$2,#REF!,$B8,FALSE)","v":{"$error":"#REF!"}},null,2,3,null,null,null,null,null,"College Place"]
[null,4,null,null,null,"Needs Support","Average Number",{"$f":"IFERROR(VLOOKUP($G$3,'2026-27 Final'!$B$19:$AA$162,6,0),0)","v":64},2.1333333333333333,{"$f":"IFERROR(VLOOKUP($G$3,'2025-26 Final'!$B$19:$AA$1646,6,0),0)","v":30},59,-1.6666666666666718E-2,60,null,{"$f":"VLOOKUP($G$2,#REF!,$B9,FALSE)","v":{"$error":"#REF!"}},{"$f":"IF(Q9=0,0,O9/Q9)","v":{"$error":"#REF!"}},{"$f":"VLOOKUP($G$2,#REF!,$B9,FALSE)","v":{"$error":"#REF!"}},{"$error":"#REF!"},{"$f":"VLOOKUP($G$2,#REF!,$B9,FALSE)","v":{"$error":"#REF!"}},{"$error":"#REF!"},{"$f":"VLOOKUP($G$2,#REF!,$B9,FALSE)","v":{"$error":"#REF!"}},{"$error":"#REF!"},{"$f":"VLOOKUP($G$2,#REF!,$B9,FALSE)","v":{"$error":"#REF!"}},null,1,4,null,null,null,null,null,"Columbia"]
[null,5,null,null,null,null,"Regular Dollars",{"$f":"IFERROR(VLOOKUP($G$3,'2026-27 Final'!$B$19:$AA$162,7,0),0)","v":7887},2.2387170025546408,{"$f":"IFERROR(VLOOKUP($G$3,'2025-26 Final'!$B$19:$AA$164,7,0),0)","v":3523},6940,0.15531879473947052,6007,null,{"$f":"VLOOKUP($G$2,#REF!,$B10,FALSE)","v":{"$error":"#REF!"}},{"$f":"IF(Q10=0,0,O10/Q10)","v":{"$error":"#REF!"}},{"$f":"VLOOKUP($G$2,#REF!,$B10,FALSE)","v":{"$error":"#REF!"}},{"$error":"#REF!"},{"$f":"VLOOKUP($G$2,#REF!,$B10,FALSE)","v":{"$error":"#REF!"}},{"$error":"#REF!"},{"$f":"VLOOKUP($G$2,#REF!,$B10,FALSE)","v":{"$error":"#REF!"}},{"$error":"#REF!"},{"$f":"VLOOKUP($G$2,#REF!,$B10,FALSE)","v":{"$error":"#REF!"}},null,2,4,null,null,null,null,null,"Conway"]
{"$rows_left_out":74}
{"sheet":"2026-27 Final","index":1,"n_rows":162,"n_cols":28,"rows_kept":162,"cut":false,"hidden":false,"merged":[[1,3,1,6],[13,4,13,7],[14,4,14,5],[14,6,14,7],[14,8,14,9]]}
[null,null,null,null,null,null,null,null,null,"From Assumptions Page:"]
[null,null,null,"Constant Dollar Multipliers - Do Not Change Here",null,null,null,null,null,"Target Amounts",null,null,null,null,{"$f":"Assumptions!C24","v":20923716}]
[null,null,null,0,null,2.0369691980863958E+66,492.95465446092186,"Use CTRL K",null,"Actual Amounts",null,null,null,null,{"$f":"O18","v":20923716}]
[null,null,null,null,null,null,null,null,null,"Difference",null,null,null,null,{"$f":"O3-O2","v":0}]
[]
[]
[null,null,null,null,null,null,null,"Put total here",null,{"$f":"Assumptions!C24","v":20923716}]
[]
[]
[null,null,null,null,null,null,null,null,null,"Go to H9 & Control K to set dollar amount"]
{"$rows_left_out":153}
{"sheet":"Assumptions","index":2,"n_rows":60,"n_cols":40,"rows_kept":60,"cut":false,"hidden":true,"merged":[[6,37,21,37]]}
["Assumptions and Factors — Title I Part C Migrant - Final"]
[null,"Caution: Yellow Cells below drive are inputs into the calculations in this model"]
[null,null,null,null,null,null,null,null,null,null,null,null,null,null,null,null,null,null,null,null,null,null,null,null,null,null,null,null,null,null,null,null,null,null,null,null,null,null,null,"Row Headings on Allocation Table"]
["Funding",null,"Final 2026-2027","Final 2025-26","Final 2024-25","Preliminary 2024-25","FINAL 2023-24","Preliminary 2023-24","Final 2022-23","Preliminary 2022-23","Final 2021-22","Preliminary 2021-22","Final 2020-21","Preliminary 2020-21","Final 2019-20","Preliminary 2019-20","Final 2018-19","Preliminary 2018-19","Final 2017-18","Preliminary 2017-18","2nd Rev Final 2016-17","Rev Final 2016-17","Final 2016-17","Final 2015-16","Preliminary 2015-16","Final 2014-15","Preliminary 2014-15","Revised Final 2013-14","Final 2013-14","Final 2012-13","Preliminary 2012-13","Final 2011-12","Preliminary \n2011-12","Final\n2010-11","Final 2009-10","Final 2008-09","Source: "]
[null,"Total State Allocation",35969845,36853035,37992820,"37,838,194",38616843,38616843,38126160,"38,168,234",36172055,36170767,33650164,32545772,29253692,28509499,27865765,26740196,24667573,24540413,14921087,14921087,14921087,14921087,14875015,14875015,14875015,14839257,14839257,15628872,15628872,15659257,15659257,15691456,14450894,15015291]
[null,"State Allocation under $14B rule",26457973,{"$f":"E6*0.97","v":27146359.859999999},27985938,27866779,28466965,28448427,29491607,29524149,29680217,29680217,28007581,32545800,23817704,23834846,21267203,21267203,13112612,13104377,13566765,13616032,13566765,14077428,14055099,14085411,14041918,14645076,14645076,14620622,14620622,14680941,14680941,14980942]
["General Admin","State Admin",{"$f":"ROUND(C6*0.01,0)","v":264580},271464,279859,{"$f":"ROUND(F6*0.01,0)","v":278668},{"$f":"ROUND(G6*0.01,0)","v":284670},284484,294916,295241,296802,296802,280076,325458,{"$f":"ROUND(O6*0.01,0)","v":238177},238348,212672,212672,131126,131044,135668,136160,135668,140774,140551,140854,140419,146451,{"$f":"ROUND(AC6*0.01,0)","v":146451},{"$f":"ROUND(AD6*0.01,0)","v":146206},{"$f":"ROUND(AE6*0.01,0)","v":146206},{"$f":"ROUND(AF6*0.01,0)","v":146809},{"$f":"ROUND(14680941*0.01,0)","v":146809},{"$f":"ROUND(14680942*0.01,0)","v":146809},{"$f":"ROUND(13563693*0.01,0)","v":135637},{"$f":"ROUND(14649429*0.01,0)","v":146494},0.01]
[null,"State Level Activities (Unallocated Balance)",{"$f":"C5-C7-C18-C24","v":12623358},12969750,13417269,{"$f":"F5-F7-F18-F24","v":13356610},{"$f":"G5-G7-G18-G24","v":15061378},15162254,14955548,14972053,13087588,13086382,13179990,{"$f":"N5-N7-N18-N24","v":12692851},10935689,11551691,11233633,10783406,9920983,12702535,3078585,3078093,4570694,2999662,2953813,3913523,2273028,14692806,14692806,15482666,15482666,15512448,15512448,15544647,14315257,536592]
[]
["Other Admin","Director salary"]
{"$rows_left_out":51}
{"sheet":"Enrollment","index":3,"n_rows":128,"n_cols":7,"rows_kept":128,"cut":false,"hidden":true,"merged":[]}
["CoDistNum","Title",null,"ESD","Students","Needs","Priority"]
["14005","ABERDEEN",null,189,159,64,41]
["31016","ARLINGTON",null,189,39,22,7]
["17408","AUBURN",null,189,23,9,6]
["06119","BATTLE GROUND",null,189,12,7,0]
["37501","BELLINGHAM",null,189,72,26,23]
["27403","BETHEL",null,189,10,6,0]
["18100","BREMERTON",null,189,30,24,1]
["24111","BREWSTER",null,171,224,69,58]
["09075","BRIDGEPORT",null,171,152,59,28]
{"$rows_left_out":119}
{"sheet":"Rural and Low Income 26-27","index":4,"n_rows":132,"n_cols":2,"rows_kept":132,"cut":false,"hidden":true,"merged":[]}
["CoDis","Local Education Agency (LEA)"]
["14005","Aberdeen School District"]
["22017","Almira School District"]
["01122","Benge School District"]
["20203","Bickleton School District"]
["21234","Boistfort School District"]
["24111","Brewster School District"]
["16046","Brinnon School District"]
["05401","Cape Flattery School District"]
["27019","Carbonado School District"]
{"$rows_left_out":123}
{"sheet":"other funds ftr 2026","index":5,"n_rows":147,"n_cols":9,"rows_kept":147,"cut":false,"hidden":true,"merged":[]}
["CCDDD","Migrant Districts","Title III 25-26","Title I A 25-26","LAP 25-26","TBIP 25-6","Title I C 25-26","other funds as % of Revs","\"Other Funds\" Factor"]
["14005","ABERDEEN",{"$f":"IFERROR(VLOOKUP(A2,'[2]Allocations 2025-26'!$B$9:$U$328,20,FALSE),0)","v":58975},{"$f":"IFERROR(VLOOKUP(A2,'[3]State Reservations'!$C$4:$AE$318,29,FALSE),0)","v":1649858.2992989861},{"$f":"IFERROR(VLOOKUP(A2,[4]Sheet1!$A$2:$D$379,3,FALSE),0)","v":2481694.17},{"$f":"IFERROR(VLOOKUP(A2,[4]Sheet1!$A$2:$D$379,4,FALSE),0)","v":812981.4},{"$f":"IFERROR(VLOOKUP(A2,'[5]2025-26 FINAL Y'!$B$19:$S$164,18,FALSE),0)","v":114450},{"$f":"IF(G2=0,0,(SUM(C2:F2)/SUM(C2:G2)))","v":0.97763756940553992},{"$f":"_xlfn.IFS(H2=0%,0,'other funds ftr 2026'!H2<Assumptions!$D$57,Assumptions!$B$57,'other funds ftr 2026'!H2<Assumptions!$D$58,Assumptions!$B$58,'other funds ftr 2026'!H2<=Assumptions!$D$59,Assumptions!$B$59,'other funds ftr 2026'!H2<=Assumptions!$D$60,Assumptions!$B$60)","v":1}]
["29103","ANACORTES",{"$f":"IFERROR(VLOOKUP(A3,'[2]Allocations 2025-26'!$B$9:$U$328,20,FALSE),0)","v":0},{"$f":"IFERROR(VLOOKUP(A3,'[3]State Reservations'!$C$4:$AE$318,29,FALSE),0)","v":429328.07278687676},{"$f":"IFERROR(VLOOKUP(A3,[4]Sheet1!$A$2:$D$379,3,FALSE),0)","v":656967.99},{"$f":"IFERROR(VLOOKUP(A3,[4]Sheet1!$A$2:$D$379,4,FALSE),0)","v":102841.56},{"$f":"IFERROR(VLOOKUP(A3,'[5]2025-26 FINAL Y'!$B$19:$S$164,18,FALSE),0)","v":0},0,{"$f":"_xlfn.IFS(H3=0%,0,'other funds ftr 2026'!H3<Assumptions!$D$57,Assumptions!$B$57,'other funds ftr 2026'!H3<Assumptions!$D$58,Assumptions!$B$58,'other funds ftr 2026'!H3<=Assumptions!$D$59,Assumptions!$B$59,'other funds ftr 2026'!H3<=Assumptions!$D$60,Assumptions!$B$60)","v":0}]
["31016","ARLINGTON",{"$f":"IFERROR(VLOOKUP(A4,'[2]Allocations 2025-26'!$B$9:$U$328,20,FALSE),0)","v":45388},{"$f":"IFERROR(VLOOKUP(A4,'[3]State Reservations'!$C$4:$AE$318,29,FALSE),0)","v":904355.65407184849},{"$f":"IFERROR(VLOOKUP(A4,[4]Sheet1!$A$2:$D$379,3,FALSE),0)","v":1793124.34},{"$f":"IFERROR(VLOOKUP(A4,[4]Sheet1!$A$2:$D$379,4,FALSE),0)","v":733644.45},{"$f":"IFERROR(VLOOKUP(A4,'[5]2025-26 FINAL Y'!$B$19:$S$164,18,FALSE),0)","v":0},0,{"$f":"_xlfn.IFS(H4=0%,0,'other funds ftr 2026'!H4<Assumptions!$D$57,Assumptions!$B$57,'other funds ftr 2026'!H4<Assumptions!$D$58,Assumptions!$B$58,'other funds ftr 2026'!H4<=Assumptions!$D$59,Assumptions!$B$59,'other funds ftr 2026'!H4<=Assumptions!$D$60,Assumptions!$B$60)","v":0}]
["17408","AUBURN",{"$f":"IFERROR(VLOOKUP(A5,'[2]Allocations 2025-26'!$B$9:$U$328,20,FALSE),0)","v":646948},{"$f":"IFERROR(VLOOKUP(A5,'[3]State Reservations'!$C$4:$AE$318,29,FALSE),0)","v":6638689.9105551178},{"$f":"IFERROR(VLOOKUP(A5,[4]Sheet1!$A$2:$D$379,3,FALSE),0)","v":12302934.41},{"$f":"IFERROR(VLOOKUP(A5,[4]Sheet1!$A$2:$D$379,4,FALSE),0)","v":10442721.74},{"$f":"IFERROR(VLOOKUP(A5,'[5]2025-26 FINAL Y'!$B$19:$S$164,18,FALSE),0)","v":0},0,{"$f":"_xlfn.IFS(H5=0%,0,'other funds ftr 2026'!H5<Assumptions!$D$57,Assumptions!$B$57,'other funds ftr 2026'!H5<Assumptions!$D$58,Assumptions!$B$58,'other funds ftr 2026'!H5<=Assumptions!$D$59,Assumptions!$B$59,'other funds ftr 2026'!H5<=Assumptions!$D$60,Assumptions!$B$60)","v":0}]
["06119","BATTLE GROUND",{"$f":"IFERROR(VLOOKUP(A6,'[2]Allocations 2025-26'!$B$9:$U$328,20,FALSE),0)","v":170190},{"$f":"IFERROR(VLOOKUP(A6,'[3]State Reservations'!$C$4:$AE$318,29,FALSE),0)","v":1760787.1228792623},{"$f":"IFERROR(VLOOKUP(A6,[4]Sheet1!$A$2:$D$379,3,FALSE),0)","v":4086442.05},{"$f":"IFERROR(VLOOKUP(A6,[4]Sheet1!$A$2:$D$379,4,FALSE),0)","v":2724716.89},{"$f":"IFERROR(VLOOKUP(A6,'[5]2025-26 FINAL Y'!$B$19:$S$164,18,FALSE),0)","v":0},0,{"$f":"_xlfn.IFS(H6=0%,0,'other funds ftr 2026'!H6<Assumptions!$D$57,Assumptions!$B$57,'other funds ftr 2026'!H6<Assumptions!$D$58,Assumptions!$B$58,'other funds ftr 2026'!H6<=Assumptions!$D$59,Assumptions!$B$59,'other funds ftr 2026'!H6<=Assumptions!$D$60,Assumptions!$B$60)","v":0}]
["17405","BELLEVUE",{"$f":"IFERROR(VLOOKUP(A7,'[2]Allocations 2025-26'!$B$9:$U$328,20,FALSE),0)","v":459931},{"$f":"IFERROR(VLOOKUP(A7,'[3]State Reservations'!$C$4:$AE$318,29,FALSE),0)","v":2791887.8071668651},{"$f":"IFERROR(VLOOKUP(A7,[4]Sheet1!$A$2:$D$379,3,FALSE),0)","v":4272150.97},{"$f":"IFERROR(VLOOKUP(A7,[4]Sheet1!$A$2:$D$379,4,FALSE),0)","v":8426767.9499999993},{"$f":"IFERROR(VLOOKUP(A7,'[5]2025-26 FINAL Y'!$B$19:$S$164,18,FALSE),0)","v":0},0,{"$f":"_xlfn.IFS(H7=0%,0,'other funds ftr 2026'!H7<Assumptions!$D$57,Assumptions!$B$57,'other funds ftr 2026'!H7<Assumptions!$D$58,Assumptions!$B$58,'other funds ftr 2026'!H7<=Assumptions!$D$59,Assumptions!$B$59,'other funds ftr 2026'!H7<=Assumptions!$D$60,Assumptions!$B$60)","v":0}]
["37501","BELLINGHAM",{"$f":"IFERROR(VLOOKUP(A8,'[2]Allocations 2025-26'!$B$9:$U$328,20,FALSE),0)","v":125543},{"$f":"IFERROR(VLOOKUP(A8,'[3]State Reservations'!$C$4:$AE$318,29,FALSE),0)","v":2786322.4371478916},{"$f":"IFERROR(VLOOKUP(A8,[4]Sheet1!$A$2:$D$379,3,FALSE),0)","v":3778653.04},{"$f":"IFERROR(VLOOKUP(A8,[4]Sheet1!$A$2:$D$379,4,FALSE),0)","v":2014700.12},{"$f":"IFERROR(VLOOKUP(A8,'[5]2025-26 FINAL Y'!$B$19:$S$164,18,FALSE),0)","v":0},0,{"$f":"_xlfn.IFS(H8=0%,0,'other funds ftr 2026'!H8<Assumptions!$D$57,Assumptions!$B$57,'other funds ftr 2026'!H8<Assumptions!$D$58,Assumptions!$B$58,'other funds ftr 2026'!H8<=Assumptions!$D$59,Assumptions!$B$59,'other funds ftr 2026'!H8<=Assumptions!$D$60,Assumptions!$B$60)","v":0}]
["27403","BETHEL",{"$f":"IFERROR(VLOOKUP(A9,'[2]Allocations 2025-26'!$B$9:$U$328,20,FALSE),0)","v":214679},{"$f":"IFERROR(VLOOKUP(A9,'[3]State Reservations'!$C$4:$AE$318,29,FALSE),0)","v":5025516.4445441952},{"$f":"IFERROR(VLOOKUP(A9,[4]Sheet1!$A$2:$D$379,3,FALSE),0)","v":11728617.300000001},{"$f":"IFERROR(VLOOKUP(A9,[4]Sheet1!$A$2:$D$379,4,FALSE),0)","v":3401726.02},{"$f":"IFERROR(VLOOKUP(A9,'[5]2025-26 FINAL Y'!$B$19:$S$164,18,FALSE),0)","v":0},0,{"$f":"_xlfn.IFS(H9=0%,0,'other funds ftr 2026'!H9<Assumptions!$D$57,Assumptions!$B$57,'other funds ftr 2026'!H9<Assumptions!$D$58,Assumptions!$B$58,'other funds ftr 2026'!H9<=Assumptions!$D$59,Assumptions!$B$59,'other funds ftr 2026'!H9<=Assumptions!$D$60,Assumptions!$B$60)","v":0}]
["18100","BREMERTON",{"$f":"IFERROR(VLOOKUP(A10,'[2]Allocations 2025-26'!$B$9:$U$328,20,FALSE),0)","v":77110},{"$f":"IFERROR(VLOOKUP(A10,'[3]State Reservations'!$C$4:$AE$318,29,FALSE),0)","v":1804455.1491919421},{"$f":"IFERROR(VLOOKUP(A10,[4]Sheet1!$A$2:$D$379,3,FALSE),0)","v":3714248.41},{"$f":"IFERROR(VLOOKUP(A10,[4]Sheet1!$A$2:$D$379,4,FALSE),0)","v":1259908.1599999999},{"$f":"IFERROR(VLOOKUP(A10,'[5]2025-26 FINAL Y'!$B$19:$S$164,18,FALSE),0)","v":32349},0.99530361964637393,{"$f":"_xlfn.IFS(H10=0%,0,'other funds ftr 2026'!H10<Assumptions!$D$57,Assumptions!$B$57,'other funds ftr 2026'!H10<Assumptions!$D$58,Assumptions!$B$58,'other funds ftr 2026'!H10<=Assumptions!$D$59,Assumptions!$B$59,'other funds ftr 2026'!H10<=Assumptions!$D$60,Assumptions!$B$60)","v":0.95}]
{"$rows_left_out":138}
{"sheet":"CCDDD","index":6,"n_rows":133,"n_cols":3,"rows_kept":133,"cut":false,"hidden":true,"merged":[]}
["CO_DIST_NUM","DIST_TITLE",{"$f":"A1","v":"CO_DIST_NUM"}]
["14005","ABERDEEN",{"$f":"A2","v":"14005"}]
["29103","ANACORTES","29103"]
["31016","ARLINGTON","31016"]
["17408","AUBURN","17408"]
["06119","BATTLE GROUND","06119"]
["37501","BELLINGHAM","37501"]
["27403","BETHEL","27403"]
["18100","BREMERTON","18100"]
["24111","BREWSTER","24111"]
{"$rows_left_out":124}
{"sheet":"2025-26 Final","index":7,"n_rows":164,"n_cols":27,"rows_kept":164,"cut":false,"hidden":true,"merged":[[1,3,1,6],[13,4,13,7],[14,4,14,5],[14,6,14,7],[14,8,14,9]]}
[null,null,null,null,null,null,null,null,null,"From Assumptions Page:"]
[null,null,null,"Constant Dollar Multipliers - Do Not Change Here",null,null,null,null,null,"Target Amounts",null,null,null,null,{"$f":"[5]Assumptions!C24","v":21400639}]
[null,null,null,0,null,2.0369691980863958E+66,469.68052425660392,"Use CTRL K",null,"Actual Amounts",null,null,null,null,{"$f":"O18","v":21400639}]
[null,null,null,null,null,null,null,null,null,"Difference",null,null,null,null,{"$f":"O3-O2","v":0}]
[]
[null,null,null,null,null,null,null,null,null,22016123]
[null,null,null,null,null,null,null,"Put total here",null,{"$f":"[5]Assumptions!C24","v":21400639}]
[]
[]
[null,null,null,null,null,null,null,null,null,"Go to H9 & Control K to set dollar amount"]
{"$rows_left_out":154}